C:\Users\mikes\Documents\Cours-L3\Ntiers\td-jfx-exercice1\td-jfx-exercice1\src\main\java\facadeCreaFilm\FacadeScreen.java
C:\Users\mikes\Documents\Cours-L3\Ntiers\td-jfx-exercice1\td-jfx-exercice1\src\main\java\controleur\Controleur.java
C:\Users\mikes\Documents\Cours-L3\Ntiers\td-jfx-exercice1\td-jfx-exercice1\src\main\java\facadeCreaFilm\FacadeScreenImpl.java
C:\Users\mikes\Documents\Cours-L3\Ntiers\td-jfx-exercice1\td-jfx-exercice1\src\main\java\vues\Menu.java
C:\Users\mikes\Documents\Cours-L3\Ntiers\td-jfx-exercice1\td-jfx-exercice1\src\main\java\vues\Ajout.java
C:\Users\mikes\Documents\Cours-L3\Ntiers\td-jfx-exercice1\td-jfx-exercice1\src\main\java\facadeCreaFilm\GenreNotFoundException.java
C:\Users\mikes\Documents\Cours-L3\Ntiers\td-jfx-exercice1\td-jfx-exercice1\src\main\java\facadeCreaFilm\NomFilmDejaExistantException.java
C:\Users\mikes\Documents\Cours-L3\Ntiers\td-jfx-exercice1\td-jfx-exercice1\src\main\java\modeleCreaFilm\GenreFilm.java
C:\Users\mikes\Documents\Cours-L3\Ntiers\td-jfx-exercice1\td-jfx-exercice1\src\main\java\vues\VueInteractive.java
C:\Users\mikes\Documents\Cours-L3\Ntiers\td-jfx-exercice1\td-jfx-exercice1\src\main\java\modeleCreaFilm\Film.java
C:\Users\mikes\Documents\Cours-L3\Ntiers\td-jfx-exercice1\td-jfx-exercice1\src\main\java\pnt\MonApplication.java
C:\Users\mikes\Documents\Cours-L3\Ntiers\td-jfx-exercice1\td-jfx-exercice1\src\main\java\vues\TousLesFilms.java
C:\Users\mikes\Documents\Cours-L3\Ntiers\td-jfx-exercice1\td-jfx-exercice1\src\main\java\module-info.java
