NationID,Pollutant,BaseCost,BaseYear
"001","CO",9.5900000000000000e+02,1994
"001","NO2",6.7520000000000000e+03,1994
"001","O3",6.7520000000000000e+03,1994
"001","PM10",4.5080000000000000e+03,1994
"001","SO2",1.6530000000000000e+03,1994
"230","CO",2.3000000000000000e+01,2011
"230","NO2",6.7300000000000000e+02,2011
"230","PM10",1.8480000000000001e+02,2011
"230","SO2",4.7119999999999999e+02,2011
"001","PM2.5",4.5080000000000000e+03,1994
"230","O3",6.7300000000000000e+02,2011
"230","PM2.5",1.8480000000000001e+02,2011
"002","CO",9.3300000000000000e+02,1994
"002","NO2",6.5680000000000000e+03,1994
"002","O3",6.5680000000000000e+03,1994
"002","PM10",4.3850000000000000e+03,1994
"002","PM2.5",4.3850000000000000e+03,1994
"002","SO2",1.6080000000000000e+03,1994
