StateLatID,MonthID,MonthName,OzoneVal
"0000",1,,2.3999999999999999e-01
"0000",2,,2.6000000000000001e-01
"0000",3,,2.6000000000000001e-01
"0000",4,,2.7000000000000002e-01
"0000",5,,2.8000000000000003e-01
"0000",6,,2.7000000000000002e-01
"0000",7,,2.6000000000000001e-01
"0000",8,,2.6000000000000001e-01
"0000",9,,2.6000000000000001e-01
"0000",10,,2.5000000000000000e-01
"0000",11,,2.5000000000000000e-01
"0000",12,,2.5000000000000000e-01
"0100",1,,2.9999999999999999e-01
"0100",2,,3.1000000000000000e-01
"0100",3,,3.2000000000000001e-01
"0100",4,,3.3000000000000002e-01
"0100",5,,3.3000000000000002e-01
"0100",6,,3.3000000000000002e-01
"0100",7,,3.2000000000000001e-01
"0100",8,,3.1000000000000000e-01
"0100",9,,2.9999999999999999e-01
"0100",10,,2.8999999999999998e-01
"0100",11,,2.8999999999999998e-01
"0100",12,,2.9999999999999999e-01
"0255",1,,3.3000000000000002e-01
"0255",2,,3.8000000000000000e-01
"0255",3,,4.0000000000000002e-01
"0255",4,,3.9000000000000001e-01
"0255",5,,3.8000000000000000e-01
"0255",6,,3.5999999999999999e-01
"0255",7,,3.4000000000000002e-01
"0255",8,,3.2000000000000001e-01
"0255",9,,2.9999999999999999e-01
"0255",10,,2.8000000000000003e-01
"0255",11,,2.8999999999999998e-01
"0255",12,,2.9999999999999999e-01
"0260",1,,3.3000000000000002e-01
"0260",2,,3.9000000000000001e-01
"0260",3,,4.1999999999999998e-01
"0260",4,,4.0000000000000002e-01
"0260",5,,3.9000000000000001e-01
"0260",6,,3.5999999999999999e-01
"0260",7,,3.4000000000000002e-01
"0260",8,,3.2000000000000001e-01
"0260",9,,2.9999999999999999e-01
"0260",10,,2.8000000000000003e-01
"0260",11,,2.9999999999999999e-01
"0260",12,,3.1000000000000000e-01
"0265",1,,3.4000000000000002e-01
"0265",2,,4.0000000000000002e-01
"0265",3,,4.4000000000000000e-01
"0265",4,,4.1999999999999998e-01
"0265",5,,4.0999999999999998e-01
"0265",6,,3.7000000000000000e-01
"0265",7,,3.4999999999999998e-01
"0265",8,,3.3000000000000002e-01
"0265",9,,3.1000000000000000e-01
"0265",10,,2.8999999999999998e-01
"0265",11,,3.1000000000000000e-01
"0265",12,,3.2000000000000001e-01
"0270",1,,3.4999999999999998e-01
"0270",2,,4.0999999999999998e-01
"0270",3,,4.6000000000000002e-01
"0270",4,,4.2999999999999999e-01
"0270",5,,4.0999999999999998e-01
"0270",6,,3.7000000000000000e-01
"0270",7,,3.4999999999999998e-01
"0270",8,,3.2000000000000001e-01
"0270",9,,2.9999999999999999e-01
"0270",10,,2.8999999999999998e-01
"0270",11,,2.9999999999999999e-01
"0270",12,,3.2000000000000001e-01
"0400",1,,2.9999999999999999e-01
"0400",2,,3.2000000000000001e-01
"0400",3,,3.3000000000000002e-01
"0400",4,,3.4000000000000002e-01
"0400",5,,3.4000000000000002e-01
"0400",6,,3.3000000000000002e-01
"0400",7,,3.2000000000000001e-01
"0400",8,,3.1000000000000000e-01
"0400",9,,2.9999999999999999e-01
"0400",10,,2.8999999999999998e-01
"0400",11,,2.8999999999999998e-01
"0400",12,,2.9999999999999999e-01
"0500",1,,3.1000000000000000e-01
"0500",2,,3.3000000000000002e-01
"0500",3,,3.4000000000000002e-01
"0500",4,,3.4999999999999998e-01
"0500",5,,3.4999999999999998e-01
"0500",6,,3.4000000000000002e-01
"0500",7,,3.3000000000000002e-01
"0500",8,,3.2000000000000001e-01
"0500",9,,3.1000000000000000e-01
"0500",10,,2.9999999999999999e-01
"0500",11,,2.9999999999999999e-01
"0500",12,,3.1000000000000000e-01
"0635",1,,2.9999999999999999e-01
"0635",2,,3.2000000000000001e-01
"0635",3,,3.3000000000000002e-01
"0635",4,,3.4000000000000002e-01
"0635",5,,3.4000000000000002e-01
"0635",6,,3.3000000000000002e-01
"0635",7,,3.2000000000000001e-01
"0635",8,,3.1000000000000000e-01
"0635",9,,2.9999999999999999e-01
"0635",10,,2.8999999999999998e-01
"0635",11,,2.8999999999999998e-01
"0635",12,,2.9999999999999999e-01
"0640",1,,3.1000000000000000e-01
"0640",2,,3.3000000000000002e-01
"0640",3,,3.4000000000000002e-01
"0640",4,,3.4999999999999998e-01
"0640",5,,3.4999999999999998e-01
"0640",6,,3.4000000000000002e-01
"0640",7,,3.2000000000000001e-01
"0640",8,,3.1000000000000000e-01
"0640",9,,2.8999999999999998e-01
"0640",10,,2.8000000000000003e-01
"0640",11,,2.8999999999999998e-01
"0640",12,,2.9999999999999999e-01
"0800",1,,3.1000000000000000e-01
"0800",2,,3.3000000000000002e-01
"0800",3,,3.4000000000000002e-01
"0800",4,,3.4999999999999998e-01
"0800",5,,3.4999999999999998e-01
"0800",6,,3.4000000000000002e-01
"0800",7,,3.2000000000000001e-01
"0800",8,,3.1000000000000000e-01
"0800",9,,2.8999999999999998e-01
"0800",10,,2.8000000000000003e-01
"0800",11,,2.8999999999999998e-01
"0800",12,,2.9999999999999999e-01
"0900",1,,3.4999999999999998e-01
"0900",2,,3.7000000000000000e-01
"0900",3,,3.8000000000000000e-01
"0900",4,,3.9000000000000001e-01
"0900",5,,3.9000000000000001e-01
"0900",6,,3.8000000000000000e-01
"0900",7,,3.5999999999999999e-01
"0900",8,,3.4999999999999998e-01
"0900",9,,3.3000000000000002e-01
"0900",10,,3.2000000000000001e-01
"0900",11,,3.3000000000000002e-01
"0900",12,,3.4000000000000002e-01
"1000",1,,3.3000000000000002e-01
"1000",2,,3.4999999999999998e-01
"1000",3,,3.5999999999999999e-01
"1000",4,,3.7000000000000000e-01
"1000",5,,3.7000000000000000e-01
"1000",6,,3.5999999999999999e-01
"1000",7,,3.4000000000000002e-01
"1000",8,,3.3000000000000002e-01
"1000",9,,3.1000000000000000e-01
"1000",10,,2.9999999999999999e-01
"1000",11,,3.1000000000000000e-01
"1000",12,,3.2000000000000001e-01
"1100",1,,3.3000000000000002e-01
"1100",2,,3.4999999999999998e-01
"1100",3,,3.5999999999999999e-01
"1100",4,,3.7000000000000000e-01
"1100",5,,3.7000000000000000e-01
"1100",6,,3.5999999999999999e-01
"1100",7,,3.4000000000000002e-01
"1100",8,,3.3000000000000002e-01
"1100",9,,3.1000000000000000e-01
"1100",10,,2.9999999999999999e-01
"1100",11,,3.1000000000000000e-01
"1100",12,,3.2000000000000001e-01
"1200",1,,2.9999999999999999e-01
"1200",2,,3.1000000000000000e-01
"1200",3,,3.2000000000000001e-01
"1200",4,,3.3000000000000002e-01
"1200",5,,3.3000000000000002e-01
"1200",6,,3.2000000000000001e-01
"1200",7,,3.1000000000000000e-01
"1200",8,,2.9999999999999999e-01
"1200",9,,2.8999999999999998e-01
"1200",10,,2.8999999999999998e-01
"1200",11,,2.8999999999999998e-01
"1200",12,,2.9999999999999999e-01
"1300",1,,3.1000000000000000e-01
"1300",2,,3.2000000000000001e-01
"1300",3,,3.3000000000000002e-01
"1300",4,,3.4000000000000002e-01
"1300",5,,3.4000000000000002e-01
"1300",6,,3.4000000000000002e-01
"1300",7,,3.3000000000000002e-01
"1300",8,,3.2000000000000001e-01
"1300",9,,3.1000000000000000e-01
"1300",10,,2.9999999999999999e-01
"1300",11,,2.9999999999999999e-01
"1300",12,,3.1000000000000000e-01
"1500",1,,2.3999999999999999e-01
"1500",2,,2.6000000000000001e-01
"1500",3,,2.6000000000000001e-01
"1500",4,,2.7000000000000002e-01
"1500",5,,2.8000000000000003e-01
"1500",6,,2.7000000000000002e-01
"1500",7,,2.6000000000000001e-01
"1500",8,,2.6000000000000001e-01
"1500",9,,2.6000000000000001e-01
"1500",10,,2.5000000000000000e-01
"1500",11,,2.5000000000000000e-01
"1500",12,,2.5000000000000000e-01
"1600",1,,3.2000000000000001e-01
"1600",2,,3.4999999999999998e-01
"1600",3,,3.7000000000000000e-01
"1600",4,,3.7000000000000000e-01
"1600",5,,3.5999999999999999e-01
"1600",6,,3.4999999999999998e-01
"1600",7,,3.3000000000000002e-01
"1600",8,,3.1000000000000000e-01
"1600",9,,2.9999999999999999e-01
"1600",10,,2.8999999999999998e-01
"1600",11,,2.8999999999999998e-01
"1600",12,,2.9999999999999999e-01
"1700",1,,3.3000000000000002e-01
"1700",2,,3.4999999999999998e-01
"1700",3,,3.5999999999999999e-01
"1700",4,,3.7000000000000000e-01
"1700",5,,3.7000000000000000e-01
"1700",6,,3.5999999999999999e-01
"1700",7,,3.4000000000000002e-01
"1700",8,,3.3000000000000002e-01
"1700",9,,3.1000000000000000e-01
"1700",10,,2.9999999999999999e-01
"1700",11,,3.1000000000000000e-01
"1700",12,,3.2000000000000001e-01
"1800",1,,3.3000000000000002e-01
"1800",2,,3.4999999999999998e-01
"1800",3,,3.5999999999999999e-01
"1800",4,,3.7000000000000000e-01
"1800",5,,3.7000000000000000e-01
"1800",6,,3.5999999999999999e-01
"1800",7,,3.4000000000000002e-01
"1800",8,,3.3000000000000002e-01
"1800",9,,3.1000000000000000e-01
"1800",10,,2.9999999999999999e-01
"1800",11,,3.1000000000000000e-01
"1800",12,,3.2000000000000001e-01
"1900",1,,3.3000000000000002e-01
"1900",2,,3.4999999999999998e-01
"1900",3,,3.5999999999999999e-01
"1900",4,,3.7000000000000000e-01
"1900",5,,3.7000000000000000e-01
"1900",6,,3.5999999999999999e-01
"1900",7,,3.4000000000000002e-01
"1900",8,,3.3000000000000002e-01
"1900",9,,3.1000000000000000e-01
"1900",10,,2.9999999999999999e-01
"1900",11,,3.1000000000000000e-01
"1900",12,,3.2000000000000001e-01
"2000",1,,3.1000000000000000e-01
"2000",2,,3.3000000000000002e-01
"2000",3,,3.4000000000000002e-01
"2000",4,,3.4999999999999998e-01
"2000",5,,3.4999999999999998e-01
"2000",6,,3.4000000000000002e-01
"2000",7,,3.2000000000000001e-01
"2000",8,,3.1000000000000000e-01
"2000",9,,2.8999999999999998e-01
"2000",10,,2.8000000000000003e-01
"2000",11,,2.8999999999999998e-01
"2000",12,,2.9999999999999999e-01
"2100",1,,3.3000000000000002e-01
"2100",2,,3.4999999999999998e-01
"2100",3,,3.5999999999999999e-01
"2100",4,,3.7000000000000000e-01
"2100",5,,3.7000000000000000e-01
"2100",6,,3.5999999999999999e-01
"2100",7,,3.4999999999999998e-01
"2100",8,,3.4000000000000002e-01
"2100",9,,3.3000000000000002e-01
"2100",10,,3.2000000000000001e-01
"2100",11,,3.2000000000000001e-01
"2100",12,,3.3000000000000002e-01
"2200",1,,2.9999999999999999e-01
"2200",2,,3.1000000000000000e-01
"2200",3,,3.2000000000000001e-01
"2200",4,,3.3000000000000002e-01
"2200",5,,3.3000000000000002e-01
"2200",6,,3.3000000000000002e-01
"2200",7,,3.2000000000000001e-01
"2200",8,,3.1000000000000000e-01
"2200",9,,2.9999999999999999e-01
"2200",10,,2.8999999999999998e-01
"2200",11,,2.8999999999999998e-01
"2200",12,,2.9999999999999999e-01
"2300",1,,3.5999999999999999e-01
"2300",2,,3.9000000000000001e-01
"2300",3,,4.0999999999999998e-01
"2300",4,,4.0999999999999998e-01
"2300",5,,4.0000000000000002e-01
"2300",6,,3.9000000000000001e-01
"2300",7,,3.7000000000000000e-01
"2300",8,,3.4999999999999998e-01
"2300",9,,3.4000000000000002e-01
"2300",10,,3.3000000000000002e-01
"2300",11,,3.3000000000000002e-01
"2300",12,,3.4000000000000002e-01
"2400",1,,3.3000000000000002e-01
"2400",2,,3.4999999999999998e-01
"2400",3,,3.5999999999999999e-01
"2400",4,,3.7000000000000000e-01
"2400",5,,3.7000000000000000e-01
"2400",6,,3.5999999999999999e-01
"2400",7,,3.4000000000000002e-01
"2400",8,,3.3000000000000002e-01
"2400",9,,3.1000000000000000e-01
"2400",10,,2.9999999999999999e-01
"2400",11,,3.1000000000000000e-01
"2400",12,,3.2000000000000001e-01
"2500",1,,3.4999999999999998e-01
"2500",2,,3.7000000000000000e-01
"2500",3,,3.8000000000000000e-01
"2500",4,,3.9000000000000001e-01
"2500",5,,3.9000000000000001e-01
"2500",6,,3.8000000000000000e-01
"2500",7,,3.5999999999999999e-01
"2500",8,,3.4999999999999998e-01
"2500",9,,3.3000000000000002e-01
"2500",10,,3.2000000000000001e-01
"2500",11,,3.3000000000000002e-01
"2500",12,,3.4000000000000002e-01
"2600",1,,3.4000000000000002e-01
"2600",2,,3.7000000000000000e-01
"2600",3,,3.9000000000000001e-01
"2600",4,,3.9000000000000001e-01
"2600",5,,3.8000000000000000e-01
"2600",6,,3.7000000000000000e-01
"2600",7,,3.4999999999999998e-01
"2600",8,,3.3000000000000002e-01
"2600",9,,3.2000000000000001e-01
"2600",10,,3.1000000000000000e-01
"2600",11,,3.1000000000000000e-01
"2600",12,,3.2000000000000001e-01
"2700",1,,3.4000000000000002e-01
"2700",2,,3.7000000000000000e-01
"2700",3,,3.9000000000000001e-01
"2700",4,,3.9000000000000001e-01
"2700",5,,3.8000000000000000e-01
"2700",6,,3.7000000000000000e-01
"2700",7,,3.4999999999999998e-01
"2700",8,,3.3000000000000002e-01
"2700",9,,3.2000000000000001e-01
"2700",10,,3.1000000000000000e-01
"2700",11,,3.1000000000000000e-01
"2700",12,,3.2000000000000001e-01
"2800",1,,2.9999999999999999e-01
"2800",2,,3.1000000000000000e-01
"2800",3,,3.2000000000000001e-01
"2800",4,,3.3000000000000002e-01
"2800",5,,3.3000000000000002e-01
"2800",6,,3.3000000000000002e-01
"2800",7,,3.2000000000000001e-01
"2800",8,,3.1000000000000000e-01
"2800",9,,2.9999999999999999e-01
"2800",10,,2.8999999999999998e-01
"2800",11,,2.8999999999999998e-01
"2800",12,,2.9999999999999999e-01
"2900",1,,3.2000000000000001e-01
"2900",2,,3.4000000000000002e-01
"2900",3,,3.4999999999999998e-01
"2900",4,,3.5999999999999999e-01
"2900",5,,3.5999999999999999e-01
"2900",6,,3.4999999999999998e-01
"2900",7,,3.3000000000000002e-01
"2900",8,,3.2000000000000001e-01
"2900",9,,2.9999999999999999e-01
"2900",10,,2.8999999999999998e-01
"2900",11,,2.9999999999999999e-01
"2900",12,,3.1000000000000000e-01
"3000",1,,3.3000000000000002e-01
"3000",2,,3.5999999999999999e-01
"3000",3,,3.8000000000000000e-01
"3000",4,,3.8000000000000000e-01
"3000",5,,3.7000000000000000e-01
"3000",6,,3.5999999999999999e-01
"3000",7,,3.4000000000000002e-01
"3000",8,,3.2000000000000001e-01
"3000",9,,3.1000000000000000e-01
"3000",10,,2.9999999999999999e-01
"3000",11,,2.9999999999999999e-01
"3000",12,,3.1000000000000000e-01
"3100",1,,3.2000000000000001e-01
"3100",2,,3.4000000000000002e-01
"3100",3,,3.4999999999999998e-01
"3100",4,,3.5999999999999999e-01
"3100",5,,3.5999999999999999e-01
"3100",6,,3.4999999999999998e-01
"3100",7,,3.3000000000000002e-01
"3100",8,,3.2000000000000001e-01
"3100",9,,2.9999999999999999e-01
"3100",10,,2.8999999999999998e-01
"3100",11,,2.9999999999999999e-01
"3100",12,,3.1000000000000000e-01
"3200",1,,3.1000000000000000e-01
"3200",2,,3.3000000000000002e-01
"3200",3,,3.4000000000000002e-01
"3200",4,,3.4999999999999998e-01
"3200",5,,3.4999999999999998e-01
"3200",6,,3.4000000000000002e-01
"3200",7,,3.2000000000000001e-01
"3200",8,,3.1000000000000000e-01
"3200",9,,2.8999999999999998e-01
"3200",10,,2.8000000000000003e-01
"3200",11,,2.8999999999999998e-01
"3200",12,,2.9999999999999999e-01
"3300",1,,3.4999999999999998e-01
"3300",2,,3.8000000000000000e-01
"3300",3,,4.0000000000000002e-01
"3300",4,,4.0000000000000002e-01
"3300",5,,3.9000000000000001e-01
"3300",6,,3.8000000000000000e-01
"3300",7,,3.5999999999999999e-01
"3300",8,,3.4000000000000002e-01
"3300",9,,3.3000000000000002e-01
"3300",10,,3.2000000000000001e-01
"3300",11,,3.2000000000000001e-01
"3300",12,,3.3000000000000002e-01
"3400",1,,3.4000000000000002e-01
"3400",2,,3.5999999999999999e-01
"3400",3,,3.7000000000000000e-01
"3400",4,,3.8000000000000000e-01
"3400",5,,3.8000000000000000e-01
"3400",6,,3.7000000000000000e-01
"3400",7,,3.4999999999999998e-01
"3400",8,,3.4000000000000002e-01
"3400",9,,3.2000000000000001e-01
"3400",10,,3.1000000000000000e-01
"3400",11,,3.2000000000000001e-01
"3400",12,,3.3000000000000002e-01
"3500",1,,2.9999999999999999e-01
"3500",2,,3.2000000000000001e-01
"3500",3,,3.3000000000000002e-01
"3500",4,,3.4000000000000002e-01
"3500",5,,3.4000000000000002e-01
"3500",6,,3.3000000000000002e-01
"3500",7,,3.2000000000000001e-01
"3500",8,,3.1000000000000000e-01
"3500",9,,2.9999999999999999e-01
"3500",10,,2.8999999999999998e-01
"3500",11,,2.8999999999999998e-01
"3500",12,,2.9999999999999999e-01
"3600",1,,3.4999999999999998e-01
"3600",2,,3.7000000000000000e-01
"3600",3,,3.8000000000000000e-01
"3600",4,,3.9000000000000001e-01
"3600",5,,3.9000000000000001e-01
"3600",6,,3.8000000000000000e-01
"3600",7,,3.5999999999999999e-01
"3600",8,,3.4999999999999998e-01
"3600",9,,3.3000000000000002e-01
"3600",10,,3.2000000000000001e-01
"3600",11,,3.3000000000000002e-01
"3600",12,,3.4000000000000002e-01
"3700",1,,3.2000000000000001e-01
"3700",2,,3.4000000000000002e-01
"3700",3,,3.4999999999999998e-01
"3700",4,,3.5999999999999999e-01
"3700",5,,3.5999999999999999e-01
"3700",6,,3.4999999999999998e-01
"3700",7,,3.4000000000000002e-01
"3700",8,,3.3000000000000002e-01
"3700",9,,3.2000000000000001e-01
"3700",10,,3.1000000000000000e-01
"3700",11,,3.1000000000000000e-01
"3700",12,,3.2000000000000001e-01
"3800",1,,3.4000000000000002e-01
"3800",2,,3.7000000000000000e-01
"3800",3,,3.9000000000000001e-01
"3800",4,,3.9000000000000001e-01
"3800",5,,3.8000000000000000e-01
"3800",6,,3.7000000000000000e-01
"3800",7,,3.4999999999999998e-01
"3800",8,,3.3000000000000002e-01
"3800",9,,3.2000000000000001e-01
"3800",10,,3.1000000000000000e-01
"3800",11,,3.1000000000000000e-01
"3800",12,,3.2000000000000001e-01
"3900",1,,3.3000000000000002e-01
"3900",2,,3.4999999999999998e-01
"3900",3,,3.5999999999999999e-01
"3900",4,,3.7000000000000000e-01
"3900",5,,3.7000000000000000e-01
"3900",6,,3.5999999999999999e-01
"3900",7,,3.4000000000000002e-01
"3900",8,,3.3000000000000002e-01
"3900",9,,3.1000000000000000e-01
"3900",10,,2.9999999999999999e-01
"3900",11,,3.1000000000000000e-01
"3900",12,,3.2000000000000001e-01
"4000",1,,3.1000000000000000e-01
"4000",2,,3.3000000000000002e-01
"4000",3,,3.4000000000000002e-01
"4000",4,,3.4999999999999998e-01
"4000",5,,3.4999999999999998e-01
"4000",6,,3.4000000000000002e-01
"4000",7,,3.3000000000000002e-01
"4000",8,,3.2000000000000001e-01
"4000",9,,3.1000000000000000e-01
"4000",10,,2.9999999999999999e-01
"4000",11,,2.9999999999999999e-01
"4000",12,,3.1000000000000000e-01
"4100",1,,3.2000000000000001e-01
"4100",2,,3.4999999999999998e-01
"4100",3,,3.7000000000000000e-01
"4100",4,,3.7000000000000000e-01
"4100",5,,3.5999999999999999e-01
"4100",6,,3.4999999999999998e-01
"4100",7,,3.3000000000000002e-01
"4100",8,,3.1000000000000000e-01
"4100",9,,2.9999999999999999e-01
"4100",10,,2.8999999999999998e-01
"4100",11,,2.8999999999999998e-01
"4100",12,,2.9999999999999999e-01
"4200",1,,3.4000000000000002e-01
"4200",2,,3.5999999999999999e-01
"4200",3,,3.7000000000000000e-01
"4200",4,,3.8000000000000000e-01
"4200",5,,3.8000000000000000e-01
"4200",6,,3.7000000000000000e-01
"4200",7,,3.4999999999999998e-01
"4200",8,,3.4000000000000002e-01
"4200",9,,3.2000000000000001e-01
"4200",10,,3.1000000000000000e-01
"4200",11,,3.2000000000000001e-01
"4200",12,,3.3000000000000002e-01
"4400",1,,3.4999999999999998e-01
"4400",2,,3.7000000000000000e-01
"4400",3,,3.8000000000000000e-01
"4400",4,,3.9000000000000001e-01
"4400",5,,3.9000000000000001e-01
"4400",6,,3.8000000000000000e-01
"4400",7,,3.5999999999999999e-01
"4400",8,,3.4999999999999998e-01
"4400",9,,3.3000000000000002e-01
"4400",10,,3.2000000000000001e-01
"4400",11,,3.3000000000000002e-01
"4400",12,,3.4000000000000002e-01
"4500",1,,3.1000000000000000e-01
"4500",2,,3.3000000000000002e-01
"4500",3,,3.4000000000000002e-01
"4500",4,,3.4999999999999998e-01
"4500",5,,3.4999999999999998e-01
"4500",6,,3.4000000000000002e-01
"4500",7,,3.3000000000000002e-01
"4500",8,,3.2000000000000001e-01
"4500",9,,3.1000000000000000e-01
"4500",10,,2.9999999999999999e-01
"4500",11,,2.9999999999999999e-01
"4500",12,,3.1000000000000000e-01
"4600",1,,3.3000000000000002e-01
"4600",2,,3.5999999999999999e-01
"4600",3,,3.8000000000000000e-01
"4600",4,,3.8000000000000000e-01
"4600",5,,3.7000000000000000e-01
"4600",6,,3.5999999999999999e-01
"4600",7,,3.4000000000000002e-01
"4600",8,,3.2000000000000001e-01
"4600",9,,3.1000000000000000e-01
"4600",10,,2.9999999999999999e-01
"4600",11,,2.9999999999999999e-01
"4600",12,,3.1000000000000000e-01
"4700",1,,3.1000000000000000e-01
"4700",2,,3.3000000000000002e-01
"4700",3,,3.4000000000000002e-01
"4700",4,,3.4999999999999998e-01
"4700",5,,3.4999999999999998e-01
"4700",6,,3.4000000000000002e-01
"4700",7,,3.3000000000000002e-01
"4700",8,,3.2000000000000001e-01
"4700",9,,3.1000000000000000e-01
"4700",10,,2.9999999999999999e-01
"4700",11,,2.9999999999999999e-01
"4700",12,,3.1000000000000000e-01
"4830",1,,2.9999999999999999e-01
"4830",2,,3.1000000000000000e-01
"4830",3,,3.2000000000000001e-01
"4830",4,,3.3000000000000002e-01
"4830",5,,3.3000000000000002e-01
"4830",6,,3.3000000000000002e-01
"4830",7,,3.2000000000000001e-01
"4830",8,,3.1000000000000000e-01
"4830",9,,2.9999999999999999e-01
"4830",10,,2.8999999999999998e-01
"4830",11,,2.8999999999999998e-01
"4830",12,,2.9999999999999999e-01
"4835",1,,2.9999999999999999e-01
"4835",2,,3.2000000000000001e-01
"4835",3,,3.3000000000000002e-01
"4835",4,,3.4000000000000002e-01
"4835",5,,3.4000000000000002e-01
"4835",6,,3.3000000000000002e-01
"4835",7,,3.2000000000000001e-01
"4835",8,,3.1000000000000000e-01
"4835",9,,2.9999999999999999e-01
"4835",10,,2.8999999999999998e-01
"4835",11,,2.8999999999999998e-01
"4835",12,,2.9999999999999999e-01
"4900",1,,3.1000000000000000e-01
"4900",2,,3.3000000000000002e-01
"4900",3,,3.4000000000000002e-01
"4900",4,,3.4999999999999998e-01
"4900",5,,3.4999999999999998e-01
"4900",6,,3.4000000000000002e-01
"4900",7,,3.2000000000000001e-01
"4900",8,,3.1000000000000000e-01
"4900",9,,2.8999999999999998e-01
"4900",10,,2.8000000000000003e-01
"4900",11,,2.8999999999999998e-01
"4900",12,,2.9999999999999999e-01
"5000",1,,3.4999999999999998e-01
"5000",2,,3.8000000000000000e-01
"5000",3,,4.0000000000000002e-01
"5000",4,,4.0000000000000002e-01
"5000",5,,3.9000000000000001e-01
"5000",6,,3.8000000000000000e-01
"5000",7,,3.5999999999999999e-01
"5000",8,,3.4000000000000002e-01
"5000",9,,3.3000000000000002e-01
"5000",10,,3.2000000000000001e-01
"5000",11,,3.2000000000000001e-01
"5000",12,,3.3000000000000002e-01
"5100",1,,3.3000000000000002e-01
"5100",2,,3.4999999999999998e-01
"5100",3,,3.5999999999999999e-01
"5100",4,,3.7000000000000000e-01
"5100",5,,3.7000000000000000e-01
"5100",6,,3.5999999999999999e-01
"5100",7,,3.4999999999999998e-01
"5100",8,,3.4000000000000002e-01
"5100",9,,3.3000000000000002e-01
"5100",10,,3.2000000000000001e-01
"5100",11,,3.2000000000000001e-01
"5100",12,,3.3000000000000002e-01
"5300",1,,3.3000000000000002e-01
"5300",2,,3.5999999999999999e-01
"5300",3,,3.8000000000000000e-01
"5300",4,,3.8000000000000000e-01
"5300",5,,3.7000000000000000e-01
"5300",6,,3.5999999999999999e-01
"5300",7,,3.4000000000000002e-01
"5300",8,,3.2000000000000001e-01
"5300",9,,3.1000000000000000e-01
"5300",10,,2.9999999999999999e-01
"5300",11,,2.9999999999999999e-01
"5300",12,,3.1000000000000000e-01
"5400",1,,3.3000000000000002e-01
"5400",2,,3.4999999999999998e-01
"5400",3,,3.5999999999999999e-01
"5400",4,,3.7000000000000000e-01
"5400",5,,3.7000000000000000e-01
"5400",6,,3.5999999999999999e-01
"5400",7,,3.4000000000000002e-01
"5400",8,,3.3000000000000002e-01
"5400",9,,3.1000000000000000e-01
"5400",10,,2.9999999999999999e-01
"5400",11,,3.1000000000000000e-01
"5400",12,,3.2000000000000001e-01
"5500",1,,3.4000000000000002e-01
"5500",2,,3.7000000000000000e-01
"5500",3,,3.9000000000000001e-01
"5500",4,,3.9000000000000001e-01
"5500",5,,3.8000000000000000e-01
"5500",6,,3.7000000000000000e-01
"5500",7,,3.4999999999999998e-01
"5500",8,,3.3000000000000002e-01
"5500",9,,3.2000000000000001e-01
"5500",10,,3.1000000000000000e-01
"5500",11,,3.1000000000000000e-01
"5500",12,,3.2000000000000001e-01
"5600",1,,3.2000000000000001e-01
"5600",2,,3.4999999999999998e-01
"5600",3,,3.7000000000000000e-01
"5600",4,,3.7000000000000000e-01
"5600",5,,3.5999999999999999e-01
"5600",6,,3.4999999999999998e-01
"5600",7,,3.3000000000000002e-01
"5600",8,,3.1000000000000000e-01
"5600",9,,2.9999999999999999e-01
"5600",10,,2.8999999999999998e-01
"5600",11,,2.8999999999999998e-01
"5600",12,,2.9999999999999999e-01
"7200",1,,2.3999999999999999e-01
"7200",2,,2.6000000000000001e-01
"7200",3,,2.6000000000000001e-01
"7200",4,,2.7000000000000002e-01
"7200",5,,2.8000000000000003e-01
"7200",6,,2.7000000000000002e-01
"7200",7,,2.6000000000000001e-01
"7200",8,,2.6000000000000001e-01
"7200",9,,2.6000000000000001e-01
"7200",10,,2.5000000000000000e-01
"7200",11,,2.5000000000000000e-01
"7200",12,,2.5000000000000000e-01
