ClimateRegionID,EnergyEffectID,TreeHeightClassID,LeafTypeID,TreeLocationID,EnergyDirectionID,ShadingFactor
1,1,1,1,1,1,3.00000012e-01
1,1,1,1,1,2,1.73999996e+01
1,1,1,1,1,3,2.72999992e+01
1,1,1,1,1,4,3.40000000e+01
1,1,1,1,1,5,3.92000008e+01
1,1,1,1,1,6,3.60000000e+01
1,1,1,1,1,7,3.65000000e+01
1,1,1,1,1,8,1.96000004e+01
1,1,1,1,2,1,1.00000001e-01
1,1,1,1,2,2,1.70000005e+00
1,1,1,1,2,3,2.58999996e+01
1,1,1,1,2,4,1.73999996e+01
1,1,1,1,2,5,3.52999992e+01
1,1,1,1,2,6,2.68999996e+01
1,1,1,1,2,7,3.45000000e+01
1,1,1,1,2,8,3.50000000e+00
1,1,1,1,3,1,0.00000000e+00
1,1,1,1,3,2,1.00000001e-01
1,1,1,1,3,3,1.72999992e+01
1,1,1,1,3,4,9.69999981e+00
1,1,1,1,3,5,1.77000008e+01
1,1,1,1,3,6,1.93999996e+01
1,1,1,1,3,7,2.46000004e+01
1,1,1,1,3,8,2.00000003e-01
1,1,1,2,1,1,3.00000012e-01
1,1,1,2,1,2,2.02000008e+01
1,1,1,2,1,3,3.06000004e+01
1,1,1,2,1,4,3.99000015e+01
1,1,1,2,1,5,4.25000000e+01
1,1,1,2,1,6,4.05999985e+01
1,1,1,2,1,7,3.84000015e+01
1,1,1,2,1,8,2.31000004e+01
1,1,1,2,2,1,2.00000003e-01
1,1,1,2,2,2,6.69999981e+00
1,1,1,2,2,3,2.91000004e+01
1,1,1,2,2,4,2.60000000e+01
1,1,1,2,2,5,4.00000000e+01
1,1,1,2,2,6,3.35000000e+01
1,1,1,2,2,7,3.75000000e+01
1,1,1,2,2,8,9.00000000e+00
1,1,1,2,3,1,0.00000000e+00
1,1,1,2,3,2,1.00000001e-01
1,1,1,2,3,3,2.00000000e+01
1,1,1,2,3,4,1.31999998e+01
1,1,1,2,3,5,2.37999992e+01
1,1,1,2,3,6,2.32999992e+01
1,1,1,2,3,7,2.87000008e+01
1,1,1,2,3,8,2.00000003e-01
1,1,2,1,1,1,2.00000003e-01
1,1,2,1,1,2,7.90000010e+00
1,1,2,1,1,3,2.55000000e+01
1,1,2,1,1,4,2.36000004e+01
1,1,2,1,1,5,3.80999985e+01
1,1,2,1,1,6,2.92999992e+01
1,1,2,1,1,7,3.37000008e+01
1,1,2,1,1,8,1.20000000e+01
1,1,2,1,2,1,0.00000000e+00
1,1,2,1,2,2,2.00000003e-01
1,1,2,1,2,3,1.72000008e+01
1,1,2,1,2,4,8.19999981e+00
1,1,2,1,2,5,2.01000004e+01
1,1,2,1,2,6,1.72999992e+01
1,1,2,1,2,7,2.57999992e+01
1,1,2,1,2,8,3.00000012e-01
1,1,2,1,3,1,0.00000000e+00
1,1,2,1,3,2,0.00000000e+00
1,1,2,1,3,3,7.69999981e+00
1,1,2,1,3,4,3.09999990e+00
1,1,2,1,3,5,3.90000010e+00
1,1,2,1,3,6,7.90000010e+00
1,1,2,1,3,7,1.28999996e+01
1,1,2,1,3,8,0.00000000e+00
1,1,2,2,1,1,3.00000012e-01
1,1,2,2,1,2,1.48000002e+01
1,1,2,2,1,3,2.86000004e+01
1,1,2,2,1,4,3.22999992e+01
1,1,2,2,1,5,4.19000015e+01
1,1,2,2,1,6,3.50999985e+01
1,1,2,2,1,7,3.89000015e+01
1,1,2,2,1,8,1.61000004e+01
1,1,2,2,2,1,0.00000000e+00
1,1,2,2,2,2,2.00000003e-01
1,1,2,2,2,3,2.27999992e+01
1,1,2,2,2,4,1.26999998e+01
1,1,2,2,2,5,3.00000000e+01
1,1,2,2,2,6,2.27999992e+01
1,1,2,2,2,7,3.25000000e+01
1,1,2,2,2,8,4.00000006e-01
1,1,2,2,3,1,0.00000000e+00
1,1,2,2,3,2,0.00000000e+00
1,1,2,2,3,3,1.21000004e+01
1,1,2,2,3,4,5.80000019e+00
1,1,2,2,3,5,1.03000002e+01
1,1,2,2,3,6,1.38999996e+01
1,1,2,2,3,7,1.78999996e+01
1,1,2,2,3,8,1.00000001e-01
1,1,3,1,1,1,0.00000000e+00
1,1,3,1,1,2,5.00000000e-01
1,1,3,1,1,3,1.62999992e+01
1,1,3,1,1,4,7.90000010e+00
1,1,3,1,1,5,2.50000000e+01
1,1,3,1,1,6,1.55000000e+01
1,1,3,1,1,7,2.31000004e+01
1,1,3,1,1,8,5.00000000e-01
1,1,3,1,2,1,0.00000000e+00
1,1,3,1,2,2,0.00000000e+00
1,1,3,1,2,3,5.90000010e+00
1,1,3,1,2,4,2.09999990e+00
1,1,3,1,2,5,4.00000000e+00
1,1,3,1,2,6,6.40000010e+00
1,1,3,1,2,7,1.08999996e+01
1,1,3,1,2,8,1.00000001e-01
1,1,3,1,3,1,0.00000000e+00
1,1,3,1,3,2,0.00000000e+00
1,1,3,1,3,3,1.79999995e+00
1,1,3,1,3,4,8.99999976e-01
1,1,3,1,3,5,0.00000000e+00
1,1,3,1,3,6,1.60000002e+00
1,1,3,1,3,7,3.09999990e+00
1,1,3,1,3,8,0.00000000e+00
1,1,3,2,1,1,0.00000000e+00
1,1,3,2,1,2,2.00000003e-01
1,1,3,2,1,3,1.33999996e+01
1,1,3,2,1,4,4.09999990e+00
1,1,3,2,1,5,1.97000008e+01
1,1,3,2,1,6,8.10000038e+00
1,1,3,2,1,7,1.60000000e+01
1,1,3,2,1,8,4.00000006e-01
1,1,3,2,2,1,0.00000000e+00
1,1,3,2,2,2,0.00000000e+00
1,1,3,2,2,3,4.09999990e+00
1,1,3,2,2,4,1.00000000e+00
1,1,3,2,2,5,2.40000010e+00
1,1,3,2,2,6,3.29999995e+00
1,1,3,2,2,7,5.19999981e+00
1,1,3,2,2,8,1.00000001e-01
1,1,3,2,3,1,0.00000000e+00
1,1,3,2,3,2,0.00000000e+00
1,1,3,2,3,3,1.29999995e+00
1,1,3,2,3,4,3.00000012e-01
1,1,3,2,3,5,0.00000000e+00
1,1,3,2,3,6,8.99999976e-01
1,1,3,2,3,7,1.89999998e+00
1,1,3,2,3,8,0.00000000e+00
1,2,1,1,1,1,-1.79999995e+00
1,2,1,1,1,2,-3.45999985e+01
1,2,1,1,1,3,-6.83000031e+01
1,2,1,1,1,4,-6.65999985e+01
1,2,1,1,1,5,-7.51999969e+01
1,2,1,1,1,6,-5.29000015e+01
1,2,1,1,1,7,-4.37999992e+01
1,2,1,1,1,8,-2.15000000e+01
1,2,1,1,2,1,-6.00000024e-01
1,2,1,1,2,2,-3.90000010e+00
1,2,1,1,2,3,-6.83000031e+01
1,2,1,1,2,4,-5.17999992e+01
1,2,1,1,2,5,-7.28000031e+01
1,2,1,1,2,6,-3.08999996e+01
1,2,1,1,2,7,-4.65000000e+01
1,2,1,1,2,8,-3.40000010e+00
1,2,1,1,3,1,0.00000000e+00
1,2,1,1,3,2,-1.00000001e-01
1,2,1,1,3,3,-3.87000008e+01
1,2,1,1,3,4,-4.67000008e+01
1,2,1,1,3,5,-4.20999985e+01
1,2,1,1,3,6,-2.60000000e+01
1,2,1,1,3,7,-3.82999992e+01
1,2,1,1,3,8,-6.00000024e-01
1,2,1,2,1,1,-1.89999998e+00
1,2,1,2,1,2,-7.26999969e+01
1,2,1,2,1,3,-1.48800003e+02
1,2,1,2,1,4,-1.62199997e+02
1,2,1,2,1,5,-2.25899994e+02
1,2,1,2,1,6,-1.28899994e+02
1,2,1,2,1,7,-7.95000000e+01
1,2,1,2,1,8,-3.77000008e+01
1,2,1,2,2,1,-1.29999995e+00
1,2,1,2,2,2,-2.38999996e+01
1,2,1,2,2,3,-1.61600006e+02
1,2,1,2,2,4,-1.68399994e+02
1,2,1,2,2,5,-2.64000000e+02
1,2,1,2,2,6,-1.13500000e+02
1,2,1,2,2,7,-9.23000031e+01
1,2,1,2,2,8,-1.38000002e+01
1,2,1,2,3,1,0.00000000e+00
1,2,1,2,3,2,-2.00000003e-01
1,2,1,2,3,3,-9.40000000e+01
1,2,1,2,3,4,-1.64300003e+02
1,2,1,2,3,5,-1.66300003e+02
1,2,1,2,3,6,-9.65999985e+01
1,2,1,2,3,7,-7.31999969e+01
1,2,1,2,3,8,-1.00000000e+00
1,2,2,1,1,1,-1.20000005e+00
1,2,2,1,1,2,-1.65000000e+01
1,2,2,1,1,3,-6.88000031e+01
1,2,2,1,1,4,-5.35000000e+01
1,2,2,1,1,5,-8.06999969e+01
1,2,2,1,1,6,-5.02999992e+01
1,2,2,1,1,7,-5.15000000e+01
1,2,2,1,1,8,-1.55000000e+01
1,2,2,1,2,1,0.00000000e+00
1,2,2,1,2,2,-2.00000003e-01
1,2,2,1,2,3,-4.09000015e+01
1,2,2,1,2,4,-3.95999985e+01
1,2,2,1,2,5,-4.65000000e+01
1,2,2,1,2,6,-2.86000004e+01
1,2,2,1,2,7,-4.42000008e+01
1,2,2,1,2,8,-1.29999995e+00
1,2,2,1,3,1,0.00000000e+00
1,2,2,1,3,2,0.00000000e+00
1,2,2,1,3,3,-1.45000000e+01
1,2,2,1,3,4,-2.71000004e+01
1,2,2,1,3,5,-1.77000008e+01
1,2,2,1,3,6,-1.95000000e+01
1,2,2,1,3,7,-2.82999992e+01
1,2,2,1,3,8,-2.00000003e-01
1,2,2,2,1,1,-1.70000005e+00
1,2,2,2,1,2,-4.77999992e+01
1,2,2,2,1,3,-1.65500000e+02
1,2,2,2,1,4,-1.59899994e+02
1,2,2,2,1,5,-2.64399994e+02
1,2,2,2,1,6,-1.34699997e+02
1,2,2,2,1,7,-1.06400002e+02
1,2,2,2,1,8,-2.91000004e+01
1,2,2,2,2,1,0.00000000e+00
1,2,2,2,2,2,-6.00000024e-01
1,2,2,2,2,3,-1.23199997e+02
1,2,2,2,2,4,-1.44300003e+02
1,2,2,2,2,5,-2.11000000e+02
1,2,2,2,2,6,-9.53000031e+01
1,2,2,2,2,7,-9.08000031e+01
1,2,2,2,2,8,-2.09999990e+00
1,2,2,2,3,1,0.00000000e+00
1,2,2,2,3,2,0.00000000e+00
1,2,2,2,3,3,-4.12999992e+01
1,2,2,2,3,4,-1.22800003e+02
1,2,2,2,3,5,-9.44000015e+01
1,2,2,2,3,6,-7.80000000e+01
1,2,2,2,3,7,-5.75999985e+01
1,2,2,2,3,8,-5.00000000e-01
1,2,3,1,1,1,-3.00000012e-01
1,2,3,1,1,2,-1.20000005e+00
1,2,3,1,1,3,-4.34000015e+01
1,2,3,1,1,4,-3.20000000e+01
1,2,3,1,1,5,-5.47000008e+01
1,2,3,1,1,6,-2.96000004e+01
1,2,3,1,1,7,-3.95999985e+01
1,2,3,1,1,8,-5.69999981e+00
1,2,3,1,2,1,0.00000000e+00
1,2,3,1,2,2,0.00000000e+00
1,2,3,1,2,3,-1.31999998e+01
1,2,3,1,2,4,-1.87999992e+01
1,2,3,1,2,5,-1.67000008e+01
1,2,3,1,2,6,-1.83999996e+01
1,2,3,1,2,7,-2.68999996e+01
1,2,3,1,2,8,-6.00000024e-01
1,2,3,1,3,1,0.00000000e+00
1,2,3,1,3,2,0.00000000e+00
1,2,3,1,3,3,-3.59999990e+00
1,2,3,1,3,4,-8.50000000e+00
1,2,3,1,3,5,-3.00000012e-01
1,2,3,1,3,6,-9.19999981e+00
1,2,3,1,3,7,-1.51999998e+01
1,2,3,1,3,8,-1.00000001e-01
1,2,3,2,1,1,0.00000000e+00
1,2,3,2,1,2,-2.00000003e-01
1,2,3,2,1,3,-8.74000015e+01
1,2,3,2,1,4,-7.03000031e+01
1,2,3,2,1,5,-1.44100006e+02
1,2,3,2,1,6,-4.70000000e+01
1,2,3,2,1,7,-5.80999985e+01
1,2,3,2,1,8,-3.29999995e+00
1,2,3,2,2,1,0.00000000e+00
1,2,3,2,2,2,0.00000000e+00
1,2,3,2,2,3,-2.30000000e+01
1,2,3,2,2,4,-3.22000008e+01
1,2,3,2,2,5,-2.52000008e+01
1,2,3,2,2,6,-2.57000008e+01
1,2,3,2,2,7,-3.25000000e+01
1,2,3,2,2,8,-6.00000024e-01
1,2,3,2,3,1,0.00000000e+00
1,2,3,2,3,2,0.00000000e+00
1,2,3,2,3,3,-5.19999981e+00
1,2,3,2,3,4,-1.08999996e+01
1,2,3,2,3,5,0.00000000e+00
1,2,3,2,3,6,-1.41000004e+01
1,2,3,2,3,7,-1.75000000e+01
1,2,3,2,3,8,-1.00000001e-01
2,1,1,1,1,1,3.00000000e+00
2,1,1,1,1,2,4.50000000e+01
2,1,1,1,1,3,1.07099998e+02
2,1,1,1,1,4,6.45999985e+01
2,1,1,1,1,5,6.25999985e+01
2,1,1,1,1,6,7.30000000e+01
2,1,1,1,1,7,1.41399994e+02
2,1,1,1,1,8,5.85000000e+01
2,1,1,1,2,1,6.00000024e-01
2,1,1,1,2,2,9.19999981e+00
2,1,1,1,2,3,9.80000000e+01
2,1,1,1,2,4,3.24000015e+01
2,1,1,1,2,5,5.05999985e+01
2,1,1,1,2,6,4.35999985e+01
2,1,1,1,2,7,1.45100006e+02
2,1,1,1,2,8,1.38999996e+01
2,1,1,1,3,1,0.00000000e+00
2,1,1,1,3,2,8.00000012e-01
2,1,1,1,3,3,7.29000015e+01
2,1,1,1,3,4,1.40000000e+01
2,1,1,1,3,5,2.01000004e+01
2,1,1,1,3,6,2.41000004e+01
2,1,1,1,3,7,1.17400002e+02
2,1,1,1,3,8,5.00000000e+00
2,1,1,2,1,1,3.09999990e+00
2,1,1,2,1,2,5.67999992e+01
2,1,1,2,1,3,1.19400002e+02
2,1,1,2,1,4,8.55000000e+01
2,1,1,2,1,5,7.96999969e+01
2,1,1,2,1,6,9.54000015e+01
2,1,1,2,1,7,1.58199997e+02
2,1,1,2,1,8,7.35000000e+01
2,1,1,2,2,1,1.29999995e+00
2,1,1,2,2,2,1.92000008e+01
2,1,1,2,2,3,1.16400002e+02
2,1,1,2,2,4,5.62999992e+01
2,1,1,2,2,5,7.10999985e+01
2,1,1,2,2,6,6.83000031e+01
2,1,1,2,2,7,1.68399994e+02
2,1,1,2,2,8,2.80000000e+01
2,1,1,2,3,1,0.00000000e+00
2,1,1,2,3,2,1.00000000e+00
2,1,1,2,3,3,8.90000000e+01
2,1,1,2,3,4,2.32000008e+01
2,1,1,2,3,5,3.35999985e+01
2,1,1,2,3,6,4.02000008e+01
2,1,1,2,3,7,1.39600006e+02
2,1,1,2,3,8,5.80000019e+00
2,1,2,1,1,1,3.59999990e+00
2,1,2,1,1,2,2.02000008e+01
2,1,2,1,1,3,8.16999969e+01
2,1,2,1,1,4,3.47999992e+01
2,1,2,1,1,5,5.62000008e+01
2,1,2,1,1,6,4.27000008e+01
2,1,2,1,1,7,1.18699997e+02
2,1,2,1,1,8,2.95000000e+01
2,1,2,1,2,1,0.00000000e+00
2,1,2,1,2,2,1.39999998e+00
2,1,2,1,2,3,6.30999985e+01
2,1,2,1,2,4,1.13999996e+01
2,1,2,1,2,5,2.22999992e+01
2,1,2,1,2,6,2.10000000e+01
2,1,2,1,2,7,1.04400002e+02
2,1,2,1,2,8,5.90000010e+00
2,1,2,1,3,1,0.00000000e+00
2,1,2,1,3,2,4.00000006e-01
2,1,2,1,3,3,3.37000008e+01
2,1,2,1,3,4,4.59999990e+00
2,1,2,1,3,5,6.90000010e+00
2,1,2,1,3,6,1.06000004e+01
2,1,2,1,3,7,6.89000015e+01
2,1,2,1,3,8,3.09999990e+00
2,1,2,2,1,1,3.90000010e+00
2,1,2,2,1,2,3.02999992e+01
2,1,2,2,1,3,1.03699997e+02
2,1,2,2,1,4,5.37999992e+01
2,1,2,2,1,5,7.55999985e+01
2,1,2,2,1,6,6.40000000e+01
2,1,2,2,1,7,1.46100006e+02
2,1,2,2,1,8,4.32999992e+01
2,1,2,2,2,1,0.00000000e+00
2,1,2,2,2,2,2.50000000e+00
2,1,2,2,2,3,8.36999969e+01
2,1,2,2,2,4,2.17000008e+01
2,1,2,2,2,5,4.35000000e+01
2,1,2,2,2,6,3.67999992e+01
2,1,2,2,2,7,1.34000000e+02
2,1,2,2,2,8,7.19999981e+00
2,1,2,2,3,1,0.00000000e+00
2,1,2,2,3,2,6.00000024e-01
2,1,2,2,3,3,5.27999992e+01
2,1,2,2,3,4,1.06999998e+01
2,1,2,2,3,5,1.36000004e+01
2,1,2,2,3,6,2.00000000e+01
2,1,2,2,3,7,9.60000000e+01
2,1,2,2,3,8,3.59999990e+00
2,1,3,1,1,1,1.39999998e+00
2,1,3,1,1,2,2.70000005e+00
2,1,3,1,1,3,4.47000008e+01
2,1,3,1,1,4,1.13999996e+01
2,1,3,1,1,5,2.91000004e+01
2,1,3,1,1,6,1.85000000e+01
2,1,3,1,1,7,8.10999985e+01
2,1,3,1,1,8,8.89999962e+00
2,1,3,1,2,1,0.00000000e+00
2,1,3,1,2,2,6.99999988e-01
2,1,3,1,2,3,2.62999992e+01
2,1,3,1,2,4,3.59999990e+00
2,1,3,1,2,5,7.50000000e+00
2,1,3,1,2,6,8.60000038e+00
2,1,3,1,2,7,5.79000015e+01
2,1,3,1,2,8,4.30000019e+00
2,1,3,1,3,1,0.00000000e+00
2,1,3,1,3,2,1.00000001e-01
2,1,3,1,3,3,1.05000000e+01
2,1,3,1,3,4,1.10000002e+00
2,1,3,1,3,5,0.00000000e+00
2,1,3,1,3,6,3.29999995e+00
2,1,3,1,3,7,3.29000015e+01
2,1,3,1,3,8,1.60000002e+00
2,1,3,2,1,1,1.10000002e+00
2,1,3,2,1,2,8.99999976e-01
2,1,3,2,1,3,2.22000008e+01
2,1,3,2,1,4,7.40000010e+00
2,1,3,2,1,5,1.26000004e+01
2,1,3,2,1,6,1.71000004e+01
2,1,3,2,1,7,5.99000015e+01
2,1,3,2,1,8,6.09999990e+00
2,1,3,2,2,1,0.00000000e+00
2,1,3,2,2,2,3.00000012e-01
2,1,3,2,2,3,8.00000000e+00
2,1,3,2,2,4,1.39999998e+00
2,1,3,2,2,5,3.00000012e-01
2,1,3,2,2,6,5.59999990e+00
2,1,3,2,2,7,3.39000015e+01
2,1,3,2,2,8,2.20000005e+00
2,1,3,2,3,1,0.00000000e+00
2,1,3,2,3,2,1.00000001e-01
2,1,3,2,3,3,2.40000010e+00
2,1,3,2,3,4,3.00000012e-01
2,1,3,2,3,5,0.00000000e+00
2,1,3,2,3,6,1.39999998e+00
2,1,3,2,3,7,1.86000004e+01
2,1,3,2,3,8,8.99999976e-01
2,2,1,1,1,1,0.00000000e+00
2,2,1,1,1,2,-1.60000002e+00
2,2,1,1,1,3,-5.09999990e+00
2,2,1,1,1,4,-8.60000038e+00
2,2,1,1,1,5,-1.43999996e+01
2,2,1,1,1,6,-9.89999962e+00
2,2,1,1,1,7,-7.69999981e+00
2,2,1,1,1,8,-3.09999990e+00
2,2,1,1,2,1,0.00000000e+00
2,2,1,1,2,2,-6.00000024e-01
2,2,1,1,2,3,-5.30000019e+00
2,2,1,1,2,4,-1.08000002e+01
2,2,1,1,2,5,-2.55000000e+01
2,2,1,1,2,6,-1.31999998e+01
2,2,1,1,2,7,-6.90000010e+00
2,2,1,1,2,8,-1.29999995e+00
2,2,1,1,3,1,0.00000000e+00
2,2,1,1,3,2,0.00000000e+00
2,2,1,1,3,3,-2.40000010e+00
2,2,1,1,3,4,-1.28000002e+01
2,2,1,1,3,5,-2.13999996e+01
2,2,1,1,3,6,-1.41999998e+01
2,2,1,1,3,7,-2.90000010e+00
2,2,1,1,3,8,0.00000000e+00
2,2,1,2,1,1,0.00000000e+00
2,2,1,2,1,2,-4.69999981e+00
2,2,1,2,1,3,-1.77000008e+01
2,2,1,2,1,4,-2.92999992e+01
2,2,1,2,1,5,-5.45999985e+01
2,2,1,2,1,6,-3.37999992e+01
2,2,1,2,1,7,-2.52000008e+01
2,2,1,2,1,8,-9.39999962e+00
2,2,1,2,2,1,0.00000000e+00
2,2,1,2,2,2,-2.50000000e+00
2,2,1,2,2,3,-2.11000004e+01
2,2,1,2,2,4,-4.12999992e+01
2,2,1,2,2,5,-1.07500000e+02
2,2,1,2,2,6,-4.65999985e+01
2,2,1,2,2,7,-2.76000004e+01
2,2,1,2,2,8,-5.59999990e+00
2,2,1,2,3,1,0.00000000e+00
2,2,1,2,3,2,0.00000000e+00
2,2,1,2,3,3,-1.20000000e+01
2,2,1,2,3,4,-4.95999985e+01
2,2,1,2,3,5,-9.43000031e+01
2,2,1,2,3,6,-5.30999985e+01
2,2,1,2,3,7,-1.33999996e+01
2,2,1,2,3,8,0.00000000e+00
2,2,2,1,1,1,0.00000000e+00
2,2,2,1,1,2,-1.20000005e+00
2,2,2,1,1,3,-6.69999981e+00
2,2,2,1,1,4,-8.69999981e+00
2,2,2,1,1,5,-2.06000004e+01
2,2,2,1,1,6,-1.06999998e+01
2,2,2,1,1,7,-9.69999981e+00
2,2,2,1,1,8,-2.29999995e+00
2,2,2,1,2,1,0.00000000e+00
2,2,2,1,2,2,0.00000000e+00
2,2,2,1,2,3,-4.90000010e+00
2,2,2,1,2,4,-1.03999996e+01
2,2,2,1,2,5,-2.15000000e+01
2,2,2,1,2,6,-1.18999996e+01
2,2,2,1,2,7,-7.50000000e+00
2,2,2,1,2,8,0.00000000e+00
2,2,2,1,3,1,0.00000000e+00
2,2,2,1,3,2,0.00000000e+00
2,2,2,1,3,3,-2.20000005e+00
2,2,2,1,3,4,-1.01000004e+01
2,2,2,1,3,5,-1.21999998e+01
2,2,2,1,3,6,-1.11999998e+01
2,2,2,1,3,7,-3.79999995e+00
2,2,2,1,3,8,0.00000000e+00
2,2,2,2,1,1,0.00000000e+00
2,2,2,2,1,2,-3.90000010e+00
2,2,2,2,1,3,-2.32999992e+01
2,2,2,2,1,4,-3.27000008e+01
2,2,2,2,1,5,-7.70000000e+01
2,2,2,2,1,6,-3.70999985e+01
2,2,2,2,1,7,-3.25000000e+01
2,2,2,2,1,8,-7.90000010e+00
2,2,2,2,2,1,0.00000000e+00
2,2,2,2,2,2,0.00000000e+00
2,2,2,2,2,3,-1.83999996e+01
2,2,2,2,2,4,-4.05000000e+01
2,2,2,2,2,5,-9.55000000e+01
2,2,2,2,2,6,-4.37999992e+01
2,2,2,2,2,7,-2.22000008e+01
2,2,2,2,2,8,0.00000000e+00
2,2,2,2,3,1,0.00000000e+00
2,2,2,2,3,2,0.00000000e+00
2,2,2,2,3,3,-7.80000019e+00
2,2,2,2,3,4,-4.17000008e+01
2,2,2,2,3,5,-6.46999969e+01
2,2,2,2,3,6,-4.42000008e+01
2,2,2,2,3,7,-9.50000000e+00
2,2,2,2,3,8,0.00000000e+00
2,2,3,1,1,1,0.00000000e+00
2,2,3,1,1,2,0.00000000e+00
2,2,3,1,1,3,-6.40000010e+00
2,2,3,1,1,4,-7.40000010e+00
2,2,3,1,1,5,-1.98999996e+01
2,2,3,1,1,6,-1.05000000e+01
2,2,3,1,1,7,-1.05000000e+01
2,2,3,1,1,8,0.00000000e+00
2,2,3,1,2,1,0.00000000e+00
2,2,3,1,2,2,0.00000000e+00
2,2,3,1,2,3,-3.40000010e+00
2,2,3,1,2,4,-7.19999981e+00
2,2,3,1,2,5,-1.28999996e+01
2,2,3,1,2,6,-9.50000000e+00
2,2,3,1,2,7,-6.30000019e+00
2,2,3,1,2,8,0.00000000e+00
2,2,3,1,3,1,0.00000000e+00
2,2,3,1,3,2,0.00000000e+00
2,2,3,1,3,3,-8.99999976e-01
2,2,3,1,3,4,-4.90000010e+00
2,2,3,1,3,5,-3.00000012e-01
2,2,3,1,3,6,-6.59999990e+00
2,2,3,1,3,7,-2.59999990e+00
2,2,3,1,3,8,0.00000000e+00
2,2,3,2,1,1,0.00000000e+00
2,2,3,2,1,2,0.00000000e+00
2,2,3,2,1,3,-1.31999998e+01
2,2,3,2,1,4,-1.43000002e+01
2,2,3,2,1,5,-5.22999992e+01
2,2,3,2,1,6,-2.27000008e+01
2,2,3,2,1,7,-2.31000004e+01
2,2,3,2,1,8,0.00000000e+00
2,2,3,2,2,1,0.00000000e+00
2,2,3,2,2,2,0.00000000e+00
2,2,3,2,2,3,-4.59999990e+00
2,2,3,2,2,4,-1.18999996e+01
2,2,3,2,2,5,-3.50000000e+00
2,2,3,2,2,6,-1.62999992e+01
2,2,3,2,2,7,-1.03999996e+01
2,2,3,2,2,8,0.00000000e+00
2,2,3,2,3,1,0.00000000e+00
2,2,3,2,3,2,0.00000000e+00
2,2,3,2,3,3,-1.10000002e+00
2,2,3,2,3,4,-5.00000000e+00
2,2,3,2,3,5,0.00000000e+00
2,2,3,2,3,6,-6.09999990e+00
2,2,3,2,3,7,-3.40000010e+00
2,2,3,2,3,8,0.00000000e+00
3,1,1,1,1,1,7.50000000e+00
3,1,1,1,1,2,6.80999985e+01
3,1,1,1,1,3,1.17500000e+02
3,1,1,1,1,4,6.86999969e+01
3,1,1,1,1,5,5.57999992e+01
3,1,1,1,1,6,7.20999985e+01
3,1,1,1,1,7,1.55600006e+02
3,1,1,1,1,8,8.03000031e+01
3,1,1,1,2,1,2.00000000e+00
3,1,1,1,2,2,1.33000002e+01
3,1,1,1,2,3,9.80999985e+01
3,1,1,1,2,4,3.00000000e+01
3,1,1,1,2,5,3.70000000e+01
3,1,1,1,2,6,3.67999992e+01
3,1,1,1,2,7,1.58000000e+02
3,1,1,1,2,8,2.23999996e+01
3,1,1,1,3,1,0.00000000e+00
3,1,1,1,3,2,1.20000005e+00
3,1,1,1,3,3,6.39000015e+01
3,1,1,1,3,4,1.06999998e+01
3,1,1,1,3,5,1.18999996e+01
3,1,1,1,3,6,1.91000004e+01
3,1,1,1,3,7,1.28199997e+02
3,1,1,1,3,8,8.50000000e+00
3,1,1,2,1,1,8.60000038e+00
3,1,1,2,1,2,8.25000000e+01
3,1,1,2,1,3,1.33000000e+02
3,1,1,2,1,4,8.68000031e+01
3,1,1,2,1,5,6.89000015e+01
3,1,1,2,1,6,9.56999969e+01
3,1,1,2,1,7,1.72800003e+02
3,1,1,2,1,8,1.00199997e+02
3,1,1,2,2,1,4.09999990e+00
3,1,1,2,2,2,3.08999996e+01
3,1,1,2,2,3,1.18000000e+02
3,1,1,2,2,4,5.05000000e+01
3,1,1,2,2,5,5.15999985e+01
3,1,1,2,2,6,6.40999985e+01
3,1,1,2,2,7,1.79899994e+02
3,1,1,2,2,8,3.97000008e+01
3,1,1,2,3,1,0.00000000e+00
3,1,1,2,3,2,1.70000005e+00
3,1,1,2,3,3,8.08000031e+01
3,1,1,2,3,4,1.65000000e+01
3,1,1,2,3,5,2.20000000e+01
3,1,1,2,3,6,3.42000008e+01
3,1,1,2,3,7,1.56100006e+02
3,1,1,2,3,8,1.06999998e+01
3,1,2,1,1,1,6.30000019e+00
3,1,2,1,1,2,3.07999992e+01
3,1,2,1,1,3,8.45000000e+01
3,1,2,1,1,4,3.52999992e+01
3,1,2,1,1,5,4.50000000e+01
3,1,2,1,1,6,3.75000000e+01
3,1,2,1,1,7,1.27300003e+02
3,1,2,1,1,8,4.10999985e+01
3,1,2,1,2,1,0.00000000e+00
3,1,2,1,2,2,2.29999995e+00
3,1,2,1,2,3,5.47000008e+01
3,1,2,1,2,4,9.89999962e+00
3,1,2,1,2,5,1.31999998e+01
3,1,2,1,2,6,1.53999996e+01
3,1,2,1,2,7,1.11599998e+02
3,1,2,1,2,8,1.08999996e+01
3,1,2,1,3,1,0.00000000e+00
3,1,2,1,3,2,5.00000000e-01
3,1,2,1,3,3,2.80000000e+01
3,1,2,1,3,4,2.20000005e+00
3,1,2,1,3,5,6.99999988e-01
3,1,2,1,3,6,6.19999981e+00
3,1,2,1,3,7,7.44000015e+01
3,1,2,1,3,8,4.30000019e+00
3,1,2,2,1,1,6.90000010e+00
3,1,2,2,1,2,4.65999985e+01
3,1,2,2,1,3,1.09099998e+02
3,1,2,2,1,4,5.32999992e+01
3,1,2,2,1,5,6.25000000e+01
3,1,2,2,1,6,5.92999992e+01
3,1,2,2,1,7,1.58199997e+02
3,1,2,2,1,8,5.75000000e+01
3,1,2,2,2,1,0.00000000e+00
3,1,2,2,2,2,3.79999995e+00
3,1,2,2,2,3,7.39000015e+01
3,1,2,2,2,4,1.80000000e+01
3,1,2,2,2,5,3.07000008e+01
3,1,2,2,2,6,3.13999996e+01
3,1,2,2,2,7,1.46399994e+02
3,1,2,2,2,8,1.28999996e+01
3,1,2,2,3,1,0.00000000e+00
3,1,2,2,3,2,6.99999988e-01
3,1,2,2,3,3,4.32999992e+01
3,1,2,2,3,4,6.00000000e+00
3,1,2,2,3,5,7.00000000e+00
3,1,2,2,3,6,1.81000004e+01
3,1,2,2,3,7,1.00199997e+02
3,1,2,2,3,8,6.19999981e+00
3,1,3,1,1,1,2.00000000e+00
3,1,3,1,1,2,3.90000010e+00
3,1,3,1,1,3,4.05000000e+01
3,1,3,1,1,4,1.16000004e+01
3,1,3,1,1,5,1.97999992e+01
3,1,3,1,1,6,1.60000000e+01
3,1,3,1,1,7,8.44000015e+01
3,1,3,1,1,8,1.43999996e+01
3,1,3,1,2,1,0.00000000e+00
3,1,3,1,2,2,6.99999988e-01
3,1,3,1,2,3,2.07999992e+01
3,1,3,1,2,4,1.79999995e+00
3,1,3,1,2,5,1.79999995e+00
3,1,3,1,2,6,5.19999981e+00
3,1,3,1,2,7,6.14000015e+01
3,1,3,1,2,8,6.40000010e+00
3,1,3,1,3,1,0.00000000e+00
3,1,3,1,3,2,1.00000001e-01
3,1,3,1,3,3,8.10000038e+00
3,1,3,1,3,4,2.00000003e-01
3,1,3,1,3,5,0.00000000e+00
3,1,3,1,3,6,1.39999998e+00
3,1,3,1,3,7,3.57000008e+01
3,1,3,1,3,8,1.89999998e+00
3,1,3,2,1,1,7.00000000e+00
3,1,3,2,1,2,2.50000000e+00
3,1,3,2,1,3,3.24000015e+01
3,1,3,2,1,4,3.17999992e+01
3,1,3,2,1,5,1.77999992e+01
3,1,3,2,1,6,4.77999992e+01
3,1,3,2,1,7,9.25999985e+01
3,1,3,2,1,8,1.81000004e+01
3,1,3,2,2,1,0.00000000e+00
3,1,3,2,2,2,6.00000024e-01
3,1,3,2,2,3,1.46999998e+01
3,1,3,2,2,4,3.79999995e+00
3,1,3,2,2,5,5.00000000e-01
3,1,3,2,2,6,1.73999996e+01
3,1,3,2,2,7,7.00000000e+01
3,1,3,2,2,8,3.70000005e+00
3,1,3,2,3,1,0.00000000e+00
3,1,3,2,3,2,1.00000001e-01
3,1,3,2,3,3,4.69999981e+00
3,1,3,2,3,4,5.00000000e-01
3,1,3,2,3,5,0.00000000e+00
3,1,3,2,3,6,5.50000000e+00
3,1,3,2,3,7,4.10999985e+01
3,1,3,2,3,8,1.20000005e+00
3,2,1,1,1,1,0.00000000e+00
3,2,1,1,1,2,-3.59999990e+00
3,2,1,1,1,3,-9.69999981e+00
3,2,1,1,1,4,-1.56999998e+01
3,2,1,1,1,5,-2.11000004e+01
3,2,1,1,1,6,-1.78999996e+01
3,2,1,1,1,7,-1.41000004e+01
3,2,1,1,1,8,-6.19999981e+00
3,2,1,1,2,1,0.00000000e+00
3,2,1,1,2,2,-1.10000002e+00
3,2,1,1,2,3,-7.59999990e+00
3,2,1,1,2,4,-1.55000000e+01
3,2,1,1,2,5,-2.82000008e+01
3,2,1,1,2,6,-2.02000008e+01
3,2,1,1,2,7,-1.26999998e+01
3,2,1,1,2,8,-2.29999995e+00
3,2,1,1,3,1,0.00000000e+00
3,2,1,1,3,2,0.00000000e+00
3,2,1,1,3,3,-4.30000019e+00
3,2,1,1,3,4,-1.45000000e+01
3,2,1,1,3,5,-2.10000000e+01
3,2,1,1,3,6,-2.03999996e+01
3,2,1,1,3,7,-8.50000000e+00
3,2,1,1,3,8,0.00000000e+00
3,2,1,2,1,1,0.00000000e+00
3,2,1,2,1,2,-1.08999996e+01
3,2,1,2,1,3,-3.25000000e+01
3,2,1,2,1,4,-5.77000008e+01
3,2,1,2,1,5,-7.69000015e+01
3,2,1,2,1,6,-6.29000015e+01
3,2,1,2,1,7,-4.72000008e+01
3,2,1,2,1,8,-1.82999992e+01
3,2,1,2,2,1,0.00000000e+00
3,2,1,2,2,2,-5.19999981e+00
3,2,1,2,2,3,-3.17000008e+01
3,2,1,2,2,4,-5.87999992e+01
3,2,1,2,2,5,-1.14800003e+02
3,2,1,2,2,6,-7.48000031e+01
3,2,1,2,2,7,-5.05999985e+01
3,2,1,2,2,8,-9.30000019e+00
3,2,1,2,3,1,0.00000000e+00
3,2,1,2,3,2,0.00000000e+00
3,2,1,2,3,3,-1.90000000e+01
3,2,1,2,3,4,-5.57999992e+01
3,2,1,2,3,5,-8.86999969e+01
3,2,1,2,3,6,-7.53000031e+01
3,2,1,2,3,7,-3.45000000e+01
3,2,1,2,3,8,0.00000000e+00
3,2,2,1,1,1,0.00000000e+00
3,2,2,1,1,2,-2.59999990e+00
3,2,2,1,1,3,-1.08999996e+01
3,2,2,1,1,4,-1.33999996e+01
3,2,2,1,1,5,-2.56000004e+01
3,2,2,1,1,6,-1.63999996e+01
3,2,2,1,1,7,-1.65000000e+01
3,2,2,1,1,8,-3.90000010e+00
3,2,2,1,2,1,0.00000000e+00
3,2,2,1,2,2,0.00000000e+00
3,2,2,1,2,3,-6.09999990e+00
3,2,2,1,2,4,-1.11999998e+01
3,2,2,1,2,5,-2.15000000e+01
3,2,2,1,2,6,-1.63999996e+01
3,2,2,1,2,7,-1.46000004e+01
3,2,2,1,2,8,0.00000000e+00
3,2,2,1,3,1,0.00000000e+00
3,2,2,1,3,2,0.00000000e+00
3,2,2,1,3,3,-2.40000010e+00
3,2,2,1,3,4,-9.10000038e+00
3,2,2,1,3,5,-9.89999962e+00
3,2,2,1,3,6,-1.46000004e+01
3,2,2,1,3,7,-9.19999981e+00
3,2,2,1,3,8,0.00000000e+00
3,2,2,2,1,1,0.00000000e+00
3,2,2,2,1,2,-8.30000019e+00
3,2,2,2,1,3,-3.70000000e+01
3,2,2,2,1,4,-5.05999985e+01
3,2,2,2,1,5,-9.49000015e+01
3,2,2,2,1,6,-5.90999985e+01
3,2,2,2,1,7,-5.50999985e+01
3,2,2,2,1,8,-1.31999998e+01
3,2,2,2,2,1,0.00000000e+00
3,2,2,2,2,2,0.00000000e+00
3,2,2,2,2,3,-2.51000004e+01
3,2,2,2,2,4,-4.62000008e+01
3,2,2,2,2,5,-9.40999985e+01
3,2,2,2,2,6,-6.51999969e+01
3,2,2,2,2,7,-4.62999992e+01
3,2,2,2,2,8,0.00000000e+00
3,2,2,2,3,1,0.00000000e+00
3,2,2,2,3,2,0.00000000e+00
3,2,2,2,3,3,-1.11000004e+01
3,2,2,2,3,4,-4.00999985e+01
3,2,2,2,3,5,-5.35999985e+01
3,2,2,2,3,6,-6.15000000e+01
3,2,2,2,3,7,-2.87000008e+01
3,2,2,2,3,8,0.00000000e+00
3,2,3,1,1,1,0.00000000e+00
3,2,3,1,1,2,0.00000000e+00
3,2,3,1,1,3,-7.30000019e+00
3,2,3,1,1,4,-8.10000038e+00
3,2,3,1,1,5,-2.15000000e+01
3,2,3,1,1,6,-1.67000008e+01
3,2,3,1,1,7,-1.73999996e+01
3,2,3,1,1,8,0.00000000e+00
3,2,3,1,2,1,0.00000000e+00
3,2,3,1,2,2,0.00000000e+00
3,2,3,1,2,3,-3.70000005e+00
3,2,3,1,2,4,-5.69999981e+00
3,2,3,1,2,5,-1.06000004e+01
3,2,3,1,2,6,-1.26999998e+01
3,2,3,1,2,7,-1.31000004e+01
3,2,3,1,2,8,0.00000000e+00
3,2,3,1,3,1,0.00000000e+00
3,2,3,1,3,2,0.00000000e+00
3,2,3,1,3,3,-1.10000002e+00
3,2,3,1,3,4,-3.90000010e+00
3,2,3,1,3,5,0.00000000e+00
3,2,3,1,3,6,-6.30000019e+00
3,2,3,1,3,7,-8.60000038e+00
3,2,3,1,3,8,0.00000000e+00
3,2,3,2,1,1,0.00000000e+00
3,2,3,2,1,2,0.00000000e+00
3,2,3,2,1,3,-1.87000008e+01
3,2,3,2,1,4,-2.07999992e+01
3,2,3,2,1,5,-6.88000031e+01
3,2,3,2,1,6,-3.87000008e+01
3,2,3,2,1,7,-5.27999992e+01
3,2,3,2,1,8,-7.30000019e+00
3,2,3,2,2,1,0.00000000e+00
3,2,3,2,2,2,0.00000000e+00
3,2,3,2,2,3,-6.80000019e+00
3,2,3,2,2,4,-1.58000002e+01
3,2,3,2,2,5,-1.87999992e+01
3,2,3,2,2,6,-4.15000000e+01
3,2,3,2,2,7,-3.42999992e+01
3,2,3,2,2,8,0.00000000e+00
3,2,3,2,3,1,0.00000000e+00
3,2,3,2,3,2,0.00000000e+00
3,2,3,2,3,3,-2.09999990e+00
3,2,3,2,3,4,-9.50000000e+00
3,2,3,2,3,5,0.00000000e+00
3,2,3,2,3,6,-2.60000000e+01
3,2,3,2,3,7,-1.62000008e+01
3,2,3,2,3,8,0.00000000e+00
4,1,1,1,1,1,6.19999981e+00
4,1,1,1,1,2,3.59000015e+01
4,1,1,1,1,3,5.59000015e+01
4,1,1,1,1,4,6.79000015e+01
4,1,1,1,1,5,7.05000000e+01
4,1,1,1,1,6,7.91999969e+01
4,1,1,1,1,7,1.10500000e+02
4,1,1,1,1,8,5.85000000e+01
4,1,1,1,2,1,1.00000001e-01
4,1,1,1,2,2,1.29999995e+00
4,1,1,1,2,3,4.74000015e+01
4,1,1,1,2,4,2.08999996e+01
4,1,1,1,2,5,3.80999985e+01
4,1,1,1,2,6,3.29000015e+01
4,1,1,1,2,7,1.03900002e+02
4,1,1,1,2,8,8.50000000e+00
4,1,1,1,3,1,0.00000000e+00
4,1,1,1,3,2,3.00000012e-01
4,1,1,1,3,3,2.77000008e+01
4,1,1,1,3,4,4.59999990e+00
4,1,1,1,3,5,5.50000000e+00
4,1,1,1,3,6,9.00000000e+00
4,1,1,1,3,7,7.31999969e+01
4,1,1,1,3,8,3.79999995e+00
4,1,1,2,1,1,6.50000000e+00
4,1,1,2,1,2,3.84000015e+01
4,1,1,2,1,3,5.95999985e+01
4,1,1,2,1,4,7.21999969e+01
4,1,1,2,1,5,7.65999985e+01
4,1,1,2,1,6,8.55999985e+01
4,1,1,2,1,7,1.19500000e+02
4,1,1,2,1,8,6.27999992e+01
4,1,1,2,2,1,1.00000001e-01
4,1,1,2,2,2,1.39999998e+00
4,1,1,2,2,3,5.05000000e+01
4,1,1,2,2,4,2.28999996e+01
4,1,1,2,2,5,4.37000008e+01
4,1,1,2,2,6,3.67000008e+01
4,1,1,2,2,7,1.13400002e+02
4,1,1,2,2,8,8.89999962e+00
4,1,1,2,3,1,0.00000000e+00
4,1,1,2,3,2,4.00000006e-01
4,1,1,2,3,3,3.02999992e+01
4,1,1,2,3,4,5.50000000e+00
4,1,1,2,3,5,6.50000000e+00
4,1,1,2,3,6,1.11000004e+01
4,1,1,2,3,7,8.01999969e+01
4,1,1,2,3,8,4.40000010e+00
4,1,2,1,1,1,3.20000005e+00
4,1,2,1,1,2,1.18000002e+01
4,1,2,1,1,3,4.52000008e+01
4,1,2,1,1,4,3.22999992e+01
4,1,2,1,1,5,5.50000000e+01
4,1,2,1,1,6,4.19000015e+01
4,1,2,1,1,7,9.63000031e+01
4,1,2,1,1,8,2.77999992e+01
4,1,2,1,2,1,0.00000000e+00
4,1,2,1,2,2,6.00000024e-01
4,1,2,1,2,3,2.60000000e+01
4,1,2,1,2,4,5.69999981e+00
4,1,2,1,2,5,7.19999981e+00
4,1,2,1,2,6,9.80000019e+00
4,1,2,1,2,7,6.94000015e+01
4,1,2,1,2,8,7.50000000e+00
4,1,2,1,3,1,0.00000000e+00
4,1,2,1,3,2,1.00000001e-01
4,1,2,1,3,3,1.03000002e+01
4,1,2,1,3,4,4.00000006e-01
4,1,2,1,3,5,1.00000001e-01
4,1,2,1,3,6,1.29999995e+00
4,1,2,1,3,7,3.60999985e+01
4,1,2,1,3,8,2.29999995e+00
4,1,2,2,1,1,3.29999995e+00
4,1,2,2,1,2,1.26000004e+01
4,1,2,2,1,3,4.82000008e+01
4,1,2,2,1,4,3.45000000e+01
4,1,2,2,1,5,5.95000000e+01
4,1,2,2,1,6,4.52999992e+01
4,1,2,2,1,7,1.03099998e+02
4,1,2,2,1,8,2.93999996e+01
4,1,2,2,2,1,0.00000000e+00
4,1,2,2,2,2,6.00000024e-01
4,1,2,2,2,3,2.80000000e+01
4,1,2,2,2,4,6.09999990e+00
4,1,2,2,2,5,8.00000000e+00
4,1,2,2,2,6,1.08999996e+01
4,1,2,2,2,7,7.38000031e+01
4,1,2,2,2,8,7.69999981e+00
4,1,2,2,3,1,0.00000000e+00
4,1,2,2,3,2,1.00000001e-01
4,1,2,2,3,3,1.08999996e+01
4,1,2,2,3,4,4.00000006e-01
4,1,2,2,3,5,1.00000001e-01
4,1,2,2,3,6,1.39999998e+00
4,1,2,2,3,7,3.80000000e+01
4,1,2,2,3,8,2.70000005e+00
4,1,3,1,1,1,1.00000000e+00
4,1,3,1,1,2,8.00000012e-01
4,1,3,1,1,3,1.91000004e+01
4,1,3,1,1,4,5.69999981e+00
4,1,3,1,1,5,1.06999998e+01
4,1,3,1,1,6,1.03199997e+01
4,1,3,1,1,7,4.97000008e+01
4,1,3,1,1,8,9.30000019e+00
4,1,3,1,2,1,0.00000000e+00
4,1,3,1,2,2,2.00000003e-01
4,1,3,1,2,3,6.30000019e+00
4,1,3,1,2,4,2.00000003e-01
4,1,3,1,2,5,1.00000001e-01
4,1,3,1,2,6,1.00000000e+00
4,1,3,1,2,7,2.40000000e+01
4,1,3,1,2,8,3.90000010e+00
4,1,3,1,3,1,0.00000000e+00
4,1,3,1,3,2,0.00000000e+00
4,1,3,1,3,3,1.60000002e+00
4,1,3,1,3,4,0.00000000e+00
4,1,3,1,3,5,0.00000000e+00
4,1,3,1,3,6,6.00000024e-01
4,1,3,1,3,7,1.00000000e+01
4,1,3,1,3,8,1.10000002e+00
4,1,3,2,1,1,1.39999998e+00
4,1,3,2,1,2,3.00000012e-01
4,1,3,2,1,3,6.00000000e+00
4,1,3,2,1,4,4.40000010e+00
4,1,3,2,1,5,8.99999976e-01
4,1,3,2,1,6,2.07999992e+01
4,1,3,2,1,7,3.37000008e+01
4,1,3,2,1,8,4.09999990e+00
4,1,3,2,2,1,0.00000000e+00
4,1,3,2,2,2,1.00000001e-01
4,1,3,2,2,3,1.39999998e+00
4,1,3,2,2,4,1.00000001e-01
4,1,3,2,2,5,0.00000000e+00
4,1,3,2,2,6,6.99999988e-01
4,1,3,2,2,7,1.33999996e+01
4,1,3,2,2,8,1.60000002e+00
4,1,3,2,3,1,0.00000000e+00
4,1,3,2,3,2,0.00000000e+00
4,1,3,2,3,3,3.00000012e-01
4,1,3,2,3,4,0.00000000e+00
4,1,3,2,3,5,0.00000000e+00
4,1,3,2,3,6,0.00000000e+00
4,1,3,2,3,7,5.69999981e+00
4,1,3,2,3,8,8.00000012e-01
4,2,1,1,1,1,-1.70000005e+00
4,2,1,1,1,2,-3.07999992e+01
4,2,1,1,1,3,-7.45999985e+01
4,2,1,1,1,4,-1.05099998e+02
4,2,1,1,1,5,-1.70699997e+02
4,2,1,1,1,6,-1.33800003e+02
4,2,1,1,1,7,-9.65000000e+01
4,2,1,1,1,8,-4.15000000e+01
4,2,1,1,2,1,0.00000000e+00
4,2,1,1,2,2,-5.00000000e-01
4,2,1,1,2,3,-5.90999985e+01
4,2,1,1,2,4,-6.54000015e+01
4,2,1,1,2,5,-1.57800003e+02
4,2,1,1,2,6,-9.30999985e+01
4,2,1,1,2,7,-7.54000015e+01
4,2,1,1,2,8,-1.39999998e+00
4,2,1,1,3,1,0.00000000e+00
4,2,1,1,3,2,-1.00000001e-01
4,2,1,1,3,3,-3.55999985e+01
4,2,1,1,3,4,-4.64000015e+01
4,2,1,1,3,5,-8.95000000e+01
4,2,1,1,3,6,-7.31999969e+01
4,2,1,1,3,7,-4.17000008e+01
4,2,1,1,3,8,-1.00000001e-01
4,2,1,2,1,1,-1.79999995e+00
4,2,1,2,1,2,-5.27000008e+01
4,2,1,2,1,3,-1.33300003e+02
4,2,1,2,1,4,-2.05699997e+02
4,2,1,2,1,5,-3.90299988e+02
4,2,1,2,1,6,-2.51800003e+02
4,2,1,2,1,7,-1.79899994e+02
4,2,1,2,1,8,-6.90999985e+01
4,2,1,2,2,1,0.00000000e+00
4,2,1,2,2,2,-5.00000000e-01
4,2,1,2,2,3,-1.02000000e+02
4,2,1,2,2,4,-1.44600006e+02
4,2,1,2,2,5,-3.82600006e+02
4,2,1,2,2,6,-2.04800003e+02
4,2,1,2,2,7,-1.39199997e+02
4,2,1,2,2,8,-1.50000000e+00
4,2,1,2,3,1,0.00000000e+00
4,2,1,2,3,2,-1.00000001e-01
4,2,1,2,3,3,-5.27000008e+01
4,2,1,2,3,4,-1.22900002e+02
4,2,1,2,3,5,-2.40800003e+02
4,2,1,2,3,6,-1.78600006e+02
4,2,1,2,3,7,-7.28000031e+01
4,2,1,2,3,8,-1.00000001e-01
4,2,2,1,1,1,-3.00000012e-01
4,2,2,1,1,2,-1.25000000e+01
4,2,2,1,1,3,-6.46999969e+01
4,2,2,1,1,4,-7.35999985e+01
4,2,2,1,1,5,-1.65300003e+02
4,2,2,1,1,6,-1.02599998e+02
4,2,2,1,1,7,-8.89000015e+01
4,2,2,1,1,8,-1.81000004e+01
4,2,2,1,2,1,0.00000000e+00
4,2,2,1,2,2,-2.00000003e-01
4,2,2,1,2,3,-3.75000000e+01
4,2,2,1,2,4,-4.27000008e+01
4,2,2,1,2,5,-9.88000031e+01
4,2,2,1,2,6,-6.86999969e+01
4,2,2,1,2,7,-5.12999992e+01
4,2,2,1,2,8,-6.00000024e-01
4,2,2,1,3,1,0.00000000e+00
4,2,2,1,3,2,0.00000000e+00
4,2,2,1,3,3,-1.85000000e+01
4,2,2,1,3,4,-2.57000008e+01
4,2,2,1,3,5,-4.04000015e+01
4,2,2,1,3,6,-4.67000008e+01
4,2,2,1,3,7,-2.57999992e+01
4,2,2,1,3,8,-1.00000001e-01
4,2,2,2,1,1,-4.00000006e-01
4,2,2,2,1,2,-1.93999996e+01
4,2,2,2,1,3,-1.17099998e+02
4,2,2,2,1,4,-1.52399994e+02
4,2,2,2,1,5,-3.86700012e+02
4,2,2,2,1,6,-2.08500000e+02
4,2,2,2,1,7,-1.70800003e+02
4,2,2,2,1,8,-2.90000000e+01
4,2,2,2,2,1,0.00000000e+00
4,2,2,2,2,2,-2.00000003e-01
4,2,2,2,2,3,-6.02000008e+01
4,2,2,2,2,4,-1.05699997e+02
4,2,2,2,2,5,-2.45600006e+02
4,2,2,2,2,6,-1.59399994e+02
4,2,2,2,2,7,-9.06999969e+01
4,2,2,2,2,8,-6.00000024e-01
4,2,2,2,3,1,0.00000000e+00
4,2,2,2,3,2,0.00000000e+00
4,2,2,2,3,3,-2.65000000e+01
4,2,2,2,3,4,-6.20000000e+01
4,2,2,2,3,5,-9.79000015e+01
4,2,2,2,3,6,-1.06400002e+02
4,2,2,2,3,7,-4.19000015e+01
4,2,2,2,3,8,-1.00000001e-01
4,2,3,1,1,1,0.00000000e+00
4,2,3,1,1,2,-3.00000012e-01
4,2,3,1,1,3,-3.40999985e+01
4,2,3,1,1,4,-3.16000004e+01
4,2,3,1,1,5,-9.65000000e+01
4,2,3,1,1,6,-5.64000015e+01
4,2,3,1,1,7,-5.25000000e+01
4,2,3,1,1,8,-1.10000002e+00
4,2,3,1,2,1,0.00000000e+00
4,2,3,1,2,2,0.00000000e+00
4,2,3,1,2,3,-1.26999998e+01
4,2,3,1,2,4,-1.51999998e+01
4,2,3,1,2,5,-2.82000008e+01
4,2,3,1,2,6,-3.35000000e+01
4,2,3,1,2,7,-2.55000000e+01
4,2,3,1,2,8,-3.00000012e-01
4,2,3,1,3,1,0.00000000e+00
4,2,3,1,3,2,0.00000000e+00
4,2,3,1,3,3,-3.90000010e+00
4,2,3,1,3,4,-6.09999990e+00
4,2,3,1,3,5,-6.00000024e-01
4,2,3,1,3,6,-1.83999996e+01
4,2,3,1,3,7,-8.89999962e+00
4,2,3,1,3,8,0.00000000e+00
4,2,3,2,1,1,-2.00000003e-01
4,2,3,2,1,2,-1.00000001e-01
4,2,3,2,1,3,-2.28999996e+01
4,2,3,2,1,4,-3.97000008e+01
4,2,3,2,1,5,-9.15000000e+01
4,2,3,2,1,6,-1.11000000e+02
4,2,3,2,1,7,-7.23000031e+01
4,2,3,2,1,8,-1.70000005e+00
4,2,3,2,2,1,0.00000000e+00
4,2,3,2,2,2,0.00000000e+00
4,2,3,2,2,3,-5.40000010e+00
4,2,3,2,2,4,-1.33999996e+01
4,2,3,2,2,5,-9.60000038e+00
4,2,3,2,2,6,-4.02999992e+01
4,2,3,2,2,7,-2.52000008e+01
4,2,3,2,2,8,0.00000000e+00
4,2,3,2,3,1,0.00000000e+00
4,2,3,2,3,2,0.00000000e+00
4,2,3,2,3,3,-1.39999998e+00
4,2,3,2,3,4,-4.19999981e+00
4,2,3,2,3,5,0.00000000e+00
4,2,3,2,3,6,-1.77000008e+01
4,2,3,2,3,7,-8.19999981e+00
4,2,3,2,3,8,0.00000000e+00
5,1,1,1,1,1,8.39999962e+00
5,1,1,1,1,2,3.92000008e+01
5,1,1,1,1,3,1.06699997e+02
5,1,1,1,1,4,8.19000015e+01
5,1,1,1,1,5,1.16099998e+02
5,1,1,1,1,6,9.66999969e+01
5,1,1,1,1,7,1.67500000e+02
5,1,1,1,1,8,5.65999985e+01
5,1,1,1,2,1,0.00000000e+00
5,1,1,1,2,2,2.00000000e+00
5,1,1,1,2,3,8.73000031e+01
5,1,1,1,2,4,2.57000008e+01
5,1,1,1,2,5,3.95999985e+01
5,1,1,1,2,6,3.90999985e+01
5,1,1,1,2,7,1.36100006e+02
5,1,1,1,2,8,1.13000002e+01
5,1,1,1,3,1,0.00000000e+00
5,1,1,1,3,2,6.00000024e-01
5,1,1,1,3,3,4.80000000e+01
5,1,1,1,3,4,6.69999981e+00
5,1,1,1,3,5,5.80000019e+00
5,1,1,1,3,6,1.31000004e+01
5,1,1,1,3,7,8.50000000e+01
5,1,1,1,3,8,4.40000010e+00
5,1,1,2,1,1,7.80000019e+00
5,1,1,2,1,2,2.92999992e+01
5,1,1,2,1,3,1.07000000e+02
5,1,1,2,1,4,7.13000031e+01
5,1,1,2,1,5,1.17900002e+02
5,1,1,2,1,6,8.81999969e+01
5,1,1,2,1,7,1.72800003e+02
5,1,1,2,1,8,5.05000000e+01
5,1,1,2,2,1,0.00000000e+00
5,1,1,2,2,2,1.89999998e+00
5,1,1,2,2,3,8.04000015e+01
5,1,1,2,2,4,1.97000008e+01
5,1,1,2,2,5,3.10000000e+01
5,1,1,2,2,6,3.30000000e+01
5,1,1,2,2,7,1.30899994e+02
5,1,1,2,2,8,1.26000004e+01
5,1,1,2,3,1,0.00000000e+00
5,1,1,2,3,2,5.00000000e-01
5,1,1,2,3,3,3.79000015e+01
5,1,1,2,3,4,4.59999990e+00
5,1,1,2,3,5,2.40000010e+00
5,1,1,2,3,6,9.30000019e+00
5,1,1,2,3,7,7.30000000e+01
5,1,1,2,3,8,4.00000000e+00
5,1,2,1,1,1,4.90000010e+00
5,1,2,1,1,2,4.59999990e+00
5,1,2,1,1,3,8.15999985e+01
5,1,2,1,1,4,3.32999992e+01
5,1,2,1,1,5,7.53000031e+01
5,1,2,1,1,6,5.15000000e+01
5,1,2,1,1,7,1.35699997e+02
5,1,2,1,1,8,2.18999996e+01
5,1,2,1,2,1,0.00000000e+00
5,1,2,1,2,2,1.10000002e+00
5,1,2,1,2,3,4.67000008e+01
5,1,2,1,2,4,6.00000000e+00
5,1,2,1,2,5,9.39999962e+00
5,1,2,1,2,6,1.28999996e+01
5,1,2,1,2,7,8.54000015e+01
5,1,2,1,2,8,1.08999996e+01
5,1,2,1,3,1,0.00000000e+00
5,1,2,1,3,2,3.00000012e-01
5,1,2,1,3,3,1.77999992e+01
5,1,2,1,3,4,8.99999976e-01
5,1,2,1,3,5,0.00000000e+00
5,1,2,1,3,6,3.29999995e+00
5,1,2,1,3,7,4.49000015e+01
5,1,2,1,3,8,3.00000000e+00
5,1,2,2,1,1,2.00000000e+00
5,1,2,2,1,2,2.09999990e+00
5,1,2,2,1,3,6.02999992e+01
5,1,2,2,1,4,1.72999992e+01
5,1,2,2,1,5,3.54000015e+01
5,1,2,2,1,6,2.81000004e+01
5,1,2,2,1,7,1.00699997e+02
5,1,2,2,1,8,1.63999996e+01
5,1,2,2,2,1,0.00000000e+00
5,1,2,2,2,2,8.00000012e-01
5,1,2,2,2,3,2.31000004e+01
5,1,2,2,2,4,2.09999990e+00
5,1,2,2,2,5,1.89999998e+00
5,1,2,2,2,6,5.00000000e+00
5,1,2,2,2,7,5.45000000e+01
5,1,2,2,2,8,7.80000019e+00
5,1,2,2,3,1,0.00000000e+00
5,1,2,2,3,2,2.00000003e-01
5,1,2,2,3,3,6.69999981e+00
5,1,2,2,3,4,2.00000003e-01
5,1,2,2,3,5,0.00000000e+00
5,1,2,2,3,6,8.00000012e-01
5,1,2,2,3,7,2.70000000e+01
5,1,2,2,3,8,2.40000010e+00
5,1,3,1,1,1,1.60000002e+00
5,1,3,1,1,2,1.39999998e+00
5,1,3,1,1,3,2.71000004e+01
5,1,3,1,1,4,4.09999990e+00
5,1,3,1,1,5,9.10000038e+00
5,1,3,1,1,6,9.50000000e+00
5,1,3,1,1,7,5.80000000e+01
5,1,3,1,1,8,1.23000002e+01
5,1,3,1,2,1,0.00000000e+00
5,1,3,1,2,2,3.00000012e-01
5,1,3,1,2,3,8.10000038e+00
5,1,3,1,2,4,5.00000000e-01
5,1,3,1,2,5,0.00000000e+00
5,1,3,1,2,6,1.50000000e+00
5,1,3,1,2,7,3.01000004e+01
5,1,3,1,2,8,3.40000010e+00
5,1,3,1,3,1,0.00000000e+00
5,1,3,1,3,2,1.00000001e-01
5,1,3,1,3,3,2.20000005e+00
5,1,3,1,3,4,0.00000000e+00
5,1,3,1,3,5,0.00000000e+00
5,1,3,1,3,6,0.00000000e+00
5,1,3,1,3,7,1.71000004e+01
5,1,3,1,3,8,1.70000005e+00
5,1,3,2,1,1,1.60000002e+00
5,1,3,2,1,2,1.10000002e+00
5,1,3,2,1,3,2.01000004e+01
5,1,3,2,1,4,3.00000000e+00
5,1,3,2,1,5,5.69999981e+00
5,1,3,2,1,6,8.69999981e+00
5,1,3,2,1,7,5.05999985e+01
5,1,3,2,1,8,1.13999996e+01
5,1,3,2,2,1,0.00000000e+00
5,1,3,2,2,2,3.00000012e-01
5,1,3,2,2,3,5.80000019e+00
5,1,3,2,2,4,3.00000012e-01
5,1,3,2,2,5,0.00000000e+00
5,1,3,2,2,6,1.10000002e+00
5,1,3,2,2,7,2.63999996e+01
5,1,3,2,2,8,2.90000010e+00
5,1,3,2,3,1,0.00000000e+00
5,1,3,2,3,2,1.00000001e-01
5,1,3,2,3,3,1.60000002e+00
5,1,3,2,3,4,0.00000000e+00
5,1,3,2,3,5,0.00000000e+00
5,1,3,2,3,6,0.00000000e+00
5,1,3,2,3,7,1.53000002e+01
5,1,3,2,3,8,1.70000005e+00
5,2,1,1,1,1,-1.70000005e+00
5,2,1,1,1,2,-3.30000000e+01
5,2,1,1,1,3,-1.44100006e+02
5,2,1,1,1,4,-1.24199997e+02
5,2,1,1,1,5,-2.42100006e+02
5,2,1,1,1,6,-1.53199997e+02
5,2,1,1,1,7,-1.37000000e+02
5,2,1,1,1,8,-3.99000015e+01
5,2,1,1,2,1,0.00000000e+00
5,2,1,1,2,2,-1.79999995e+00
5,2,1,1,2,3,-1.21900002e+02
5,2,1,1,2,4,-8.23000031e+01
5,2,1,1,2,5,-1.66300003e+02
5,2,1,1,2,6,-1.09699997e+02
5,2,1,1,2,7,-9.15999985e+01
5,2,1,1,2,8,-3.00000000e+00
5,2,1,1,3,1,0.00000000e+00
5,2,1,1,3,2,-5.00000000e-01
5,2,1,1,3,3,-8.51999969e+01
5,2,1,1,3,4,-6.22999992e+01
5,2,1,1,3,5,-8.25999985e+01
5,2,1,1,3,6,-7.90000000e+01
5,2,1,1,3,7,-5.02999992e+01
5,2,1,1,3,8,-8.00000012e-01
5,2,1,2,1,1,-1.50000000e+00
5,2,1,2,1,2,-3.52999992e+01
5,2,1,2,1,3,-2.15300003e+02
5,2,1,2,1,4,-2.26899994e+02
5,2,1,2,1,5,-5.63200012e+02
5,2,1,2,1,6,-2.85799988e+02
5,2,1,2,1,7,-2.43000000e+02
5,2,1,2,1,8,-4.59000015e+01
5,2,1,2,2,1,0.00000000e+00
5,2,1,2,2,2,-1.50000000e+00
5,2,1,2,2,3,-1.53300003e+02
5,2,1,2,2,4,-1.58600006e+02
5,2,1,2,2,5,-3.76399994e+02
5,2,1,2,2,6,-2.28300003e+02
5,2,1,2,2,7,-1.36699997e+02
5,2,1,2,2,8,-2.79999995e+00
5,2,1,2,3,1,0.00000000e+00
5,2,1,2,3,2,-4.00000006e-01
5,2,1,2,3,3,-8.80000000e+01
5,2,1,2,3,4,-1.14599998e+02
5,2,1,2,3,5,-1.53800003e+02
5,2,1,2,3,6,-1.57300003e+02
5,2,1,2,3,7,-6.46999969e+01
5,2,1,2,3,8,-6.99999988e-01
5,2,2,1,1,1,-8.00000012e-01
5,2,2,1,1,2,-6.30000019e+00
5,2,2,1,1,3,-1.21099998e+02
5,2,2,1,1,4,-8.15999985e+01
5,2,2,1,1,5,-1.91000000e+02
5,2,2,1,1,6,-1.09500000e+02
5,2,2,1,1,7,-1.12599998e+02
5,2,2,1,1,8,-1.08000002e+01
5,2,2,1,2,1,0.00000000e+00
5,2,2,1,2,2,-1.00000000e+00
5,2,2,1,2,3,-8.63000031e+01
5,2,2,1,2,4,-5.35000000e+01
5,2,2,1,2,5,-9.68000031e+01
5,2,2,1,2,6,-7.65000000e+01
5,2,2,1,2,7,-6.32000008e+01
5,2,2,1,2,8,-2.20000005e+00
5,2,2,1,3,1,0.00000000e+00
5,2,2,1,3,2,-2.00000003e-01
5,2,2,1,3,3,-4.00999985e+01
5,2,2,1,3,4,-3.47999992e+01
5,2,2,1,3,5,-1.88999996e+01
5,2,2,1,3,6,-4.40999985e+01
5,2,2,1,3,7,-3.18999996e+01
5,2,2,1,3,8,-5.00000000e-01
5,2,2,2,1,1,-3.00000012e-01
5,2,2,2,1,2,-2.09999990e+00
5,2,2,2,1,3,-1.39699997e+02
5,2,2,2,1,4,-1.22900002e+02
5,2,2,2,1,5,-3.49500000e+02
5,2,2,2,1,6,-1.75600006e+02
5,2,2,2,1,7,-1.51600006e+02
5,2,2,2,1,8,-4.69999981e+00
5,2,2,2,2,1,0.00000000e+00
5,2,2,2,2,2,-6.00000024e-01
5,2,2,2,2,3,-6.81999969e+01
5,2,2,2,2,4,-7.01999969e+01
5,2,2,2,2,5,-1.03599998e+02
5,2,2,2,2,6,-1.08599998e+02
5,2,2,2,2,7,-6.99000015e+01
5,2,2,2,2,8,-1.29999995e+00
5,2,2,2,3,1,0.00000000e+00
5,2,2,2,3,2,-1.00000001e-01
5,2,2,2,3,3,-2.35000000e+01
5,2,2,2,3,4,-3.30000000e+01
5,2,2,2,3,5,-3.29999995e+00
5,2,2,2,3,6,-5.17000008e+01
5,2,2,2,3,7,-2.57000008e+01
5,2,2,2,3,8,-3.00000012e-01
5,2,3,1,1,1,-2.00000003e-01
5,2,3,1,1,2,-1.10000002e+00
5,2,3,1,1,3,-5.92999992e+01
5,2,3,1,1,4,-3.25999985e+01
5,2,3,1,1,5,-7.70999985e+01
5,2,3,1,1,6,-5.39000015e+01
5,2,3,1,1,7,-5.99000015e+01
5,2,3,1,1,8,-2.50000000e+00
5,2,3,1,2,1,0.00000000e+00
5,2,3,1,2,2,-3.00000012e-01
5,2,3,1,2,3,-2.33999996e+01
5,2,3,1,2,4,-1.62000008e+01
5,2,3,1,2,5,-1.08000002e+01
5,2,3,1,2,6,-2.31000004e+01
5,2,3,1,2,7,-3.10000000e+01
5,2,3,1,2,8,-6.99999988e-01
5,2,3,1,3,1,0.00000000e+00
5,2,3,1,3,2,-1.00000001e-01
5,2,3,1,3,3,-6.50000000e+00
5,2,3,1,3,4,-6.19999981e+00
5,2,3,1,3,5,0.00000000e+00
5,2,3,1,3,6,-1.16000004e+01
5,2,3,1,3,7,-1.08999996e+01
5,2,3,1,3,8,-3.00000012e-01
5,2,3,2,1,1,-2.00000003e-01
5,2,3,2,1,2,-8.99999976e-01
5,2,3,2,1,3,-6.64000015e+01
5,2,3,2,1,4,-5.57000008e+01
5,2,3,2,1,5,-1.35100006e+02
5,2,3,2,1,6,-9.36999969e+01
5,2,3,2,1,7,-8.86999969e+01
5,2,3,2,1,8,-2.20000005e+00
5,2,3,2,2,1,0.00000000e+00
5,2,3,2,2,2,-2.00000003e-01
5,2,3,2,2,3,-2.21000004e+01
5,2,3,2,2,4,-2.43999996e+01
5,2,3,2,2,5,-1.26999998e+01
5,2,3,2,2,6,-3.94000015e+01
5,2,3,2,2,7,-3.82999992e+01
5,2,3,2,2,8,-5.00000000e-01
5,2,3,2,3,1,0.00000000e+00
5,2,3,2,3,2,-1.00000001e-01
5,2,3,2,3,3,-6.09999990e+00
5,2,3,2,3,4,-8.89999962e+00
5,2,3,2,3,5,0.00000000e+00
5,2,3,2,3,6,-1.82999992e+01
5,2,3,2,3,7,-1.33000002e+01
5,2,3,2,3,8,-2.00000003e-01
6,1,1,1,1,1,6.09999990e+00
6,1,1,1,1,2,2.07000008e+01
6,1,1,1,1,3,4.99000015e+01
6,1,1,1,1,4,4.64000015e+01
6,1,1,1,1,5,7.36999969e+01
6,1,1,1,1,6,6.70000000e+01
6,1,1,1,1,7,1.19300003e+02
6,1,1,1,1,8,4.69000015e+01
6,1,1,1,2,1,0.00000000e+00
6,1,1,1,2,2,5.00000000e-01
6,1,1,1,2,3,3.44000015e+01
6,1,1,1,2,4,1.01000004e+01
6,1,1,1,2,5,1.72999992e+01
6,1,1,1,2,6,2.07999992e+01
6,1,1,1,2,7,9.48000031e+01
6,1,1,1,2,8,9.10000038e+00
6,1,1,1,3,1,0.00000000e+00
6,1,1,1,3,2,-2.00000000e+00
6,1,1,1,3,3,1.66000004e+01
6,1,1,1,3,4,1.00000000e+00
6,1,1,1,3,5,3.00000012e-01
6,1,1,1,3,6,5.69999981e+00
6,1,1,1,3,7,5.82999992e+01
6,1,1,1,3,8,2.00000000e+00
6,1,1,2,1,1,5.19999981e+00
6,1,1,2,1,2,1.48000002e+01
6,1,1,2,1,3,4.50000000e+01
6,1,1,2,1,4,3.72000008e+01
6,1,1,2,1,5,6.68000031e+01
6,1,1,2,1,6,5.62000008e+01
6,1,1,2,1,7,1.11800003e+02
6,1,1,2,1,8,4.02000008e+01
6,1,1,2,2,1,0.00000000e+00
6,1,1,2,2,2,4.00000006e-01
6,1,1,2,2,3,2.77999992e+01
6,1,1,2,2,4,6.09999990e+00
6,1,1,2,2,5,7.50000000e+00
6,1,1,2,2,6,1.33999996e+01
6,1,1,2,2,7,8.25999985e+01
6,1,1,2,2,8,8.19999981e+00
6,1,1,2,3,1,0.00000000e+00
6,1,1,2,3,2,-2.00000003e-01
6,1,1,2,3,3,1.08000002e+01
6,1,1,2,3,4,5.00000000e-01
6,1,1,2,3,5,3.00000012e-01
6,1,1,2,3,6,3.20000005e+00
6,1,1,2,3,7,4.60999985e+01
6,1,1,2,3,8,1.60000002e+00
6,1,2,1,1,1,3.29999995e+00
6,1,2,1,1,2,3.79999995e+00
6,1,2,1,1,3,3.29000015e+01
6,1,2,1,1,4,1.88999996e+01
6,1,2,1,1,5,4.42999992e+01
6,1,2,1,1,6,3.45999985e+01
6,1,2,1,1,7,8.90000000e+01
6,1,2,1,1,8,1.61000004e+01
6,1,2,1,2,1,0.00000000e+00
6,1,2,1,2,2,1.00000001e-01
6,1,2,1,2,3,1.65000000e+01
6,1,2,1,2,4,1.29999995e+00
6,1,2,1,2,5,2.59999990e+00
6,1,2,1,2,6,6.30000019e+00
6,1,2,1,2,7,5.75000000e+01
6,1,2,1,2,8,5.90000010e+00
6,1,2,1,3,1,0.00000000e+00
6,1,2,1,3,2,-3.00000012e-01
6,1,2,1,3,3,4.59999990e+00
6,1,2,1,3,4,1.00000001e-01
6,1,2,1,3,5,1.00000001e-01
6,1,2,1,3,6,1.50000000e+00
6,1,2,1,3,7,2.46000004e+01
6,1,2,1,3,8,1.10000002e+00
6,1,2,2,1,1,4.00000006e-01
6,1,2,2,1,2,5.00000000e-01
6,1,2,2,1,3,1.95000000e+01
6,1,2,2,1,4,7.19999981e+00
6,1,2,2,1,5,1.31000004e+01
6,1,2,2,1,6,1.31999998e+01
6,1,2,2,1,7,6.05000000e+01
6,1,2,2,1,8,1.06000004e+01
6,1,2,2,2,1,0.00000000e+00
6,1,2,2,2,2,-2.00000003e-01
6,1,2,2,2,3,5.90000010e+00
6,1,2,2,2,4,2.00000003e-01
6,1,2,2,2,5,2.00000003e-01
6,1,2,2,2,6,2.09999990e+00
6,1,2,2,2,7,3.02999992e+01
6,1,2,2,2,8,3.40000010e+00
6,1,2,2,3,1,0.00000000e+00
6,1,2,2,3,2,0.00000000e+00
6,1,2,2,3,3,1.39999998e+00
6,1,2,2,3,4,0.00000000e+00
6,1,2,2,3,5,0.00000000e+00
6,1,2,2,3,6,1.50000000e+00
6,1,2,2,3,7,9.69999981e+00
6,1,2,2,3,8,6.00000024e-01
6,1,3,1,1,1,1.00000001e-01
6,1,3,1,1,2,1.00000001e-01
6,1,3,1,1,3,8.10000038e+00
6,1,3,1,1,4,1.29999995e+00
6,1,3,1,1,5,4.30000019e+00
6,1,3,1,1,6,4.50000000e+00
6,1,3,1,1,7,3.50999985e+01
6,1,3,1,1,8,7.00000000e+00
6,1,3,1,2,1,0.00000000e+00
6,1,3,1,2,2,-3.00000012e-01
6,1,3,1,2,3,2.20000005e+00
6,1,3,1,2,4,0.00000000e+00
6,1,3,1,2,5,1.00000001e-01
6,1,3,1,2,6,1.50000000e+00
6,1,3,1,2,7,1.38000002e+01
6,1,3,1,2,8,1.39999998e+00
6,1,3,1,3,1,0.00000000e+00
6,1,3,1,3,2,0.00000000e+00
6,1,3,1,3,3,2.00000003e-01
6,1,3,1,3,4,0.00000000e+00
6,1,3,1,3,5,0.00000000e+00
6,1,3,1,3,6,3.00000012e-01
6,1,3,1,3,7,4.80000019e+00
6,1,3,1,3,8,4.00000006e-01
6,1,3,2,1,1,1.70000005e+00
6,1,3,2,1,2,0.00000000e+00
6,1,3,2,1,3,5.30000019e+00
6,1,3,2,1,4,3.00000000e+00
6,1,3,2,1,5,2.90000010e+00
6,1,3,2,1,6,1.88999996e+01
6,1,3,2,1,7,3.77000008e+01
6,1,3,2,1,8,4.69999981e+00
6,1,3,2,2,1,0.00000000e+00
6,1,3,2,2,2,-3.00000012e-01
6,1,3,2,2,3,1.10000002e+00
6,1,3,2,2,4,0.00000000e+00
6,1,3,2,2,5,0.00000000e+00
6,1,3,2,2,6,1.60000002e+00
6,1,3,2,2,7,1.31000004e+01
6,1,3,2,2,8,8.00000012e-01
6,1,3,2,3,1,0.00000000e+00
6,1,3,2,3,2,0.00000000e+00
6,1,3,2,3,3,0.00000000e+00
6,1,3,2,3,4,0.00000000e+00
6,1,3,2,3,5,0.00000000e+00
6,1,3,2,3,6,3.00000012e-01
6,1,3,2,3,7,4.90000010e+00
6,1,3,2,3,8,2.00000003e-01
6,2,1,1,1,1,-1.50000000e+00
6,2,1,1,1,2,-2.61000004e+01
6,2,1,1,1,3,-9.65000000e+01
6,2,1,1,1,4,-1.02800003e+02
6,2,1,1,1,5,-1.96399994e+02
6,2,1,1,1,6,-1.48100006e+02
6,2,1,1,1,7,-1.41000000e+02
6,2,1,1,1,8,-3.80000000e+01
6,2,1,1,2,1,0.00000000e+00
6,2,1,1,2,2,-1.39999998e+00
6,2,1,1,2,3,-6.86999969e+01
6,2,1,1,2,4,-6.37999992e+01
6,2,1,1,2,5,-1.31800003e+02
6,2,1,1,2,6,-1.03500000e+02
6,2,1,1,2,7,-8.70000000e+01
6,2,1,1,2,8,-2.50000000e+00
6,2,1,1,3,1,0.00000000e+00
6,2,1,1,3,2,-1.00000001e-01
6,2,1,1,3,3,-4.50000000e+01
6,2,1,1,3,4,-3.95000000e+01
6,2,1,1,3,5,-5.99000015e+01
6,2,1,1,3,6,-7.38000031e+01
6,2,1,1,3,7,-5.00000000e+01
6,2,1,1,3,8,-4.00000006e-01
6,2,1,2,1,1,-1.39999998e+00
6,2,1,2,1,2,-2.68999996e+01
6,2,1,2,1,3,-1.32399994e+02
6,2,1,2,1,4,-1.61399994e+02
6,2,1,2,1,5,-3.82399994e+02
6,2,1,2,1,6,-2.42199997e+02
6,2,1,2,1,7,-2.14899994e+02
6,2,1,2,1,8,-4.57000008e+01
6,2,1,2,2,1,0.00000000e+00
6,2,1,2,2,2,-1.20000005e+00
6,2,1,2,2,3,-7.76999969e+01
6,2,1,2,2,4,-1.09199997e+02
6,2,1,2,2,5,-2.56299988e+02
6,2,1,2,2,6,-1.76699997e+02
6,2,1,2,2,7,-1.14199997e+02
6,2,1,2,2,8,-2.20000005e+00
6,2,1,2,3,1,0.00000000e+00
6,2,1,2,3,2,-1.00000001e-01
6,2,1,2,3,3,-4.22999992e+01
6,2,1,2,3,4,-6.51999969e+01
6,2,1,2,3,5,-1.04000000e+02
6,2,1,2,3,6,-1.23199997e+02
6,2,1,2,3,7,-5.79000015e+01
6,2,1,2,3,8,-3.00000012e-01
6,2,2,1,1,1,-1.10000002e+00
6,2,2,1,1,2,-6.19999981e+00
6,2,2,1,1,3,-7.05999985e+01
6,2,2,1,1,4,-6.55000000e+01
6,2,2,1,1,5,-1.55000000e+02
6,2,2,1,1,6,-1.08099998e+02
6,2,2,1,1,7,-1.02599998e+02
6,2,2,1,1,8,-7.90000010e+00
6,2,2,1,2,1,0.00000000e+00
6,2,2,1,2,2,-4.00000006e-01
6,2,2,1,2,3,-4.37999992e+01
6,2,2,1,2,4,-3.40999985e+01
6,2,2,1,2,5,-6.81999969e+01
6,2,2,1,2,6,-6.74000015e+01
6,2,2,1,2,7,-5.87999992e+01
6,2,2,1,2,8,-1.89999998e+00
6,2,2,1,3,1,0.00000000e+00
6,2,2,1,3,2,-1.00000001e-01
6,2,2,1,3,3,-2.03999996e+01
6,2,2,1,3,4,-1.87000008e+01
6,2,2,1,3,5,-1.53000002e+01
6,2,2,1,3,6,-4.60999985e+01
6,2,2,1,3,7,-3.25999985e+01
6,2,2,1,3,8,-2.00000003e-01
6,2,2,2,1,1,-1.00000001e-01
6,2,2,2,1,2,-1.50000000e+00
6,2,2,2,1,3,-7.00000000e+01
6,2,2,2,1,4,-8.00999985e+01
6,2,2,2,1,5,-2.36600006e+02
6,2,2,2,1,6,-1.41800003e+02
6,2,2,2,1,7,-1.24099998e+02
6,2,2,2,1,8,-3.59999990e+00
6,2,2,2,2,1,0.00000000e+00
6,2,2,2,2,2,-2.00000003e-01
6,2,2,2,2,3,-3.02000008e+01
6,2,2,2,2,4,-3.79000015e+01
6,2,2,2,2,5,-7.29000015e+01
6,2,2,2,2,6,-8.21999969e+01
6,2,2,2,2,7,-5.79000015e+01
6,2,2,2,2,8,-6.99999988e-01
6,2,2,2,3,1,0.00000000e+00
6,2,2,2,3,2,0.00000000e+00
6,2,2,2,3,3,-9.80000019e+00
6,2,2,2,3,4,-1.60000000e+01
6,2,2,2,3,5,-5.09999990e+00
6,2,2,2,3,6,-3.64000015e+01
6,2,2,2,3,7,-1.91000004e+01
6,2,2,2,3,8,-2.00000003e-01
6,2,3,1,1,1,-1.00000001e-01
6,2,3,1,1,2,-8.99999976e-01
6,2,3,1,1,3,-2.87999992e+01
6,2,3,1,1,4,-2.17999992e+01
6,2,3,1,1,5,-5.67000008e+01
6,2,3,1,1,6,-4.92000008e+01
6,2,3,1,1,7,-5.24000015e+01
6,2,3,1,1,8,-2.20000005e+00
6,2,3,1,2,1,0.00000000e+00
6,2,3,1,2,2,-1.00000001e-01
6,2,3,1,2,3,-1.10000000e+01
6,2,3,1,2,4,-8.69999981e+00
6,2,3,1,2,5,-8.60000038e+00
6,2,3,1,2,6,-3.07999992e+01
6,2,3,1,2,7,-2.98999996e+01
6,2,3,1,2,8,-5.00000000e-01
6,2,3,1,3,1,0.00000000e+00
6,2,3,1,3,2,0.00000000e+00
6,2,3,1,3,3,-3.09999990e+00
6,2,3,1,3,4,-3.29999995e+00
6,2,3,1,3,5,0.00000000e+00
6,2,3,1,3,6,-8.60000038e+00
6,2,3,1,3,7,-8.89999962e+00
6,2,3,1,3,8,-2.00000003e-01
6,2,3,2,1,1,-4.00000006e-01
6,2,3,2,1,2,-6.99999988e-01
6,2,3,2,1,3,-2.76000004e+01
6,2,3,2,1,4,-3.84000015e+01
6,2,3,2,1,5,-9.10000000e+01
6,2,3,2,1,6,-1.17300003e+02
6,2,3,2,1,7,-8.65999985e+01
6,2,3,2,1,8,-1.50000000e+00
6,2,3,2,2,1,0.00000000e+00
6,2,3,2,2,2,-1.00000001e-01
6,2,3,2,2,3,-8.50000000e+00
6,2,3,2,2,4,-1.28000002e+01
6,2,3,2,2,5,-1.15000000e+01
6,2,3,2,2,6,-4.77999992e+01
6,2,3,2,2,7,-3.60999985e+01
6,2,3,2,2,8,-2.00000003e-01
6,2,3,2,3,1,0.00000000e+00
6,2,3,2,3,2,0.00000000e+00
6,2,3,2,3,3,-2.40000010e+00
6,2,3,2,3,4,-4.69999981e+00
6,2,3,2,3,5,0.00000000e+00
6,2,3,2,3,6,-1.36000004e+01
6,2,3,2,3,7,-1.06000004e+01
6,2,3,2,3,8,-1.00000001e-01
7,1,1,1,1,1,4.69999981e+00
7,1,1,1,1,2,1.58000002e+01
7,1,1,1,1,3,4.05999985e+01
7,1,1,1,1,4,3.25000000e+01
7,1,1,1,1,5,4.97999992e+01
7,1,1,1,1,6,4.12999992e+01
7,1,1,1,1,7,8.99000015e+01
7,1,1,1,1,8,3.12999992e+01
7,1,1,1,2,1,0.00000000e+00
7,1,1,1,2,2,8.99999976e-01
7,1,1,1,2,3,2.97000008e+01
7,1,1,1,2,4,9.19999981e+00
7,1,1,1,2,5,1.53000002e+01
7,1,1,1,2,6,1.55000000e+01
7,1,1,1,2,7,7.59000015e+01
7,1,1,1,2,8,6.50000000e+00
7,1,1,1,3,1,0.00000000e+00
7,1,1,1,3,2,2.00000003e-01
7,1,1,1,3,3,1.51999998e+01
7,1,1,1,3,4,1.50000000e+00
7,1,1,1,3,5,1.60000002e+00
7,1,1,1,3,6,2.59999990e+00
7,1,1,1,3,7,4.92999992e+01
7,1,1,1,3,8,2.20000005e+00
7,1,1,2,1,1,3.90000010e+00
7,1,1,2,1,2,1.23999996e+01
7,1,1,2,1,3,3.87000008e+01
7,1,1,2,1,4,2.85000000e+01
7,1,1,2,1,5,4.84000015e+01
7,1,1,2,1,6,3.64000015e+01
7,1,1,2,1,7,8.96999969e+01
7,1,1,2,1,8,2.70000000e+01
7,1,1,2,2,1,0.00000000e+00
7,1,1,2,2,2,6.99999988e-01
7,1,1,2,2,3,2.48999996e+01
7,1,1,2,2,4,5.59999990e+00
7,1,1,2,2,5,8.00000000e+00
7,1,1,2,2,6,8.80000019e+00
7,1,1,2,2,7,7.01999969e+01
7,1,1,2,2,8,6.30000019e+00
7,1,1,2,3,1,0.00000000e+00
7,1,1,2,3,2,2.00000003e-01
7,1,1,2,3,3,1.25000000e+01
7,1,1,2,3,4,8.99999976e-01
7,1,1,2,3,5,5.00000000e-01
7,1,1,2,3,6,1.79999995e+00
7,1,1,2,3,7,4.15999985e+01
7,1,1,2,3,8,1.70000005e+00
7,1,2,1,1,1,2.00000000e+00
7,1,2,1,1,2,3.00000000e+00
7,1,2,1,1,3,2.57999992e+01
7,1,2,1,1,4,1.28999996e+01
7,1,2,1,1,5,3.15000000e+01
7,1,2,1,1,6,1.96000004e+01
7,1,2,1,1,7,6.90999985e+01
7,1,2,1,1,8,1.23999996e+01
7,1,2,1,2,1,0.00000000e+00
7,1,2,1,2,2,4.00000006e-01
7,1,2,1,2,3,1.48999996e+01
7,1,2,1,2,4,2.00000000e+00
7,1,2,1,2,5,2.40000010e+00
7,1,2,1,2,6,3.20000005e+00
7,1,2,1,2,7,4.72999992e+01
7,1,2,1,2,8,4.90000010e+00
7,1,2,1,3,1,0.00000000e+00
7,1,2,1,3,2,1.00000001e-01
7,1,2,1,3,3,6.00000000e+00
7,1,2,1,3,4,2.00000003e-01
7,1,2,1,3,5,-1.00000001e-01
7,1,2,1,3,6,4.00000006e-01
7,1,2,1,3,7,2.38999996e+01
7,1,2,1,3,8,1.00000000e+00
7,1,2,2,1,1,1.10000002e+00
7,1,2,2,1,2,8.99999976e-01
7,1,2,2,1,3,1.77000008e+01
7,1,2,2,1,4,5.40000010e+00
7,1,2,2,1,5,1.15000000e+01
7,1,2,2,1,6,9.00000000e+00
7,1,2,2,1,7,5.12999992e+01
7,1,2,2,1,8,8.39999962e+00
7,1,2,2,2,1,0.00000000e+00
7,1,2,2,2,2,2.00000003e-01
7,1,2,2,2,3,7.50000000e+00
7,1,2,2,2,4,5.00000000e-01
7,1,2,2,2,5,4.00000006e-01
7,1,2,2,2,6,6.99999988e-01
7,1,2,2,2,7,2.93999996e+01
7,1,2,2,2,8,3.29999995e+00
7,1,2,2,3,1,0.00000000e+00
7,1,2,2,3,2,1.00000001e-01
7,1,2,2,3,3,1.89999998e+00
7,1,2,2,3,4,0.00000000e+00
7,1,2,2,3,5,0.00000000e+00
7,1,2,2,3,6,2.00000003e-01
7,1,2,2,3,7,1.25000000e+01
7,1,2,2,3,8,6.99999988e-01
7,1,3,1,1,1,1.00000001e-01
7,1,3,1,1,2,4.00000006e-01
7,1,3,1,1,3,8.30000019e+00
7,1,3,1,1,4,1.29999995e+00
7,1,3,1,1,5,2.50000000e+00
7,1,3,1,1,6,2.40000010e+00
7,1,3,1,1,7,2.85000000e+01
7,1,3,1,1,8,6.00000000e+00
7,1,3,1,2,1,0.00000000e+00
7,1,3,1,2,2,1.00000001e-01
7,1,3,1,2,3,2.50000000e+00
7,1,3,1,2,4,0.00000000e+00
7,1,3,1,2,5,-1.00000001e-01
7,1,3,1,2,6,1.00000001e-01
7,1,3,1,2,7,1.38000002e+01
7,1,3,1,2,8,2.00000000e+00
7,1,3,1,3,1,0.00000000e+00
7,1,3,1,3,2,0.00000000e+00
7,1,3,1,3,3,6.00000024e-01
7,1,3,1,3,4,0.00000000e+00
7,1,3,1,3,5,0.00000000e+00
7,1,3,1,3,6,0.00000000e+00
7,1,3,1,3,7,5.19999981e+00
7,1,3,1,3,8,4.00000006e-01
7,1,3,2,1,1,1.20000005e+00
7,1,3,2,1,2,3.00000012e-01
7,1,3,2,1,3,6.30000019e+00
7,1,3,2,1,4,3.00000000e+00
7,1,3,2,1,5,1.20000005e+00
7,1,3,2,1,6,1.03999996e+01
7,1,3,2,1,7,3.08999996e+01
7,1,3,2,1,8,3.70000005e+00
7,1,3,2,2,1,0.00000000e+00
7,1,3,2,2,2,1.00000001e-01
7,1,3,2,2,3,1.70000005e+00
7,1,3,2,2,4,0.00000000e+00
7,1,3,2,2,5,0.00000000e+00
7,1,3,2,2,6,2.00000003e-01
7,1,3,2,2,7,1.36999998e+01
7,1,3,2,2,8,1.50000000e+00
7,1,3,2,3,1,0.00000000e+00
7,1,3,2,3,2,0.00000000e+00
7,1,3,2,3,3,4.00000006e-01
7,1,3,2,3,4,-1.00000001e-01
7,1,3,2,3,5,0.00000000e+00
7,1,3,2,3,6,0.00000000e+00
7,1,3,2,3,7,5.69999981e+00
7,1,3,2,3,8,2.00000003e-01
7,2,1,1,1,1,-1.00000000e+00
7,2,1,1,1,2,-2.35000000e+01
7,2,1,1,1,3,-7.60999985e+01
7,2,1,1,1,4,-9.81999969e+01
7,2,1,1,1,5,-1.90300003e+02
7,2,1,1,1,6,-1.40899994e+02
7,2,1,1,1,7,-1.25800003e+02
7,2,1,1,1,8,-2.86000004e+01
7,2,1,1,2,1,0.00000000e+00
7,2,1,1,2,2,-6.00000024e-01
7,2,1,1,2,3,-5.25999985e+01
7,2,1,1,2,4,-6.32999992e+01
7,2,1,1,2,5,-1.46600006e+02
7,2,1,1,2,6,-1.11199997e+02
7,2,1,1,2,7,-8.34000015e+01
7,2,1,1,2,8,-1.20000005e+00
7,2,1,1,3,1,0.00000000e+00
7,2,1,1,3,2,-1.00000001e-01
7,2,1,1,3,3,-3.22999992e+01
7,2,1,1,3,4,-3.99000015e+01
7,2,1,1,3,5,-7.40999985e+01
7,2,1,1,3,6,-8.20000000e+01
7,2,1,1,3,7,-4.17999992e+01
7,2,1,1,3,8,-3.00000012e-01
7,2,1,2,1,1,-6.00000024e-01
7,2,1,2,1,2,-2.38999996e+01
7,2,1,2,1,3,-1.19099998e+02
7,2,1,2,1,4,-1.60000000e+02
7,2,1,2,1,5,-4.09200012e+02
7,2,1,2,1,6,-2.53100006e+02
7,2,1,2,1,7,-2.19800003e+02
7,2,1,2,1,8,-3.60000000e+01
7,2,1,2,2,1,0.00000000e+00
7,2,1,2,2,2,-4.00000006e-01
7,2,1,2,2,3,-6.66999969e+01
7,2,1,2,2,4,-1.12099998e+02
7,2,1,2,2,5,-3.06799988e+02
7,2,1,2,2,6,-2.12100006e+02
7,2,1,2,2,7,-1.17800003e+02
7,2,1,2,2,8,-1.10000002e+00
7,2,1,2,3,1,0.00000000e+00
7,2,1,2,3,2,-1.00000001e-01
7,2,1,2,3,3,-3.37000008e+01
7,2,1,2,3,4,-7.36999969e+01
7,2,1,2,3,5,-1.33800003e+02
7,2,1,2,3,6,-1.55300003e+02
7,2,1,2,3,7,-5.15000000e+01
7,2,1,2,3,8,-2.00000003e-01
7,2,2,1,1,1,-3.00000012e-01
7,2,2,1,1,2,-4.09999990e+00
7,2,2,1,1,3,-5.89000015e+01
7,2,2,1,1,4,-5.94000015e+01
7,2,2,1,1,5,-1.59800003e+02
7,2,2,1,1,6,-1.07000000e+02
7,2,2,1,1,7,-1.02500000e+02
7,2,2,1,1,8,-5.90000010e+00
7,2,2,1,2,1,0.00000000e+00
7,2,2,1,2,2,-3.00000012e-01
7,2,2,1,2,3,-3.32999992e+01
7,2,2,1,2,4,-3.50999985e+01
7,2,2,1,2,5,-8.90999985e+01
7,2,2,1,2,6,-7.90999985e+01
7,2,2,1,2,7,-5.99000015e+01
7,2,2,1,2,8,-8.99999976e-01
7,2,2,1,3,1,0.00000000e+00
7,2,2,1,3,2,-1.00000001e-01
7,2,2,1,3,3,-1.53000002e+01
7,2,2,1,3,4,-2.08999996e+01
7,2,2,1,3,5,-2.45000000e+01
7,2,2,1,3,6,-5.35999985e+01
7,2,2,1,3,7,-2.70000000e+01
7,2,2,1,3,8,-1.00000001e-01
7,2,2,2,1,1,-2.00000003e-01
7,2,2,2,1,2,-8.99999976e-01
7,2,2,2,1,3,-6.40000000e+01
7,2,2,2,1,4,-8.19000015e+01
7,2,2,2,1,5,-2.80600006e+02
7,2,2,2,1,6,-1.67699997e+02
7,2,2,2,1,7,-1.39199997e+02
7,2,2,2,1,8,-2.29999995e+00
7,2,2,2,2,1,0.00000000e+00
7,2,2,2,2,2,-1.00000001e-01
7,2,2,2,2,3,-2.62000008e+01
7,2,2,2,2,4,-4.39000015e+01
7,2,2,2,2,5,-9.95999985e+01
7,2,2,2,2,6,-1.07699997e+02
7,2,2,2,2,7,-6.29000015e+01
7,2,2,2,2,8,-6.00000024e-01
7,2,2,2,3,1,0.00000000e+00
7,2,2,2,3,2,0.00000000e+00
7,2,2,2,3,3,-9.00000000e+00
7,2,2,2,3,4,-2.05000000e+01
7,2,2,2,3,5,-1.43000002e+01
7,2,2,2,3,6,-6.44000015e+01
7,2,2,2,3,7,-2.26000004e+01
7,2,2,2,3,8,-1.00000001e-01
7,2,3,1,1,1,0.00000000e+00
7,2,3,1,1,2,-3.00000012e-01
7,2,3,1,1,3,-2.37999992e+01
7,2,3,1,1,4,-2.17999992e+01
7,2,3,1,1,5,-6.98000031e+01
7,2,3,1,1,6,-5.65999985e+01
7,2,3,1,1,7,-5.67999992e+01
7,2,3,1,1,8,-1.79999995e+00
7,2,3,1,2,1,0.00000000e+00
7,2,3,1,2,2,-1.00000001e-01
7,2,3,1,2,3,-9.10000038e+00
7,2,3,1,2,4,-9.69999981e+00
7,2,3,1,2,5,-1.35000000e+01
7,2,3,1,2,6,-3.55999985e+01
7,2,3,1,2,7,-3.25999985e+01
7,2,3,1,2,8,-4.00000006e-01
7,2,3,1,3,1,0.00000000e+00
7,2,3,1,3,2,0.00000000e+00
7,2,3,1,3,3,-2.90000010e+00
7,2,3,1,3,4,-4.00000000e+00
7,2,3,1,3,5,-2.00000003e-01
7,2,3,1,3,6,-2.42999992e+01
7,2,3,1,3,7,-1.08000002e+01
7,2,3,1,3,8,-1.00000001e-01
7,2,3,2,1,1,-2.00000003e-01
7,2,3,2,1,2,-3.00000012e-01
7,2,3,2,1,3,-2.56000004e+01
7,2,3,2,1,4,-3.95999985e+01
7,2,3,2,1,5,-1.18500000e+02
7,2,3,2,1,6,-1.29100006e+02
7,2,3,2,1,7,-1.00900002e+02
7,2,3,2,1,8,-6.99999988e-01
7,2,3,2,2,1,0.00000000e+00
7,2,3,2,2,2,-1.00000001e-01
7,2,3,2,2,3,-7.90000010e+00
7,2,3,2,2,4,-1.63999996e+01
7,2,3,2,2,5,-1.96000004e+01
7,2,3,2,2,6,-6.37000008e+01
7,2,3,2,2,7,-4.00000000e+01
7,2,3,2,2,8,-2.00000003e-01
7,2,3,2,3,1,0.00000000e+00
7,2,3,2,3,2,0.00000000e+00
7,2,3,2,3,3,-2.50000000e+00
7,2,3,2,3,4,-6.40000010e+00
7,2,3,2,3,5,0.00000000e+00
7,2,3,2,3,6,-3.52000008e+01
7,2,3,2,3,7,-1.20000000e+01
7,2,3,2,3,8,-1.00000001e-01
8,1,1,1,1,1,3.00000012e-01
8,1,1,1,1,2,3.29999995e+00
8,1,1,1,1,3,5.50000000e+00
8,1,1,1,1,4,9.60000038e+00
8,1,1,1,1,5,1.30000000e+01
8,1,1,1,1,6,1.03999996e+01
8,1,1,1,1,7,1.40000000e+01
8,1,1,1,1,8,4.80000019e+00
8,1,1,1,2,1,0.00000000e+00
8,1,1,1,2,2,1.00000001e-01
8,1,1,1,2,3,4.59999990e+00
8,1,1,1,2,4,3.09999990e+00
8,1,1,1,2,5,9.50000000e+00
8,1,1,1,2,6,7.50000000e+00
8,1,1,1,2,7,1.46000004e+01
8,1,1,1,2,8,6.00000024e-01
8,1,1,1,3,1,0.00000000e+00
8,1,1,1,3,2,0.00000000e+00
8,1,1,1,3,3,2.79999995e+00
8,1,1,1,3,4,1.29999995e+00
8,1,1,1,3,5,2.20000005e+00
8,1,1,1,3,6,3.20000005e+00
8,1,1,1,3,7,1.11999998e+01
8,1,1,1,3,8,2.00000003e-01
8,1,1,2,1,1,4.00000006e-01
8,1,1,2,1,2,3.70000005e+00
8,1,1,2,1,3,6.19999981e+00
8,1,1,2,1,4,1.01000004e+01
8,1,1,2,1,5,1.36999998e+01
8,1,1,2,1,6,1.11000004e+01
8,1,1,2,1,7,1.45000000e+01
8,1,1,2,1,8,5.09999990e+00
8,1,1,2,2,1,0.00000000e+00
8,1,1,2,2,2,1.00000001e-01
8,1,1,2,2,3,5.19999981e+00
8,1,1,2,2,4,3.29999995e+00
8,1,1,2,2,5,1.01999998e+01
8,1,1,2,2,6,7.90000010e+00
8,1,1,2,2,7,1.53000002e+01
8,1,1,2,2,8,6.00000024e-01
8,1,1,2,3,1,0.00000000e+00
8,1,1,2,3,2,0.00000000e+00
8,1,1,2,3,3,3.00000000e+00
8,1,1,2,3,4,1.39999998e+00
8,1,1,2,3,5,2.59999990e+00
8,1,1,2,3,6,3.79999995e+00
8,1,1,2,3,7,1.21999998e+01
8,1,1,2,3,8,2.00000003e-01
8,1,2,1,1,1,2.00000003e-01
8,1,2,1,1,2,1.29999995e+00
8,1,2,1,1,3,4.90000010e+00
8,1,2,1,1,4,5.40000010e+00
8,1,2,1,1,5,1.13000002e+01
8,1,2,1,1,6,8.00000000e+00
8,1,2,1,1,7,1.38000002e+01
8,1,2,1,1,8,2.79999995e+00
8,1,2,1,2,1,0.00000000e+00
8,1,2,1,2,2,0.00000000e+00
8,1,2,1,2,3,2.90000010e+00
8,1,2,1,2,4,1.20000005e+00
8,1,2,1,2,5,3.00000000e+00
8,1,2,1,2,6,3.50000000e+00
8,1,2,1,2,7,1.16000004e+01
8,1,2,1,2,8,3.00000012e-01
8,1,2,1,3,1,0.00000000e+00
8,1,2,1,3,2,0.00000000e+00
8,1,2,1,3,3,1.10000002e+00
8,1,2,1,3,4,2.00000003e-01
8,1,2,1,3,5,0.00000000e+00
8,1,2,1,3,6,8.99999976e-01
8,1,2,1,3,7,6.50000000e+00
8,1,2,1,3,8,1.00000001e-01
8,1,2,2,1,1,2.00000003e-01
8,1,2,2,1,2,1.29999995e+00
8,1,2,2,1,3,5.19999981e+00
8,1,2,2,1,4,5.59999990e+00
8,1,2,2,1,5,1.18999996e+01
8,1,2,2,1,6,8.39999962e+00
8,1,2,2,1,7,1.46999998e+01
8,1,2,2,1,8,3.09999990e+00
8,1,2,2,2,1,0.00000000e+00
8,1,2,2,2,2,0.00000000e+00
8,1,2,2,2,3,3.09999990e+00
8,1,2,2,2,4,1.20000005e+00
8,1,2,2,2,5,3.09999990e+00
8,1,2,2,2,6,3.59999990e+00
8,1,2,2,2,7,1.20000000e+01
8,1,2,2,2,8,3.00000012e-01
8,1,2,2,3,1,0.00000000e+00
8,1,2,2,3,2,0.00000000e+00
8,1,2,2,3,3,1.10000002e+00
8,1,2,2,3,4,2.00000003e-01
8,1,2,2,3,5,0.00000000e+00
8,1,2,2,3,6,8.99999976e-01
8,1,2,2,3,7,6.90000010e+00
8,1,2,2,3,8,1.00000001e-01
8,1,3,1,1,1,0.00000000e+00
8,1,3,1,1,2,0.00000000e+00
8,1,3,1,1,3,2.40000010e+00
8,1,3,1,1,4,8.99999976e-01
8,1,3,1,1,5,4.00000000e+00
8,1,3,1,1,6,3.20000005e+00
8,1,3,1,1,7,9.19999981e+00
8,1,3,1,1,8,6.99999988e-01
8,1,3,1,2,1,0.00000000e+00
8,1,3,1,2,2,0.00000000e+00
8,1,3,1,2,3,6.99999988e-01
8,1,3,1,2,4,1.00000001e-01
8,1,3,1,2,5,1.00000001e-01
8,1,3,1,2,6,5.00000000e-01
8,1,3,1,2,7,5.00000000e+00
8,1,3,1,2,8,2.00000003e-01
8,1,3,1,3,1,0.00000000e+00
8,1,3,1,3,2,0.00000000e+00
8,1,3,1,3,3,2.00000003e-01
8,1,3,1,3,4,0.00000000e+00
8,1,3,1,3,5,0.00000000e+00
8,1,3,1,3,6,2.00000003e-01
8,1,3,1,3,7,1.89999998e+00
8,1,3,1,3,8,0.00000000e+00
8,1,3,2,1,1,0.00000000e+00
8,1,3,2,1,2,0.00000000e+00
8,1,3,2,1,3,6.99999988e-01
8,1,3,2,1,4,1.00000001e-01
8,1,3,2,1,5,5.00000000e-01
8,1,3,2,1,6,3.00000012e-01
8,1,3,2,1,7,3.00000000e+00
8,1,3,2,1,8,4.00000006e-01
8,1,3,2,2,1,0.00000000e+00
8,1,3,2,2,2,0.00000000e+00
8,1,3,2,2,3,2.00000003e-01
8,1,3,2,2,4,0.00000000e+00
8,1,3,2,2,5,0.00000000e+00
8,1,3,2,2,6,0.00000000e+00
8,1,3,2,2,7,1.10000002e+00
8,1,3,2,2,8,1.00000001e-01
8,1,3,2,3,1,0.00000000e+00
8,1,3,2,3,2,0.00000000e+00
8,1,3,2,3,3,1.00000001e-01
8,1,3,2,3,4,0.00000000e+00
8,1,3,2,3,5,0.00000000e+00
8,1,3,2,3,6,0.00000000e+00
8,1,3,2,3,7,4.00000006e-01
8,1,3,2,3,8,0.00000000e+00
8,2,1,1,1,1,-1.29999995e+00
8,2,1,1,1,2,-2.97999992e+01
8,2,1,1,1,3,-6.07000008e+01
8,2,1,1,1,4,-6.90000000e+01
8,2,1,1,1,5,-8.89000015e+01
8,2,1,1,1,6,-6.58000031e+01
8,2,1,1,1,7,-4.67999992e+01
8,2,1,1,1,8,-2.08999996e+01
8,2,1,1,2,1,0.00000000e+00
8,2,1,1,2,2,-2.09999990e+00
8,2,1,1,2,3,-6.80999985e+01
8,2,1,1,2,4,-4.14000015e+01
8,2,1,1,2,5,-8.23000031e+01
8,2,1,1,2,6,-4.82000008e+01
8,2,1,1,2,7,-3.37999992e+01
8,2,1,1,2,8,-1.50000000e+00
8,2,1,1,3,1,0.00000000e+00
8,2,1,1,3,2,-6.00000024e-01
8,2,1,1,3,3,-6.44000015e+01
8,2,1,1,3,4,-3.05000000e+01
8,2,1,1,3,5,-4.97000008e+01
8,2,1,1,3,6,-3.90000000e+01
8,2,1,1,3,7,-1.87999992e+01
8,2,1,1,3,8,-6.00000024e-01
8,2,1,2,1,1,-1.29999995e+00
8,2,1,2,1,2,-4.22999992e+01
8,2,1,2,1,3,-9.89000015e+01
8,2,1,2,1,4,-1.08300003e+02
8,2,1,2,1,5,-1.75000000e+02
8,2,1,2,1,6,-1.04500000e+02
8,2,1,2,1,7,-7.29000015e+01
8,2,1,2,1,8,-3.08999996e+01
8,2,1,2,2,1,0.00000000e+00
8,2,1,2,2,2,-2.20000005e+00
8,2,1,2,2,3,-9.03000031e+01
8,2,1,2,2,4,-8.00999985e+01
8,2,1,2,2,5,-1.72899994e+02
8,2,1,2,2,6,-8.86999969e+01
8,2,1,2,2,7,-5.05999985e+01
8,2,1,2,2,8,-1.50000000e+00
8,2,1,2,3,1,0.00000000e+00
8,2,1,2,3,2,-6.99999988e-01
8,2,1,2,3,3,-7.76999969e+01
8,2,1,2,3,4,-6.68000031e+01
8,2,1,2,3,5,-1.19800003e+02
8,2,1,2,3,6,-7.90000000e+01
8,2,1,2,3,7,-2.62000008e+01
8,2,1,2,3,8,-6.99999988e-01
8,2,2,1,1,1,-6.00000024e-01
8,2,2,1,1,2,-1.38999996e+01
8,2,2,1,1,3,-6.81999969e+01
8,2,2,1,1,4,-5.15999985e+01
8,2,2,1,1,5,-8.88000031e+01
8,2,2,1,1,6,-5.85000000e+01
8,2,2,1,1,7,-4.17999992e+01
8,2,2,1,1,8,-1.21999998e+01
8,2,2,1,2,1,0.00000000e+00
8,2,2,1,2,2,-8.99999976e-01
8,2,2,1,2,3,-5.97000008e+01
8,2,2,1,2,4,-2.97999992e+01
8,2,2,1,2,5,-5.59000015e+01
8,2,2,1,2,6,-3.92999992e+01
8,2,2,1,2,7,-2.43999996e+01
8,2,2,1,2,8,-1.20000005e+00
8,2,2,1,3,1,0.00000000e+00
8,2,2,1,3,2,-3.00000012e-01
8,2,2,1,3,3,-2.21000004e+01
8,2,2,1,3,4,-1.68999996e+01
8,2,2,1,3,5,-2.70000000e+01
8,2,2,1,3,6,-2.63999996e+01
8,2,2,1,3,7,-1.25000000e+01
8,2,2,1,3,8,-4.00000006e-01
8,2,2,2,1,1,-6.00000024e-01
8,2,2,2,1,2,-1.92000008e+01
8,2,2,2,1,3,-9.75000000e+01
8,2,2,2,1,4,-8.98000031e+01
8,2,2,2,1,5,-1.78699997e+02
8,2,2,2,1,6,-9.88000031e+01
8,2,2,2,1,7,-6.74000015e+01
8,2,2,2,1,8,-1.75000000e+01
8,2,2,2,2,1,0.00000000e+00
8,2,2,2,2,2,-1.00000000e+00
8,2,2,2,2,3,-7.45999985e+01
8,2,2,2,2,4,-6.12999992e+01
8,2,2,2,2,5,-1.24199997e+02
8,2,2,2,2,6,-7.50999985e+01
8,2,2,2,2,7,-3.52000008e+01
8,2,2,2,2,8,-1.29999995e+00
8,2,2,2,3,1,0.00000000e+00
8,2,2,2,3,2,-3.00000012e-01
8,2,2,2,3,3,-5.49000015e+01
8,2,2,2,3,4,-3.70000000e+01
8,2,2,2,3,5,-6.10000000e+01
8,2,2,2,3,6,-5.17000008e+01
8,2,2,2,3,7,-1.70000000e+01
8,2,2,2,3,8,-4.00000006e-01
8,2,3,1,1,1,-2.00000003e-01
8,2,3,1,1,2,-1.70000005e+00
8,2,3,1,1,3,-4.47999992e+01
8,2,3,1,1,4,-2.62000008e+01
8,2,3,1,1,5,-5.35999985e+01
8,2,3,1,1,6,-3.27999992e+01
8,2,3,1,1,7,-2.60000000e+01
8,2,3,1,1,8,-1.79999995e+00
8,2,3,1,2,1,0.00000000e+00
8,2,3,1,2,2,-4.00000006e-01
8,2,3,1,2,3,-2.95000000e+01
8,2,3,1,2,4,-1.13000002e+01
8,2,3,1,2,5,-2.13999996e+01
8,2,3,1,2,6,-1.92999992e+01
8,2,3,1,2,7,-1.33000002e+01
8,2,3,1,2,8,-8.00000012e-01
8,2,3,1,3,1,0.00000000e+00
8,2,3,1,3,2,-1.00000001e-01
8,2,3,1,3,3,-1.16000004e+01
8,2,3,1,3,4,-5.40000010e+00
8,2,3,1,3,5,-4.09999990e+00
8,2,3,1,3,6,-1.16999998e+01
8,2,3,1,3,7,-5.80000019e+00
8,2,3,1,3,8,-3.00000012e-01
8,2,3,2,1,1,0.00000000e+00
8,2,3,2,1,2,-6.00000024e-01
8,2,3,2,1,3,-3.00000000e+01
8,2,3,2,1,4,-1.60000000e+01
8,2,3,2,1,5,-5.32999992e+01
8,2,3,2,1,6,-2.12000008e+01
8,2,3,2,1,7,-1.75000000e+01
8,2,3,2,1,8,-1.50000000e+00
8,2,3,2,2,1,0.00000000e+00
8,2,3,2,2,2,-2.00000003e-01
8,2,3,2,2,3,-1.11000004e+01
8,2,3,2,2,4,-6.40000010e+00
8,2,3,2,2,5,-1.18000002e+01
8,2,3,2,2,6,-1.20000000e+01
8,2,3,2,2,7,-8.50000000e+00
8,2,3,2,2,8,-6.00000024e-01
8,2,3,2,3,1,0.00000000e+00
8,2,3,2,3,2,0.00000000e+00
8,2,3,2,3,3,-3.20000005e+00
8,2,3,2,3,4,-2.20000005e+00
8,2,3,2,3,5,-3.00000012e-01
8,2,3,2,3,6,-6.80000019e+00
8,2,3,2,3,7,-4.09999990e+00
8,2,3,2,3,8,-2.00000003e-01
9,1,1,1,1,1,9.10000038e+00
9,1,1,1,1,2,4.92000008e+01
9,1,1,1,1,3,1.26400002e+02
9,1,1,1,1,4,7.19000015e+01
9,1,1,1,1,5,8.49000015e+01
9,1,1,1,1,6,8.85999985e+01
9,1,1,1,1,7,2.06600006e+02
9,1,1,1,1,8,7.81999969e+01
9,1,1,1,2,1,0.00000000e+00
9,1,1,1,2,2,3.70000005e+00
9,1,1,1,2,3,1.03099998e+02
9,1,1,1,2,4,2.27999992e+01
9,1,1,1,2,5,4.37000008e+01
9,1,1,1,2,6,4.30000000e+01
9,1,1,1,2,7,1.98100006e+02
9,1,1,1,2,8,1.50000000e+01
9,1,1,1,3,1,0.00000000e+00
9,1,1,1,3,2,8.99999976e-01
9,1,1,1,3,3,6.94000015e+01
9,1,1,1,3,4,7.40000010e+00
9,1,1,1,3,5,8.80000019e+00
9,1,1,1,3,6,1.63999996e+01
9,1,1,1,3,7,1.53000000e+02
9,1,1,1,3,8,7.80000019e+00
9,1,1,2,1,1,9.60000038e+00
9,1,1,2,1,2,5.40999985e+01
9,1,1,2,1,3,1.36899994e+02
9,1,1,2,1,4,8.18000031e+01
9,1,1,2,1,5,9.90000000e+01
9,1,1,2,1,6,9.94000015e+01
9,1,1,2,1,7,2.23899994e+02
9,1,1,2,1,8,8.60000000e+01
9,1,1,2,2,1,2.00000003e-01
9,1,1,2,2,2,4.30000019e+00
9,1,1,2,2,3,1.14400002e+02
9,1,1,2,2,4,2.90000000e+01
9,1,1,2,2,5,5.42000008e+01
9,1,1,2,2,6,5.07000008e+01
9,1,1,2,2,7,2.22100006e+02
9,1,1,2,2,8,1.62999992e+01
9,1,1,2,3,1,0.00000000e+00
9,1,1,2,3,2,1.00000000e+00
9,1,1,2,3,3,7.63000031e+01
9,1,1,2,3,4,1.08999996e+01
9,1,1,2,3,5,1.08999996e+01
9,1,1,2,3,6,2.16000004e+01
9,1,1,2,3,7,1.71000000e+02
9,1,1,2,3,8,8.39999962e+00
9,1,2,1,1,1,5.09999990e+00
9,1,2,1,1,2,1.96000004e+01
9,1,2,1,1,3,8.55000000e+01
9,1,2,1,1,4,3.42000008e+01
9,1,2,1,1,5,5.97000008e+01
9,1,2,1,1,6,4.99000015e+01
9,1,2,1,1,7,1.70500000e+02
9,1,2,1,1,8,3.94000015e+01
9,1,2,1,2,1,0.00000000e+00
9,1,2,1,2,2,1.50000000e+00
9,1,2,1,2,3,5.85999985e+01
9,1,2,1,2,4,7.69999981e+00
9,1,2,1,2,5,1.48999996e+01
9,1,2,1,2,6,1.56000004e+01
9,1,2,1,2,7,1.37100006e+02
9,1,2,1,2,8,9.50000000e+00
9,1,2,1,3,1,0.00000000e+00
9,1,2,1,3,2,3.00000012e-01
9,1,2,1,3,3,3.02000008e+01
9,1,2,1,3,4,1.89999998e+00
9,1,2,1,3,5,1.29999995e+00
9,1,2,1,3,6,5.69999981e+00
9,1,2,1,3,7,8.35999985e+01
9,1,2,1,3,8,3.70000005e+00
9,1,2,2,1,1,5.40000010e+00
9,1,2,2,1,2,2.07000008e+01
9,1,2,2,1,3,9.23000031e+01
9,1,2,2,1,4,3.97999992e+01
9,1,2,2,1,5,7.08000031e+01
9,1,2,2,1,6,5.69000015e+01
9,1,2,2,1,7,1.84600006e+02
9,1,2,2,1,8,4.22999992e+01
9,1,2,2,2,1,0.00000000e+00
9,1,2,2,2,2,1.60000002e+00
9,1,2,2,2,3,6.30000000e+01
9,1,2,2,2,4,9.50000000e+00
9,1,2,2,2,5,1.83999996e+01
9,1,2,2,2,6,2.02000008e+01
9,1,2,2,2,7,1.50199997e+02
9,1,2,2,2,8,1.01000004e+01
9,1,2,2,3,1,0.00000000e+00
9,1,2,2,3,2,3.00000012e-01
9,1,2,2,3,3,3.25000000e+01
9,1,2,2,3,4,1.89999998e+00
9,1,2,2,3,5,1.70000005e+00
9,1,2,2,3,6,6.69999981e+00
9,1,2,2,3,7,9.06999969e+01
9,1,2,2,3,8,3.90000010e+00
9,1,3,1,1,1,1.00000000e+00
9,1,3,1,1,2,2.20000005e+00
9,1,3,1,1,3,4.04000015e+01
9,1,3,1,1,4,7.90000010e+00
9,1,3,1,1,5,1.77999992e+01
9,1,3,1,1,6,1.98999996e+01
9,1,3,1,1,7,1.01900002e+02
9,1,3,1,1,8,1.31999998e+01
9,1,3,1,2,1,0.00000000e+00
9,1,3,1,2,2,5.00000000e-01
9,1,3,1,2,3,1.97000008e+01
9,1,3,1,2,4,1.10000002e+00
9,1,3,1,2,5,1.10000002e+00
9,1,3,1,2,6,5.00000000e+00
9,1,3,1,2,7,6.29000015e+01
9,1,3,1,2,8,5.30000019e+00
9,1,3,1,3,1,0.00000000e+00
9,1,3,1,3,2,1.00000001e-01
9,1,3,1,3,3,6.69999981e+00
9,1,3,1,3,4,2.00000003e-01
9,1,3,1,3,5,0.00000000e+00
9,1,3,1,3,6,1.00000000e+00
9,1,3,1,3,7,2.97999992e+01
9,1,3,1,3,8,1.60000002e+00
9,1,3,2,1,1,4.59999990e+00
9,1,3,2,1,2,1.10000002e+00
9,1,3,2,1,3,2.07999992e+01
9,1,3,2,1,4,1.82999992e+01
9,1,3,2,1,5,5.59999990e+00
9,1,3,2,1,6,5.17000008e+01
9,1,3,2,1,7,9.18000031e+01
9,1,3,2,1,8,1.03000002e+01
9,1,3,2,2,1,0.00000000e+00
9,1,3,2,2,2,2.00000003e-01
9,1,3,2,2,3,6.30000019e+00
9,1,3,2,2,4,6.00000024e-01
9,1,3,2,2,5,0.00000000e+00
9,1,3,2,2,6,4.09999990e+00
9,1,3,2,2,7,4.49000015e+01
9,1,3,2,2,8,2.20000005e+00
9,1,3,2,3,1,0.00000000e+00
9,1,3,2,3,2,1.00000001e-01
9,1,3,2,3,3,2.20000005e+00
9,1,3,2,3,4,1.00000001e-01
9,1,3,2,3,5,0.00000000e+00
9,1,3,2,3,6,6.99999988e-01
9,1,3,2,3,7,2.07000008e+01
9,1,3,2,3,8,6.99999988e-01
9,2,1,1,1,1,0.00000000e+00
9,2,1,1,1,2,-6.00000000e+00
9,2,1,1,1,3,-1.97000008e+01
9,2,1,1,1,4,-2.95000000e+01
9,2,1,1,1,5,-6.10000000e+01
9,2,1,1,1,6,-3.92000008e+01
9,2,1,1,1,7,-3.75000000e+01
9,2,1,1,1,8,-1.38999996e+01
9,2,1,1,2,1,0.00000000e+00
9,2,1,1,2,2,0.00000000e+00
9,2,1,1,2,3,-1.45000000e+01
9,2,1,1,2,4,-3.17999992e+01
9,2,1,1,2,5,-7.75999985e+01
9,2,1,1,2,6,-4.44000015e+01
9,2,1,1,2,7,-2.43999996e+01
9,2,1,1,2,8,0.00000000e+00
9,2,1,1,3,1,0.00000000e+00
9,2,1,1,3,2,0.00000000e+00
9,2,1,1,3,3,-7.19999981e+00
9,2,1,1,3,4,-3.37999992e+01
9,2,1,1,3,5,-5.50999985e+01
9,2,1,1,3,6,-4.50999985e+01
9,2,1,1,3,7,-1.48999996e+01
9,2,1,1,3,8,0.00000000e+00
9,2,1,2,1,1,0.00000000e+00
9,2,1,2,1,2,-1.48000002e+01
9,2,1,2,1,3,-6.00999985e+01
9,2,1,2,1,4,-9.26999969e+01
9,2,1,2,1,5,-2.22199997e+02
9,2,1,2,1,6,-1.19599998e+02
9,2,1,2,1,7,-1.13699997e+02
9,2,1,2,1,8,-3.59000015e+01
9,2,1,2,2,1,0.00000000e+00
9,2,1,2,2,2,0.00000000e+00
9,2,1,2,2,3,-4.60000000e+01
9,2,1,2,2,4,-1.00400002e+02
9,2,1,2,2,5,-2.72600006e+02
9,2,1,2,2,6,-1.36899994e+02
9,2,1,2,2,7,-8.41999969e+01
9,2,1,2,2,8,0.00000000e+00
9,2,1,2,3,1,0.00000000e+00
9,2,1,2,3,2,0.00000000e+00
9,2,1,2,3,3,-2.33999996e+01
9,2,1,2,3,4,-1.02199997e+02
9,2,1,2,3,5,-1.85800003e+02
9,2,1,2,3,6,-1.40399994e+02
9,2,1,2,3,7,-4.34000015e+01
9,2,1,2,3,8,0.00000000e+00
9,2,2,1,1,1,0.00000000e+00
9,2,2,1,1,2,-3.29999995e+00
9,2,2,1,1,3,-2.21000004e+01
9,2,2,1,1,4,-2.70000000e+01
9,2,2,1,1,5,-7.01999969e+01
9,2,2,1,1,6,-4.00000000e+01
9,2,2,1,1,7,-4.47999992e+01
9,2,2,1,1,8,-8.50000000e+00
9,2,2,1,2,1,0.00000000e+00
9,2,2,1,2,2,0.00000000e+00
9,2,2,1,2,3,-1.26000004e+01
9,2,2,1,2,4,-2.67000008e+01
9,2,2,1,2,5,-5.97000008e+01
9,2,2,1,2,6,-3.70000000e+01
9,2,2,1,2,7,-2.67999992e+01
9,2,2,1,2,8,0.00000000e+00
9,2,2,1,3,1,0.00000000e+00
9,2,2,1,3,2,0.00000000e+00
9,2,2,1,3,3,-5.19999981e+00
9,2,2,1,3,4,-2.25000000e+01
9,2,2,1,3,5,-2.33999996e+01
9,2,2,1,3,6,-3.37999992e+01
9,2,2,1,3,7,-1.41000004e+01
9,2,2,1,3,8,0.00000000e+00
9,2,2,2,1,1,0.00000000e+00
9,2,2,2,1,2,-6.30000019e+00
9,2,2,2,1,3,-6.32999992e+01
9,2,2,2,1,4,-7.78000031e+01
9,2,2,2,1,5,-2.31899994e+02
9,2,2,2,1,6,-1.13199997e+02
9,2,2,2,1,7,-1.16400002e+02
9,2,2,2,1,8,-1.76000004e+01
9,2,2,2,2,1,0.00000000e+00
9,2,2,2,2,2,0.00000000e+00
9,2,2,2,2,3,-3.59000015e+01
9,2,2,2,2,4,-7.76999969e+01
9,2,2,2,2,5,-1.92899994e+02
9,2,2,2,2,6,-1.14099998e+02
9,2,2,2,2,7,-6.60000000e+01
9,2,2,2,2,8,0.00000000e+00
9,2,2,2,3,1,0.00000000e+00
9,2,2,2,3,2,0.00000000e+00
9,2,2,2,3,3,-1.38999996e+01
9,2,2,2,3,4,-6.40999985e+01
9,2,2,2,3,5,-7.09000015e+01
9,2,2,2,3,6,-8.98000031e+01
9,2,2,2,3,7,-2.65000000e+01
9,2,2,2,3,8,0.00000000e+00
9,2,3,1,1,1,0.00000000e+00
9,2,3,1,1,2,0.00000000e+00
9,2,3,1,1,3,-1.61000004e+01
9,2,3,1,1,4,-1.95000000e+01
9,2,3,1,1,5,-5.84000015e+01
9,2,3,1,1,6,-3.37999992e+01
9,2,3,1,1,7,-3.74000015e+01
9,2,3,1,1,8,0.00000000e+00
9,2,3,1,2,1,0.00000000e+00
9,2,3,1,2,2,0.00000000e+00
9,2,3,1,2,3,-8.00000000e+00
9,2,3,1,2,4,-1.62000008e+01
9,2,3,1,2,5,-2.05000000e+01
9,2,3,1,2,6,-2.85000000e+01
9,2,3,1,2,7,-2.32000008e+01
9,2,3,1,2,8,0.00000000e+00
9,2,3,1,3,1,0.00000000e+00
9,2,3,1,3,2,0.00000000e+00
9,2,3,1,3,3,-2.20000005e+00
9,2,3,1,3,4,-9.80000019e+00
9,2,3,1,3,5,0.00000000e+00
9,2,3,1,3,6,-1.58000002e+01
9,2,3,1,3,7,-1.18000002e+01
9,2,3,1,3,8,0.00000000e+00
9,2,3,2,1,1,0.00000000e+00
9,2,3,2,1,2,0.00000000e+00
9,2,3,2,1,3,-2.37000008e+01
9,2,3,2,1,4,-3.25999985e+01
9,2,3,2,1,5,-1.07000000e+02
9,2,3,2,1,6,-8.65999985e+01
9,2,3,2,1,7,-7.66999969e+01
9,2,3,2,1,8,-8.00000000e+00
9,2,3,2,2,1,0.00000000e+00
9,2,3,2,2,2,0.00000000e+00
9,2,3,2,2,3,-8.00000000e+00
9,2,3,2,2,4,-2.17000008e+01
9,2,3,2,2,5,-1.10000002e+00
9,2,3,2,2,6,-4.95999985e+01
9,2,3,2,2,7,-3.57000008e+01
9,2,3,2,2,8,0.00000000e+00
9,2,3,2,3,1,0.00000000e+00
9,2,3,2,3,2,0.00000000e+00
9,2,3,2,3,3,-1.50000000e+00
9,2,3,2,3,4,-1.03000002e+01
9,2,3,2,3,5,0.00000000e+00
9,2,3,2,3,6,-1.61000004e+01
9,2,3,2,3,7,-1.36000004e+01
9,2,3,2,3,8,0.00000000e+00
10,1,1,1,1,1,1.08999996e+01
10,1,1,1,1,2,4.67999992e+01
10,1,1,1,1,3,9.13000031e+01
10,1,1,1,1,4,8.45999985e+01
10,1,1,1,1,5,9.38000031e+01
10,1,1,1,1,6,1.12900002e+02
10,1,1,1,1,7,1.95500000e+02
10,1,1,1,1,8,9.11999969e+01
10,1,1,1,2,1,0.00000000e+00
10,1,1,1,2,2,3.79999995e+00
10,1,1,1,2,3,7.56999969e+01
10,1,1,1,2,4,2.56000004e+01
10,1,1,1,2,5,4.52000008e+01
10,1,1,1,2,6,5.55000000e+01
10,1,1,1,2,7,1.77899994e+02
10,1,1,1,2,8,1.31999998e+01
10,1,1,1,3,1,0.00000000e+00
10,1,1,1,3,2,5.00000000e-01
10,1,1,1,3,3,4.82000008e+01
10,1,1,1,3,4,6.90000010e+00
10,1,1,1,3,5,6.50000000e+00
10,1,1,1,3,6,1.91000004e+01
10,1,1,1,3,7,1.24400002e+02
10,1,1,1,3,8,4.59999990e+00
10,1,1,2,1,1,1.15000000e+01
10,1,1,2,1,2,5.09000015e+01
10,1,1,2,1,3,1.00500000e+02
10,1,1,2,1,4,9.54000015e+01
10,1,1,2,1,5,1.11300003e+02
10,1,1,2,1,6,1.30100006e+02
10,1,1,2,1,7,2.16300003e+02
10,1,1,2,1,8,1.00699997e+02
10,1,1,2,2,1,1.00000001e-01
10,1,1,2,2,2,3.90000010e+00
10,1,1,2,2,3,8.43000031e+01
10,1,1,2,2,4,3.12999992e+01
10,1,1,2,2,5,5.97000008e+01
10,1,1,2,2,6,6.88000031e+01
10,1,1,2,2,7,2.00100006e+02
10,1,1,2,2,8,1.41999998e+01
10,1,1,2,3,1,0.00000000e+00
10,1,1,2,3,2,6.00000024e-01
10,1,1,2,3,3,5.32999992e+01
10,1,1,2,3,4,1.03999996e+01
10,1,1,2,3,5,9.50000000e+00
10,1,1,2,3,6,2.72000008e+01
10,1,1,2,3,7,1.41800003e+02
10,1,1,2,3,8,5.00000000e+00
10,1,2,1,1,1,6.59999990e+00
10,1,2,1,1,2,1.86000004e+01
10,1,2,1,1,3,6.80999985e+01
10,1,2,1,1,4,4.27999992e+01
10,1,2,1,1,5,6.99000015e+01
10,1,2,1,1,6,7.15000000e+01
10,1,2,1,1,7,1.73399994e+02
10,1,2,1,1,8,5.02000008e+01
10,1,2,1,2,1,0.00000000e+00
10,1,2,1,2,2,2.00000003e-01
10,1,2,1,2,3,4.47999992e+01
10,1,2,1,2,4,6.30000019e+00
10,1,2,1,2,5,9.60000038e+00
10,1,2,1,2,6,1.80000000e+01
10,1,2,1,2,7,1.19699997e+02
10,1,2,1,2,8,8.39999962e+00
10,1,2,1,3,1,0.00000000e+00
10,1,2,1,3,2,2.00000003e-01
10,1,2,1,3,3,1.78999996e+01
10,1,2,1,3,4,1.39999998e+00
10,1,2,1,3,5,1.00000001e-01
10,1,2,1,3,6,6.09999990e+00
10,1,2,1,3,7,6.27000008e+01
10,1,2,1,3,8,1.79999995e+00
10,1,2,2,1,1,6.90000010e+00
10,1,2,2,1,2,1.97999992e+01
10,1,2,2,1,3,7.71999969e+01
10,1,2,2,1,4,4.89000015e+01
10,1,2,2,1,5,8.44000015e+01
10,1,2,2,1,6,8.28000031e+01
10,1,2,2,1,7,1.91500000e+02
10,1,2,2,1,8,5.39000015e+01
10,1,2,2,2,1,0.00000000e+00
10,1,2,2,2,2,8.00000012e-01
10,1,2,2,2,3,4.87999992e+01
10,1,2,2,2,4,9.19999981e+00
10,1,2,2,2,5,1.35000000e+01
10,1,2,2,2,6,2.55000000e+01
10,1,2,2,2,7,1.34800003e+02
10,1,2,2,2,8,8.80000019e+00
10,1,2,2,3,1,0.00000000e+00
10,1,2,2,3,2,2.00000003e-01
10,1,2,2,3,3,1.91000004e+01
10,1,2,2,3,4,1.50000000e+00
10,1,2,2,3,5,1.00000001e-01
10,1,2,2,3,6,8.60000038e+00
10,1,2,2,3,7,7.05999985e+01
10,1,2,2,3,8,1.79999995e+00
10,1,3,1,1,1,6.00000024e-01
10,1,3,1,1,2,1.20000005e+00
10,1,3,1,1,3,3.11000004e+01
10,1,3,1,1,4,6.30000019e+00
10,1,3,1,1,5,1.28999996e+01
10,1,3,1,1,6,1.86000004e+01
10,1,3,1,1,7,9.15000000e+01
10,1,3,1,1,8,1.11999998e+01
10,1,3,1,2,1,0.00000000e+00
10,1,3,1,2,2,3.00000012e-01
10,1,3,1,2,3,1.08999996e+01
10,1,3,1,2,4,8.99999976e-01
10,1,3,1,2,5,1.00000001e-01
10,1,3,1,2,6,4.40000010e+00
10,1,3,1,2,7,4.50999985e+01
10,1,3,1,2,8,3.20000005e+00
10,1,3,1,3,1,0.00000000e+00
10,1,3,1,3,2,0.00000000e+00
10,1,3,1,3,3,3.00000000e+00
10,1,3,1,3,4,1.00000001e-01
10,1,3,1,3,5,0.00000000e+00
10,1,3,1,3,6,3.00000012e-01
10,1,3,1,3,7,1.91000004e+01
10,1,3,1,3,8,8.00000012e-01
10,1,3,2,1,1,0.00000000e+00
10,1,3,2,1,2,5.00000000e-01
10,1,3,2,1,3,1.06999998e+01
10,1,3,2,1,4,1.10000002e+00
10,1,3,2,1,5,2.00000000e+00
10,1,3,2,1,6,6.09999990e+00
10,1,3,2,1,7,4.02000008e+01
10,1,3,2,1,8,5.50000000e+00
10,1,3,2,2,1,0.00000000e+00
10,1,3,2,2,2,1.00000001e-01
10,1,3,2,2,3,2.70000005e+00
10,1,3,2,2,4,1.00000001e-01
10,1,3,2,2,5,0.00000000e+00
10,1,3,2,2,6,1.50000000e+00
10,1,3,2,2,7,1.91000004e+01
10,1,3,2,2,8,1.39999998e+00
10,1,3,2,3,1,0.00000000e+00
10,1,3,2,3,2,0.00000000e+00
10,1,3,2,3,3,6.00000024e-01
10,1,3,2,3,4,0.00000000e+00
10,1,3,2,3,5,0.00000000e+00
10,1,3,2,3,6,1.10000002e+00
10,1,3,2,3,7,7.69999981e+00
10,1,3,2,3,8,5.00000000e-01
10,2,1,1,1,1,-2.00000003e-01
10,2,1,1,1,2,-7.80000019e+00
10,2,1,1,1,3,-3.17000008e+01
10,2,1,1,1,4,-4.35999985e+01
10,2,1,1,1,5,-8.65999985e+01
10,2,1,1,1,6,-6.75000000e+01
10,2,1,1,1,7,-6.02999992e+01
10,2,1,1,1,8,-2.02999992e+01
10,2,1,1,2,1,0.00000000e+00
10,2,1,1,2,2,-1.00000001e-01
10,2,1,1,2,3,-2.46000004e+01
10,2,1,1,2,4,-3.62999992e+01
10,2,1,1,2,5,-7.78000031e+01
10,2,1,1,2,6,-5.30000000e+01
10,2,1,1,2,7,-4.35999985e+01
10,2,1,1,2,8,-2.00000003e-01
10,2,1,1,3,1,0.00000000e+00
10,2,1,1,3,2,0.00000000e+00
10,2,1,1,3,3,-1.36999998e+01
10,2,1,1,3,4,-3.37999992e+01
10,2,1,1,3,5,-4.42999992e+01
10,2,1,1,3,6,-4.67999992e+01
10,2,1,1,3,7,-2.53999996e+01
10,2,1,1,3,8,0.00000000e+00
10,2,1,2,1,1,-2.00000003e-01
10,2,1,2,1,2,-1.86000004e+01
10,2,1,2,1,3,-7.49000015e+01
10,2,1,2,1,4,-1.13800003e+02
10,2,1,2,1,5,-2.57000000e+02
10,2,1,2,1,6,-1.59399994e+02
10,2,1,2,1,7,-1.34600006e+02
10,2,1,2,1,8,-4.47000008e+01
10,2,1,2,2,1,0.00000000e+00
10,2,1,2,2,2,1.00000001e-01
10,2,1,2,2,3,-5.77000008e+01
10,2,1,2,2,4,-1.01300003e+02
10,2,1,2,2,5,-2.36699997e+02
10,2,1,2,2,6,-1.35899994e+02
10,2,1,2,2,7,-9.71999969e+01
10,2,1,2,2,8,-2.00000003e-01
10,2,1,2,3,1,0.00000000e+00
10,2,1,2,3,2,0.00000000e+00
10,2,1,2,3,3,-2.92999992e+01
10,2,1,2,3,4,-9.46999969e+01
10,2,1,2,3,5,-1.37699997e+02
10,2,1,2,3,6,-1.25599998e+02
10,2,1,2,3,7,-4.62000008e+01
10,2,1,2,3,8,0.00000000e+00
10,2,2,1,1,1,-1.00000001e-01
10,2,2,1,1,2,-3.70000005e+00
10,2,2,1,1,3,-2.88999996e+01
10,2,2,1,1,4,-3.65999985e+01
10,2,2,1,1,5,-8.23000031e+01
10,2,2,1,1,6,-5.95999985e+01
10,2,2,1,1,7,-5.32999992e+01
10,2,2,1,1,8,-1.53999996e+01
10,2,2,1,2,1,0.00000000e+00
10,2,2,1,2,2,0.00000000e+00
10,2,2,1,2,3,-1.73999996e+01
10,2,2,1,2,4,-2.68999996e+01
10,2,2,1,2,5,-5.05999985e+01
10,2,2,1,2,6,-4.34000015e+01
10,2,2,1,2,7,-3.17000008e+01
10,2,2,1,2,8,-1.00000001e-01
10,2,2,1,3,1,0.00000000e+00
10,2,2,1,3,2,0.00000000e+00
10,2,2,1,3,3,-7.80000019e+00
10,2,2,1,3,4,-2.12000008e+01
10,2,2,1,3,5,-1.11000004e+01
10,2,2,1,3,6,-3.07000008e+01
10,2,2,1,3,7,-1.80000000e+01
10,2,2,1,3,8,0.00000000e+00
10,2,2,2,1,1,-1.00000001e-01
10,2,2,2,1,2,-7.80000019e+00
10,2,2,2,1,3,-6.88000031e+01
10,2,2,2,1,4,-9.63000031e+01
10,2,2,2,1,5,-2.45100006e+02
10,2,2,2,1,6,-1.42199997e+02
10,2,2,2,1,7,-1.20699997e+02
10,2,2,2,1,8,-2.77000008e+01
10,2,2,2,2,1,0.00000000e+00
10,2,2,2,2,2,0.00000000e+00
10,2,2,2,2,3,-3.80000000e+01
10,2,2,2,2,4,-7.55999985e+01
10,2,2,2,2,5,-1.48600006e+02
10,2,2,2,2,6,-1.08300003e+02
10,2,2,2,2,7,-6.35999985e+01
10,2,2,2,2,8,-1.00000001e-01
10,2,2,2,3,1,0.00000000e+00
10,2,2,2,3,2,0.00000000e+00
10,2,2,2,3,3,-1.56000004e+01
10,2,2,2,3,4,-5.47000008e+01
10,2,2,2,3,5,-3.17999992e+01
10,2,2,2,3,6,-7.36999969e+01
10,2,2,2,3,7,-2.82000008e+01
10,2,2,2,3,8,0.00000000e+00
10,2,3,1,1,1,0.00000000e+00
10,2,3,1,1,2,-1.00000001e-01
10,2,3,1,1,3,-1.73999996e+01
10,2,3,1,1,4,-1.96000004e+01
10,2,3,1,1,5,-5.02000008e+01
10,2,3,1,1,6,-3.62000008e+01
10,2,3,1,1,7,-3.42999992e+01
10,2,3,1,1,8,-6.00000024e-01
10,2,3,1,2,1,0.00000000e+00
10,2,3,1,2,2,0.00000000e+00
10,2,3,1,2,3,-7.40000010e+00
10,2,3,1,2,4,-1.31000004e+01
10,2,3,1,2,5,-8.50000000e+00
10,2,3,1,2,6,-2.13999996e+01
10,2,3,1,2,7,-1.88999996e+01
10,2,3,1,2,8,-1.00000001e-01
10,2,3,1,3,1,0.00000000e+00
10,2,3,1,3,2,0.00000000e+00
10,2,3,1,3,3,-2.20000005e+00
10,2,3,1,3,4,-6.59999990e+00
10,2,3,1,3,5,0.00000000e+00
10,2,3,1,3,6,-1.06999998e+01
10,2,3,1,3,7,-9.39999962e+00
10,2,3,1,3,8,0.00000000e+00
10,2,3,2,1,1,0.00000000e+00
10,2,3,2,1,2,0.00000000e+00
10,2,3,2,1,3,-1.87999992e+01
10,2,3,2,1,4,-2.28999996e+01
10,2,3,2,1,5,-4.92999992e+01
10,2,3,2,1,6,-3.67000008e+01
10,2,3,2,1,7,-3.85000000e+01
10,2,3,2,1,8,-1.00000001e-01
10,2,3,2,2,1,0.00000000e+00
10,2,3,2,2,2,0.00000000e+00
10,2,3,2,2,3,-5.90000010e+00
10,2,3,2,2,4,-9.89999962e+00
10,2,3,2,2,5,-3.00000012e-01
10,2,3,2,2,6,-1.67000008e+01
10,2,3,2,2,7,-1.77999992e+01
10,2,3,2,2,8,0.00000000e+00
10,2,3,2,3,1,0.00000000e+00
10,2,3,2,3,2,0.00000000e+00
10,2,3,2,3,3,-1.29999995e+00
10,2,3,2,3,4,-3.20000005e+00
10,2,3,2,3,5,0.00000000e+00
10,2,3,2,3,6,-5.90000010e+00
10,2,3,2,3,7,-4.59999990e+00
10,2,3,2,3,8,0.00000000e+00
11,1,1,1,1,1,1.08000002e+01
11,1,1,1,1,2,2.42000008e+01
11,1,1,1,1,3,4.97000008e+01
11,1,1,1,1,4,2.41000004e+01
11,1,1,1,1,5,2.81000004e+01
11,1,1,1,1,6,3.47999992e+01
11,1,1,1,1,7,8.68000031e+01
11,1,1,1,1,8,4.20000000e+01
11,1,1,1,2,1,0.00000000e+00
11,1,1,1,2,2,1.50000000e+00
11,1,1,1,2,3,4.05999985e+01
11,1,1,1,2,4,8.50000000e+00
11,1,1,1,2,5,1.48999996e+01
11,1,1,1,2,6,1.31999998e+01
11,1,1,1,2,7,9.05000000e+01
11,1,1,1,2,8,1.30000000e+01
11,1,1,1,3,1,0.00000000e+00
11,1,1,1,3,2,3.00000012e-01
11,1,1,1,3,3,2.62000008e+01
11,1,1,1,3,4,2.50000000e+00
11,1,1,1,3,5,3.09999990e+00
11,1,1,1,3,6,4.80000019e+00
11,1,1,1,3,7,7.48000031e+01
11,1,1,1,3,8,7.80000019e+00
11,1,1,2,1,1,1.10000000e+01
11,1,1,2,1,2,2.62000008e+01
11,1,1,2,1,3,5.35999985e+01
11,1,1,2,1,4,2.70000000e+01
11,1,1,2,1,5,3.22999992e+01
11,1,1,2,1,6,3.87000008e+01
11,1,1,2,1,7,9.06999969e+01
11,1,1,2,1,8,4.52000008e+01
11,1,1,2,2,1,1.00000001e-01
11,1,1,2,2,2,1.60000002e+00
11,1,1,2,2,3,4.47999992e+01
11,1,1,2,2,4,9.19999981e+00
11,1,1,2,2,5,1.85000000e+01
11,1,1,2,2,6,1.56000004e+01
11,1,1,2,2,7,9.79000015e+01
11,1,1,2,2,8,1.36999998e+01
11,1,1,2,3,1,0.00000000e+00
11,1,1,2,3,2,3.00000012e-01
11,1,1,2,3,3,2.98999996e+01
11,1,1,2,3,4,3.29999995e+00
11,1,1,2,3,5,4.19999981e+00
11,1,1,2,3,6,6.59999990e+00
11,1,1,2,3,7,8.14000015e+01
11,1,1,2,3,8,8.50000000e+00
11,1,2,1,1,1,6.40000010e+00
11,1,2,1,1,2,1.08000002e+01
11,1,2,1,1,3,3.22000008e+01
11,1,2,1,1,4,1.13999996e+01
11,1,2,1,1,5,1.97000008e+01
11,1,2,1,1,6,1.60000000e+01
11,1,2,1,1,7,6.95000000e+01
11,1,2,1,1,8,2.52999992e+01
11,1,2,1,2,1,0.00000000e+00
11,1,2,1,2,2,6.00000024e-01
11,1,2,1,2,3,2.22000008e+01
11,1,2,1,2,4,2.79999995e+00
11,1,2,1,2,5,4.00000000e+00
11,1,2,1,2,6,5.00000000e+00
11,1,2,1,2,7,6.55000000e+01
11,1,2,1,2,8,1.11999998e+01
11,1,2,1,3,1,0.00000000e+00
11,1,2,1,3,2,1.00000001e-01
11,1,2,1,3,3,1.18999996e+01
11,1,2,1,3,4,3.00000012e-01
11,1,2,1,3,5,1.00000001e-01
11,1,2,1,3,6,8.00000012e-01
11,1,2,1,3,7,4.60999985e+01
11,1,2,1,3,8,3.70000005e+00
11,1,2,2,1,1,6.69999981e+00
11,1,2,2,1,2,1.13999996e+01
11,1,2,2,1,3,3.40000000e+01
11,1,2,2,1,4,1.25000000e+01
11,1,2,2,1,5,2.23999996e+01
11,1,2,2,1,6,1.76000004e+01
11,1,2,2,1,7,7.49000015e+01
11,1,2,2,1,8,2.67999992e+01
11,1,2,2,2,1,0.00000000e+00
11,1,2,2,2,2,6.99999988e-01
11,1,2,2,2,3,2.37999992e+01
11,1,2,2,2,4,3.20000005e+00
11,1,2,2,2,5,5.09999990e+00
11,1,2,2,2,6,6.19999981e+00
11,1,2,2,2,7,7.04000015e+01
11,1,2,2,2,8,1.18000002e+01
11,1,2,2,3,1,0.00000000e+00
11,1,2,2,3,2,1.00000001e-01
11,1,2,2,3,3,1.28000002e+01
11,1,2,2,3,4,4.00000006e-01
11,1,2,2,3,5,1.00000001e-01
11,1,2,2,3,6,8.00000012e-01
11,1,2,2,3,7,4.95000000e+01
11,1,2,2,3,8,3.90000010e+00
11,1,3,1,1,1,1.29999995e+00
11,1,3,1,1,2,1.00000000e+00
11,1,3,1,1,3,1.40000000e+01
11,1,3,1,1,4,2.79999995e+00
11,1,3,1,1,5,5.40000010e+00
11,1,3,1,1,6,4.59999990e+00
11,1,3,1,1,7,4.79000015e+01
11,1,3,1,1,8,1.55000000e+01
11,1,3,1,2,1,0.00000000e+00
11,1,3,1,2,2,2.00000003e-01
11,1,3,1,2,3,7.69999981e+00
11,1,3,1,2,4,2.00000003e-01
11,1,3,1,2,5,1.00000001e-01
11,1,3,1,2,6,5.00000000e-01
11,1,3,1,2,7,3.49000015e+01
11,1,3,1,2,8,6.09999990e+00
11,1,3,1,3,1,0.00000000e+00
11,1,3,1,3,2,1.00000001e-01
11,1,3,1,3,3,3.09999990e+00
11,1,3,1,3,4,0.00000000e+00
11,1,3,1,3,5,0.00000000e+00
11,1,3,1,3,6,1.00000001e-01
11,1,3,1,3,7,2.27000008e+01
11,1,3,1,3,8,1.39999998e+00
11,1,3,2,1,1,9.00000000e+00
11,1,3,2,1,2,4.00000006e-01
11,1,3,2,1,3,7.69999981e+00
11,1,3,2,1,4,1.03999996e+01
11,1,3,2,1,5,1.00000000e+00
11,1,3,2,1,6,2.56000004e+01
11,1,3,2,1,7,4.12999992e+01
11,1,3,2,1,8,1.33999996e+01
11,1,3,2,2,1,0.00000000e+00
11,1,3,2,2,2,1.00000001e-01
11,1,3,2,2,3,2.90000010e+00
11,1,3,2,2,4,4.00000006e-01
11,1,3,2,2,5,0.00000000e+00
11,1,3,2,2,6,1.20000005e+00
11,1,3,2,2,7,2.72000008e+01
11,1,3,2,2,8,2.40000010e+00
11,1,3,2,3,1,0.00000000e+00
11,1,3,2,3,2,0.00000000e+00
11,1,3,2,3,3,1.00000000e+00
11,1,3,2,3,4,0.00000000e+00
11,1,3,2,3,5,0.00000000e+00
11,1,3,2,3,6,0.00000000e+00
11,1,3,2,3,7,1.62999992e+01
11,1,3,2,3,8,5.00000000e-01
11,2,1,1,1,1,-2.00000003e-01
11,2,1,1,1,2,-6.40000010e+00
11,2,1,1,1,3,-1.48999996e+01
11,2,1,1,1,4,-2.31000004e+01
11,2,1,1,1,5,-3.17999992e+01
11,2,1,1,1,6,-2.66000004e+01
11,2,1,1,1,7,-2.47999992e+01
11,2,1,1,1,8,-8.50000000e+00
11,2,1,1,2,1,0.00000000e+00
11,2,1,1,2,2,0.00000000e+00
11,2,1,1,2,3,-1.33000002e+01
11,2,1,1,2,4,-1.56999998e+01
11,2,1,1,2,5,-3.72000008e+01
11,2,1,1,2,6,-2.35000000e+01
11,2,1,1,2,7,-1.98999996e+01
11,2,1,1,2,8,-2.00000003e-01
11,2,1,1,3,1,0.00000000e+00
11,2,1,1,3,2,0.00000000e+00
11,2,1,1,3,3,-9.89999962e+00
11,2,1,1,3,4,-1.28000002e+01
11,2,1,1,3,5,-2.47999992e+01
11,2,1,1,3,6,-2.22999992e+01
11,2,1,1,3,7,-9.80000019e+00
11,2,1,1,3,8,0.00000000e+00
11,2,1,2,1,1,-2.00000003e-01
11,2,1,2,1,2,-1.10000000e+01
11,2,1,2,1,3,-3.30999985e+01
11,2,1,2,1,4,-5.40999985e+01
11,2,1,2,1,5,-8.88000031e+01
11,2,1,2,1,6,-6.35000000e+01
11,2,1,2,1,7,-5.92999992e+01
11,2,1,2,1,8,-1.76000004e+01
11,2,1,2,2,1,0.00000000e+00
11,2,1,2,2,2,0.00000000e+00
11,2,1,2,2,3,-2.72000008e+01
11,2,1,2,2,4,-4.30999985e+01
11,2,1,2,2,5,-1.08300003e+02
11,2,1,2,2,6,-6.44000015e+01
11,2,1,2,2,7,-4.62000008e+01
11,2,1,2,2,8,-2.00000003e-01
11,2,1,2,3,1,0.00000000e+00
11,2,1,2,3,2,0.00000000e+00
11,2,1,2,3,3,-1.77999992e+01
11,2,1,2,3,4,-3.90000000e+01
11,2,1,2,3,5,-7.35999985e+01
11,2,1,2,3,6,-6.22000008e+01
11,2,1,2,3,7,-2.17999992e+01
11,2,1,2,3,8,0.00000000e+00
11,2,2,1,1,1,-1.00000001e-01
11,2,2,1,1,2,-2.40000010e+00
11,2,2,1,1,3,-1.31999998e+01
11,2,2,1,1,4,-1.60000000e+01
11,2,2,1,1,5,-3.30000000e+01
11,2,2,1,1,6,-2.22000008e+01
11,2,2,1,1,7,-2.27000008e+01
11,2,2,1,1,8,-4.40000010e+00
11,2,2,1,2,1,0.00000000e+00
11,2,2,1,2,2,0.00000000e+00
11,2,2,1,2,3,-9.60000038e+00
11,2,2,1,2,4,-1.11000004e+01
11,2,2,1,2,5,-2.57000008e+01
11,2,2,1,2,6,-1.92000008e+01
11,2,2,1,2,7,-1.43999996e+01
11,2,2,1,2,8,0.00000000e+00
11,2,2,1,3,1,0.00000000e+00
11,2,2,1,3,2,0.00000000e+00
11,2,2,1,3,3,-5.69999981e+00
11,2,2,1,3,4,-7.00000000e+00
11,2,2,1,3,5,-1.26000004e+01
11,2,2,1,3,6,-1.41000004e+01
11,2,2,1,3,7,-6.50000000e+00
11,2,2,1,3,8,0.00000000e+00
11,2,2,2,1,1,-1.00000001e-01
11,2,2,2,1,2,-3.70000005e+00
11,2,2,2,1,3,-2.92999992e+01
11,2,2,2,1,4,-3.82999992e+01
11,2,2,2,1,5,-9.35999985e+01
11,2,2,2,1,6,-5.50999985e+01
11,2,2,2,1,7,-5.60000000e+01
11,2,2,2,1,8,-7.80000019e+00
11,2,2,2,2,1,0.00000000e+00
11,2,2,2,2,2,0.00000000e+00
11,2,2,2,2,3,-1.87000008e+01
11,2,2,2,2,4,-3.15000000e+01
11,2,2,2,2,5,-7.49000015e+01
11,2,2,2,2,6,-5.34000015e+01
11,2,2,2,2,7,-3.25999985e+01
11,2,2,2,2,8,0.00000000e+00
11,2,2,2,3,1,0.00000000e+00
11,2,2,2,3,2,0.00000000e+00
11,2,2,2,3,3,-9.89999962e+00
11,2,2,2,3,4,-1.78999996e+01
11,2,2,2,3,5,-3.16000004e+01
11,2,2,2,3,6,-3.67999992e+01
11,2,2,2,3,7,-1.28999996e+01
11,2,2,2,3,8,0.00000000e+00
11,2,3,1,1,1,0.00000000e+00
11,2,3,1,1,2,0.00000000e+00
11,2,3,1,1,3,-8.19999981e+00
11,2,3,1,1,4,-7.00000000e+00
11,2,3,1,1,5,-2.45000000e+01
11,2,3,1,1,6,-1.38999996e+01
11,2,3,1,1,7,-1.87000008e+01
11,2,3,1,1,8,-2.00000003e-01
11,2,3,1,2,1,0.00000000e+00
11,2,3,1,2,2,0.00000000e+00
11,2,3,1,2,3,-4.19999981e+00
11,2,3,1,2,4,-4.09999990e+00
11,2,3,1,2,5,-1.16999998e+01
11,2,3,1,2,6,-9.39999962e+00
11,2,3,1,2,7,-9.39999962e+00
11,2,3,1,2,8,0.00000000e+00
11,2,3,1,3,1,0.00000000e+00
11,2,3,1,3,2,0.00000000e+00
11,2,3,1,3,3,-1.50000000e+00
11,2,3,1,3,4,-2.40000010e+00
11,2,3,1,3,5,0.00000000e+00
11,2,3,1,3,6,-5.09999990e+00
11,2,3,1,3,7,-4.00000000e+00
11,2,3,1,3,8,0.00000000e+00
11,2,3,2,1,1,-2.00000003e-01
11,2,3,2,1,2,0.00000000e+00
11,2,3,2,1,3,-8.69999981e+00
11,2,3,2,1,4,-1.36999998e+01
11,2,3,2,1,5,-3.97000008e+01
11,2,3,2,1,6,-4.20999985e+01
11,2,3,2,1,7,-4.09000015e+01
11,2,3,2,1,8,-1.21999998e+01
11,2,3,2,2,1,0.00000000e+00
11,2,3,2,2,2,0.00000000e+00
11,2,3,2,2,3,-2.59999990e+00
11,2,3,2,2,4,-5.69999981e+00
11,2,3,2,2,5,-2.40000010e+00
11,2,3,2,2,6,-2.12999992e+01
11,2,3,2,2,7,-1.48000002e+01
11,2,3,2,2,8,0.00000000e+00
11,2,3,2,3,1,0.00000000e+00
11,2,3,2,3,2,0.00000000e+00
11,2,3,2,3,3,-6.99999988e-01
11,2,3,2,3,4,-2.09999990e+00
11,2,3,2,3,5,0.00000000e+00
11,2,3,2,3,6,-7.19999981e+00
11,2,3,2,3,7,-4.40000010e+00
11,2,3,2,3,8,0.00000000e+00
