ReferenceObjectID,ReferenceObjectDescription
1,"Tree"
2,"Building corner"
3,"Building wall"
4,"Building door"
5,"Roof peak"
6,"Light post"
7,"Street sign"
8,"Fence"
9,"Swing set"
10,"Curb"
11,"Driveway edge"
12,"Fire hydrant"
13,"Utility"
14,"Sewer or drain grate"
15,"Other"
