EESchema Schematic File Version 4
EELAYER 29 0
EELAYER END
$Descr A4 11693 8268
encoding utf-8
Sheet 1 3
Title "SolderingRT1"
Date "2020-03-07"
Rev "A"
Comp "PittiniHub"
Comment1 ""
Comment2 ""
Comment3 ""
Comment4 ""
$EndDescr
$Comp
L Device:R R2a1
U 1 1 5E3FD774
P 1850 2000
F 0 "R2a1" V 1750 2000 50  0000 C CNN
F 1 "10k" V 1850 2000 50  0000 C CNN
F 2 "Resistor_SMD:R_0603_1608Metric" V 1780 2000 50  0001 C CNN
F 3 "~" H 1850 2000 50  0001 C CNN
	1    1850 2000
	-1   0    0    1   
$EndComp
$Comp
L power:GND #PWR0102
U 1 1 5E407607
P 1650 4700
F 0 "#PWR0102" H 1650 4450 50  0001 C CNN
F 1 "GND" H 1655 4527 50  0000 C CNN
F 2 "" H 1650 4700 50  0001 C CNN
F 3 "" H 1650 4700 50  0001 C CNN
	1    1650 4700
	1    0    0    -1  
$EndComp
$Comp
L Device:C C2a1
U 1 1 5E47C38B
P 1450 2400
F 0 "C2a1" H 1565 2446 50  0000 L CNN
F 1 "10nF" H 1565 2355 50  0000 L CNN
F 2 "Capacitor_SMD:C_0603_1608Metric" H 1488 2250 50  0001 C CNN
F 3 "~" H 1450 2400 50  0001 C CNN
	1    1450 2400
	1    0    0    -1  
$EndComp
$Comp
L Device:C C12a1
U 1 1 5E49BD59
P 1750 5450
F 0 "C12a1" H 1865 5496 50  0000 L CNN
F 1 "1uF" H 1865 5405 50  0000 L CNN
F 2 "Capacitor_SMD:C_0603_1608Metric" H 1788 5300 50  0001 C CNN
F 3 "~" H 1750 5450 50  0001 C CNN
	1    1750 5450
	1    0    0    -1  
$EndComp
$Comp
L Device:C C13a1
U 1 1 5E49C7FF
P 2800 5450
F 0 "C13a1" H 2915 5496 50  0000 L CNN
F 1 "1uF" H 2915 5405 50  0000 L CNN
F 2 "Capacitor_SMD:C_0603_1608Metric" H 2838 5300 50  0001 C CNN
F 3 "~" H 2800 5450 50  0001 C CNN
	1    2800 5450
	1    0    0    -1  
$EndComp
$Comp
L power:GND #PWR0119
U 1 1 5E49FC49
P 1750 5600
F 0 "#PWR0119" H 1750 5350 50  0001 C CNN
F 1 "GND" H 1755 5427 50  0000 C CNN
F 2 "" H 1750 5600 50  0001 C CNN
F 3 "" H 1750 5600 50  0001 C CNN
	1    1750 5600
	1    0    0    -1  
$EndComp
$Comp
L power:GND #PWR0121
U 1 1 5E4A047A
P 2300 5600
F 0 "#PWR0121" H 2300 5350 50  0001 C CNN
F 1 "GND" H 2305 5427 50  0000 C CNN
F 2 "" H 2300 5600 50  0001 C CNN
F 3 "" H 2300 5600 50  0001 C CNN
	1    2300 5600
	1    0    0    -1  
$EndComp
$Comp
L power:GND #PWR0123
U 1 1 5E4A09C9
P 2800 5600
F 0 "#PWR0123" H 2800 5350 50  0001 C CNN
F 1 "GND" H 2805 5427 50  0000 C CNN
F 2 "" H 2800 5600 50  0001 C CNN
F 3 "" H 2800 5600 50  0001 C CNN
	1    2800 5600
	1    0    0    -1  
$EndComp
$Comp
L power:+5V #PWR0125
U 1 1 5E4A1A85
P 3100 5300
F 0 "#PWR0125" H 3100 5150 50  0001 C CNN
F 1 "+5V" H 3115 5473 50  0000 C CNN
F 2 "" H 3100 5300 50  0001 C CNN
F 3 "" H 3100 5300 50  0001 C CNN
	1    3100 5300
	1    0    0    -1  
$EndComp
$Comp
L Connector:Conn_01x08_Female J4
U 1 1 5E5D73E2
P 7700 1500
F 0 "J4" H 7728 1476 50  0000 L CNN
F 1 "Conn_01x08_Female" H 7728 1385 50  0000 L CNN
F 2 "Connector_PinHeader_2.54mm:PinHeader_1x08_P2.54mm_Vertical" H 7700 1500 50  0001 C CNN
F 3 "~" H 7700 1500 50  0001 C CNN
	1    7700 1500
	1    0    0    -1  
$EndComp
$Comp
L Connector:Conn_01x04_Female J5
U 1 1 5E5D8DA7
P 7700 2200
F 0 "J5" H 7728 2176 50  0000 L CNN
F 1 "Conn_01x04_Female" H 7728 2085 50  0000 L CNN
F 2 "Connector_PinHeader_2.54mm:PinHeader_1x04_P2.54mm_Vertical" H 7700 2200 50  0001 C CNN
F 3 "~" H 7700 2200 50  0001 C CNN
	1    7700 2200
	1    0    0    -1  
$EndComp
$Comp
L Device:R R4a1
U 1 1 5E5D9B03
P 6700 1400
F 0 "R4a1" V 6750 1200 50  0000 C CNN
F 1 "1k" V 6700 1400 50  0000 C CNN
F 2 "Resistor_SMD:R_0603_1608Metric" V 6630 1400 50  0001 C CNN
F 3 "~" H 6700 1400 50  0001 C CNN
	1    6700 1400
	0    -1   -1   0   
$EndComp
$Comp
L power:+5V #PWR0101
U 1 1 5E5DB8F4
P 7500 1200
F 0 "#PWR0101" H 7500 1050 50  0001 C CNN
F 1 "+5V" H 7515 1373 50  0000 C CNN
F 2 "" H 7500 1200 50  0001 C CNN
F 3 "" H 7500 1200 50  0001 C CNN
	1    7500 1200
	0    -1   -1   0   
$EndComp
$Comp
L power:GND #PWR0103
U 1 1 5E5DBE1F
P 7300 1300
F 0 "#PWR0103" H 7300 1050 50  0001 C CNN
F 1 "GND" V 7305 1172 50  0000 R CNN
F 2 "" H 7300 1300 50  0001 C CNN
F 3 "" H 7300 1300 50  0001 C CNN
	1    7300 1300
	0    1    1    0   
$EndComp
Wire Wire Line
	7500 1300 7300 1300
Wire Wire Line
	7500 1400 6850 1400
$Comp
L Device:R R5a1
U 1 1 5E5E0455
P 7100 1500
F 0 "R5a1" V 7150 1300 50  0000 C CNN
F 1 "1k" V 7100 1500 50  0000 C CNN
F 2 "Resistor_SMD:R_0603_1608Metric" V 7030 1500 50  0001 C CNN
F 3 "~" H 7100 1500 50  0001 C CNN
	1    7100 1500
	0    -1   -1   0   
$EndComp
$Comp
L Device:R R7a1
U 1 1 5E5E3A3F
P 6700 1600
F 0 "R7a1" V 6750 1400 50  0000 C CNN
F 1 "1k" V 6700 1600 50  0000 C CNN
F 2 "Resistor_SMD:R_0603_1608Metric" V 6630 1600 50  0001 C CNN
F 3 "~" H 6700 1600 50  0001 C CNN
	1    6700 1600
	0    -1   -1   0   
$EndComp
$Comp
L Device:R R8a1
U 1 1 5E5E3D2E
P 7100 1700
F 0 "R8a1" V 7150 1500 50  0000 C CNN
F 1 "1k" V 7100 1700 50  0000 C CNN
F 2 "Resistor_SMD:R_0603_1608Metric" V 7030 1700 50  0001 C CNN
F 3 "~" H 7100 1700 50  0001 C CNN
	1    7100 1700
	0    -1   -1   0   
$EndComp
$Comp
L Device:R R9a1
U 1 1 5E5E4147
P 6700 1800
F 0 "R9a1" V 6750 1600 50  0000 C CNN
F 1 "1k" V 6700 1800 50  0000 C CNN
F 2 "Resistor_SMD:R_0603_1608Metric" V 6630 1800 50  0001 C CNN
F 3 "~" H 6700 1800 50  0001 C CNN
	1    6700 1800
	0    -1   -1   0   
$EndComp
$Comp
L Device:R R10a1
U 1 1 5E5E456D
P 7100 1900
F 0 "R10a1" V 7150 1700 50  0000 C CNN
F 1 "150" V 7100 1900 50  0000 C CNN
F 2 "Resistor_SMD:R_0805_2012Metric" V 7030 1900 50  0001 C CNN
F 3 "~" H 7100 1900 50  0001 C CNN
	1    7100 1900
	0    -1   -1   0   
$EndComp
$Comp
L power:+5V #PWR0104
U 1 1 5E5E4953
P 6950 1900
F 0 "#PWR0104" H 6950 1750 50  0001 C CNN
F 1 "+5V" H 6965 2073 50  0000 C CNN
F 2 "" H 6950 1900 50  0001 C CNN
F 3 "" H 6950 1900 50  0001 C CNN
	1    6950 1900
	-1   0    0    1   
$EndComp
Wire Wire Line
	7500 1900 7250 1900
Wire Wire Line
	7500 1800 6850 1800
Wire Wire Line
	7500 1700 7250 1700
Wire Wire Line
	7500 1600 6850 1600
Wire Wire Line
	7500 1500 7250 1500
Wire Wire Line
	6550 1400 6150 1400
Wire Wire Line
	6950 1500 6150 1500
Wire Wire Line
	6550 1600 6150 1600
Wire Wire Line
	6950 1700 6150 1700
Wire Wire Line
	6550 1800 6150 1800
Text Label 6200 1400 0    50   ~ 0
CS
Text Label 6200 1500 0    50   ~ 0
RST
Text Label 6200 1600 0    50   ~ 0
A0-DC
Text Label 6200 1700 0    50   ~ 0
MOSI-SDA
Text Label 6200 1800 0    50   ~ 0
SCK
Wire Notes Line
	5450 1000 8650 1000
Wire Notes Line
	8650 1000 8650 2600
Wire Notes Line
	8650 2600 5450 2600
Wire Notes Line
	5450 2600 5450 1000
Text Notes 5550 1200 0    79   ~ 16
TFT LCD INTERFACE
Text Notes 5600 2400 0    79   ~ 16
ST7735S SPI
$Comp
L Connector:Barrel_Jack_Switch P1a1
U 1 1 5E605075
P 1350 4350
F 0 "P1a1" H 1407 4667 50  0000 C CNN
F 1 "Barrel_Jack_Switch" H 1407 4576 50  0000 C CNN
F 2 "Connector_BarrelJack:BarrelJack_Wuerth_6941xx301002" H 1400 4310 50  0001 C CNN
F 3 "https://datasheet.lcsc.com/szlcsc/1810291122_XKB-Connectivity-DC-005-5A-2-0-SMT_C319134.pdf" H 1400 4310 50  0001 C CNN
F 4 "C319134" H 1350 4350 50  0001 C CNN "LCSC"
	1    1350 4350
	1    0    0    -1  
$EndComp
$Comp
L Switch:SW_SPDT SW4a1
U 1 1 5E60659E
P 2500 4250
F 0 "SW4a1" H 2500 4535 50  0000 C CNN
F 1 "SW_SPDT" H 2500 4444 50  0000 C CNN
F 2 "SWITCH:SW_Toggle_Blue_wSlots" H 2500 4250 50  0001 C CNN
F 3 "~" H 2500 4250 50  0001 C CNN
	1    2500 4250
	1    0    0    -1  
$EndComp
$Comp
L Regulator_Linear:L78L05_SOT89 U2a1
U 1 1 5E6080F0
P 2300 5300
F 0 "U2a1" H 2300 5542 50  0000 C CNN
F 1 "L78L05_SOT89" H 2300 5451 50  0000 C CNN
F 2 "Package_TO_SOT_SMD:SOT-89-3" H 2300 5500 50  0001 C CIN
F 3 "http://www.st.com/content/ccc/resource/technical/document/datasheet/15/55/e5/aa/23/5b/43/fd/CD00000446.pdf/files/CD00000446.pdf/jcr:content/translations/en.CD00000446.pdf" H 2300 5250 50  0001 C CNN
	1    2300 5300
	1    0    0    -1  
$EndComp
Wire Wire Line
	2600 5300 2800 5300
Connection ~ 1750 5300
Wire Wire Line
	1750 5300 2000 5300
Connection ~ 2800 5300
Wire Wire Line
	2800 5300 3100 5300
Wire Wire Line
	1650 4350 1650 4450
Connection ~ 1650 4450
Wire Wire Line
	2300 4250 2300 3850
Wire Wire Line
	2300 3850 2750 3850
Wire Wire Line
	2750 3850 2750 4150
Wire Wire Line
	2750 4150 2700 4150
Connection ~ 2300 4250
Text Label 2750 4350 0    79   ~ 0
Vin
Text Label 1450 5300 0    79   ~ 0
Vin
$Comp
L power:+VDC #PWR0105
U 1 1 5E61FC5A
P 3250 4350
F 0 "#PWR0105" H 3250 4250 50  0001 C CNN
F 1 "+VDC" H 3250 4625 50  0000 C CNN
F 2 "" H 3250 4350 50  0001 C CNN
F 3 "" H 3250 4350 50  0001 C CNN
	1    3250 4350
	1    0    0    -1  
$EndComp
$Comp
L power:+VDC #PWR0106
U 1 1 5E6208CD
P 1300 5300
F 0 "#PWR0106" H 1300 5200 50  0001 C CNN
F 1 "+VDC" H 1300 5575 50  0000 C CNN
F 2 "" H 1300 5300 50  0001 C CNN
F 3 "" H 1300 5300 50  0001 C CNN
	1    1300 5300
	1    0    0    -1  
$EndComp
Wire Wire Line
	1300 5300 1750 5300
$Comp
L power:-VDC #PWR0107
U 1 1 5E621319
P 3250 4700
F 0 "#PWR0107" H 3250 4600 50  0001 C CNN
F 1 "-VDC" H 3250 4975 50  0000 C CNN
F 2 "" H 3250 4700 50  0001 C CNN
F 3 "" H 3250 4700 50  0001 C CNN
	1    3250 4700
	1    0    0    -1  
$EndComp
Wire Wire Line
	1650 4450 1650 4700
Connection ~ 1650 4700
Wire Notes Line
	1000 3500 3400 3500
Wire Notes Line
	3400 3500 3400 5950
Wire Notes Line
	3400 5950 1000 5950
Text Notes 1050 3700 0    79   ~ 16
DC-in and voltage regulation
$Comp
L Switch:SW_Push SW2a1
U 1 1 5E63EB2A
P 1850 2350
F 0 "SW2a1" V 1804 2498 50  0000 L CNN
F 1 "SW_Push" V 1895 2498 50  0000 L CNN
F 2 "Button_Switch_SMD:SW_Push_1P1T_NO_6x6mm_H9.5mm" H 1850 2550 50  0001 C CNN
F 3 "https://datasheet.lcsc.com/szlcsc/1811082134_Korean-Hroparts-Elec-K2-6639SP-V4SC-04_C223741.pdf" H 1850 2550 50  0001 C CNN
F 4 "C223741" V 1850 2350 50  0001 C CNN "LCSC"
	1    1850 2350
	0    1    1    0   
$EndComp
$Comp
L power:+5V #PWR0108
U 1 1 5E6410EE
P 1850 1850
F 0 "#PWR0108" H 1850 1700 50  0001 C CNN
F 1 "+5V" H 1865 2023 50  0000 C CNN
F 2 "" H 1850 1850 50  0001 C CNN
F 3 "" H 1850 1850 50  0001 C CNN
	1    1850 1850
	1    0    0    -1  
$EndComp
$Comp
L power:GND #PWR0109
U 1 1 5E641596
P 1850 2550
F 0 "#PWR0109" H 1850 2300 50  0001 C CNN
F 1 "GND" H 1855 2377 50  0000 C CNN
F 2 "" H 1850 2550 50  0001 C CNN
F 3 "" H 1850 2550 50  0001 C CNN
	1    1850 2550
	1    0    0    -1  
$EndComp
$Comp
L power:GND #PWR0110
U 1 1 5E64199A
P 1450 2550
F 0 "#PWR0110" H 1450 2300 50  0001 C CNN
F 1 "GND" H 1455 2377 50  0000 C CNN
F 2 "" H 1450 2550 50  0001 C CNN
F 3 "" H 1450 2550 50  0001 C CNN
	1    1450 2550
	1    0    0    -1  
$EndComp
Wire Wire Line
	1450 2250 1450 2150
Wire Wire Line
	1450 2150 1850 2150
Connection ~ 1850 2150
Text Label 1350 2150 0    79   ~ 0
SW1
Wire Wire Line
	1450 2150 1350 2150
Connection ~ 1450 2150
$Comp
L Device:R R3a1
U 1 1 5E64BF0E
P 2950 2000
F 0 "R3a1" V 2850 2000 50  0000 C CNN
F 1 "10k" V 2950 2000 50  0000 C CNN
F 2 "Resistor_SMD:R_0603_1608Metric" V 2880 2000 50  0001 C CNN
F 3 "~" H 2950 2000 50  0001 C CNN
	1    2950 2000
	-1   0    0    1   
$EndComp
$Comp
L Device:C C3a1
U 1 1 5E64BF18
P 2550 2400
F 0 "C3a1" H 2665 2446 50  0000 L CNN
F 1 "10nF" H 2665 2355 50  0000 L CNN
F 2 "Capacitor_SMD:C_0603_1608Metric" H 2588 2250 50  0001 C CNN
F 3 "~" H 2550 2400 50  0001 C CNN
	1    2550 2400
	1    0    0    -1  
$EndComp
$Comp
L Switch:SW_Push SW3a1
U 1 1 5E64BF22
P 2950 2350
F 0 "SW3a1" V 2904 2498 50  0000 L CNN
F 1 "SW_Push" V 2995 2498 50  0000 L CNN
F 2 "Button_Switch_SMD:SW_Push_1P1T_NO_6x6mm_H9.5mm" H 2950 2550 50  0001 C CNN
F 3 "https://datasheet.lcsc.com/szlcsc/1811082134_Korean-Hroparts-Elec-K2-6639SP-V4SC-04_C223741.pdf" H 2950 2550 50  0001 C CNN
F 4 "C223741" V 2950 2350 50  0001 C CNN "LCSC"
	1    2950 2350
	0    1    1    0   
$EndComp
$Comp
L power:+5V #PWR0111
U 1 1 5E64BF2C
P 2950 1850
F 0 "#PWR0111" H 2950 1700 50  0001 C CNN
F 1 "+5V" H 2965 2023 50  0000 C CNN
F 2 "" H 2950 1850 50  0001 C CNN
F 3 "" H 2950 1850 50  0001 C CNN
	1    2950 1850
	1    0    0    -1  
$EndComp
$Comp
L power:GND #PWR0112
U 1 1 5E64BF36
P 2950 2550
F 0 "#PWR0112" H 2950 2300 50  0001 C CNN
F 1 "GND" H 2955 2377 50  0000 C CNN
F 2 "" H 2950 2550 50  0001 C CNN
F 3 "" H 2950 2550 50  0001 C CNN
	1    2950 2550
	1    0    0    -1  
$EndComp
$Comp
L power:GND #PWR0113
U 1 1 5E64BF40
P 2550 2550
F 0 "#PWR0113" H 2550 2300 50  0001 C CNN
F 1 "GND" H 2555 2377 50  0000 C CNN
F 2 "" H 2550 2550 50  0001 C CNN
F 3 "" H 2550 2550 50  0001 C CNN
	1    2550 2550
	1    0    0    -1  
$EndComp
Wire Wire Line
	2550 2250 2550 2150
Wire Wire Line
	2550 2150 2950 2150
Connection ~ 2950 2150
Text Label 2450 2150 0    79   ~ 0
SW2
Wire Wire Line
	2550 2150 2450 2150
Connection ~ 2550 2150
$Comp
L Device:Rotary_Encoder_Switch SW1a1
U 1 1 5E654CE2
P 4100 2150
F 0 "SW1a1" V 4350 1900 50  0000 R CNN
F 1 "Rotary_Encoder_Switch" V 4250 1900 50  0000 R CNN
F 2 "Rotary_Encoder:RotaryEncoder_Alps_EC11E-Switch_Vertical_H20mm" H 3950 2310 50  0001 C CNN
F 3 "~" H 4100 2410 50  0001 C CNN
	1    4100 2150
	0    -1   -1   0   
$EndComp
$Comp
L Device:C C4a1
U 1 1 5E657B4B
P 3900 2800
F 0 "C4a1" H 4015 2846 50  0000 L CNN
F 1 "10nF" H 4015 2755 50  0000 L CNN
F 2 "Capacitor_SMD:C_0603_1608Metric" H 3938 2650 50  0001 C CNN
F 3 "~" H 3900 2800 50  0001 C CNN
	1    3900 2800
	1    0    0    -1  
$EndComp
$Comp
L power:GND #PWR0114
U 1 1 5E657F63
P 4100 2450
F 0 "#PWR0114" H 4100 2200 50  0001 C CNN
F 1 "GND" H 4105 2277 50  0000 C CNN
F 2 "" H 4100 2450 50  0001 C CNN
F 3 "" H 4100 2450 50  0001 C CNN
	1    4100 2450
	1    0    0    -1  
$EndComp
Wire Wire Line
	4200 2450 4300 2450
Wire Wire Line
	4300 2450 4300 2650
Wire Wire Line
	4000 2450 3900 2450
Wire Wire Line
	3900 2450 3900 2650
$Comp
L power:GND #PWR0115
U 1 1 5E65CB79
P 3900 2950
F 0 "#PWR0115" H 3900 2700 50  0001 C CNN
F 1 "GND" H 3905 2777 50  0000 C CNN
F 2 "" H 3900 2950 50  0001 C CNN
F 3 "" H 3900 2950 50  0001 C CNN
	1    3900 2950
	1    0    0    -1  
$EndComp
$Comp
L power:GND #PWR0116
U 1 1 5E65CE9B
P 4300 2950
F 0 "#PWR0116" H 4300 2700 50  0001 C CNN
F 1 "GND" H 4305 2777 50  0000 C CNN
F 2 "" H 4300 2950 50  0001 C CNN
F 3 "" H 4300 2950 50  0001 C CNN
	1    4300 2950
	1    0    0    -1  
$EndComp
Wire Wire Line
	4300 2650 4500 2650
Wire Wire Line
	3900 2650 3700 2650
Connection ~ 3900 2650
$Comp
L Device:R R6a1
U 1 1 5E661DB1
P 3700 2500
F 0 "R6a1" V 3600 2500 50  0000 C CNN
F 1 "10k" V 3700 2500 50  0000 C CNN
F 2 "Resistor_SMD:R_0603_1608Metric" V 3630 2500 50  0001 C CNN
F 3 "~" H 3700 2500 50  0001 C CNN
	1    3700 2500
	-1   0    0    1   
$EndComp
$Comp
L Device:R R11a1
U 1 1 5E662109
P 4500 2500
F 0 "R11a1" V 4400 2500 50  0000 C CNN
F 1 "10k" V 4500 2500 50  0000 C CNN
F 2 "Resistor_SMD:R_0603_1608Metric" V 4430 2500 50  0001 C CNN
F 3 "~" H 4500 2500 50  0001 C CNN
	1    4500 2500
	-1   0    0    1   
$EndComp
$Comp
L power:+5V #PWR0117
U 1 1 5E6625BC
P 4500 2350
F 0 "#PWR0117" H 4500 2200 50  0001 C CNN
F 1 "+5V" H 4515 2523 50  0000 C CNN
F 2 "" H 4500 2350 50  0001 C CNN
F 3 "" H 4500 2350 50  0001 C CNN
	1    4500 2350
	1    0    0    -1  
$EndComp
$Comp
L power:+5V #PWR0118
U 1 1 5E662AF1
P 3700 2350
F 0 "#PWR0118" H 3700 2200 50  0001 C CNN
F 1 "+5V" H 3715 2523 50  0000 C CNN
F 2 "" H 3700 2350 50  0001 C CNN
F 3 "" H 3700 2350 50  0001 C CNN
	1    3700 2350
	1    0    0    -1  
$EndComp
Text Label 4750 3200 1    79   ~ 0
EncoderB
Text Label 3550 3200 1    79   ~ 0
EncoderA
Wire Wire Line
	4750 3250 4750 2650
Wire Wire Line
	4750 2650 4500 2650
Connection ~ 4500 2650
Wire Wire Line
	3550 3250 3550 2650
Wire Wire Line
	3550 2650 3700 2650
Connection ~ 3700 2650
$Comp
L power:GND #PWR0120
U 1 1 5E66BD7B
P 4000 1850
F 0 "#PWR0120" H 4000 1600 50  0001 C CNN
F 1 "GND" H 4005 1677 50  0000 C CNN
F 2 "" H 4000 1850 50  0001 C CNN
F 3 "" H 4000 1850 50  0001 C CNN
	1    4000 1850
	-1   0    0    1   
$EndComp
Connection ~ 4300 2650
$Comp
L Device:C C5a1
U 1 1 5E65666F
P 4300 2800
F 0 "C5a1" H 4415 2846 50  0000 L CNN
F 1 "10nF" H 4415 2755 50  0000 L CNN
F 2 "Capacitor_SMD:C_0603_1608Metric" H 4338 2650 50  0001 C CNN
F 3 "~" H 4300 2800 50  0001 C CNN
	1    4300 2800
	1    0    0    -1  
$EndComp
$Comp
L Device:C C1a1
U 1 1 5E66ECF5
P 3550 1750
F 0 "C1a1" H 3665 1796 50  0000 L CNN
F 1 "10nF" H 3665 1705 50  0000 L CNN
F 2 "Capacitor_SMD:C_0603_1608Metric" H 3588 1600 50  0001 C CNN
F 3 "~" H 3550 1750 50  0001 C CNN
	1    3550 1750
	1    0    0    -1  
$EndComp
$Comp
L power:GND #PWR0122
U 1 1 5E670CD4
P 3550 1900
F 0 "#PWR0122" H 3550 1650 50  0001 C CNN
F 1 "GND" H 3555 1727 50  0000 C CNN
F 2 "" H 3550 1900 50  0001 C CNN
F 3 "" H 3550 1900 50  0001 C CNN
	1    3550 1900
	1    0    0    -1  
$EndComp
$Comp
L Device:R R1a1
U 1 1 5E67104A
P 3550 1450
F 0 "R1a1" V 3450 1450 50  0000 C CNN
F 1 "10k" V 3550 1450 50  0000 C CNN
F 2 "Resistor_SMD:R_0603_1608Metric" V 3480 1450 50  0001 C CNN
F 3 "~" H 3550 1450 50  0001 C CNN
	1    3550 1450
	-1   0    0    1   
$EndComp
$Comp
L power:+5V #PWR0124
U 1 1 5E6714CF
P 3550 1300
F 0 "#PWR0124" H 3550 1150 50  0001 C CNN
F 1 "+5V" H 3565 1473 50  0000 C CNN
F 2 "" H 3550 1300 50  0001 C CNN
F 3 "" H 3550 1300 50  0001 C CNN
	1    3550 1300
	1    0    0    -1  
$EndComp
Wire Wire Line
	4200 1850 4200 1600
Wire Wire Line
	4200 1600 3550 1600
Connection ~ 3550 1600
Text Label 3700 1600 0    79   ~ 0
EncoderSW
Wire Notes Line
	1000 1000 5350 1000
Wire Notes Line
	5350 1000 5350 3400
Wire Notes Line
	5350 3400 1000 3400
Wire Notes Line
	1000 3400 1000 1000
Text Notes 1650 1450 0    79   ~ 16
HMI INTERFACE
$Comp
L Connector:Conn_01x02_Male J4a1
U 1 1 5E68EE45
P 3900 4300
F 0 "J4a1" H 4008 4481 50  0000 C CNN
F 1 "Conn_01x02_Male" H 4008 4390 50  0000 C CNN
F 2 "Connector_PinHeader_2.54mm:PinHeader_1x02_P2.54mm_Vertical" H 3900 4300 50  0001 C CNN
F 3 "~" H 3900 4300 50  0001 C CNN
	1    3900 4300
	1    0    0    -1  
$EndComp
$Comp
L Device:C C6a1
U 1 1 5E6C0F91
P 4400 4450
F 0 "C6a1" H 4515 4496 50  0000 L CNN
F 1 "10nF" H 4515 4405 50  0000 L CNN
F 2 "Capacitor_SMD:C_0603_1608Metric" H 4438 4300 50  0001 C CNN
F 3 "~" H 4400 4450 50  0001 C CNN
	1    4400 4450
	1    0    0    -1  
$EndComp
$Comp
L power:GND #PWR0126
U 1 1 5E6C1639
P 4400 4600
F 0 "#PWR0126" H 4400 4350 50  0001 C CNN
F 1 "GND" H 4405 4427 50  0000 C CNN
F 2 "" H 4400 4600 50  0001 C CNN
F 3 "" H 4400 4600 50  0001 C CNN
	1    4400 4600
	1    0    0    -1  
$EndComp
$Comp
L Device:R R12a1
U 1 1 5E6C197E
P 4400 4100
F 0 "R12a1" V 4300 4100 50  0000 C CNN
F 1 "10k" V 4400 4100 50  0000 C CNN
F 2 "Resistor_SMD:R_0603_1608Metric" V 4330 4100 50  0001 C CNN
F 3 "~" H 4400 4100 50  0001 C CNN
	1    4400 4100
	-1   0    0    1   
$EndComp
$Comp
L power:+5V #PWR0127
U 1 1 5E6C1E88
P 4400 3950
F 0 "#PWR0127" H 4400 3800 50  0001 C CNN
F 1 "+5V" H 4415 4123 50  0000 C CNN
F 2 "" H 4400 3950 50  0001 C CNN
F 3 "" H 4400 3950 50  0001 C CNN
	1    4400 3950
	1    0    0    -1  
$EndComp
Wire Wire Line
	4100 4300 4100 4400
Wire Wire Line
	4100 4300 4400 4300
Connection ~ 4100 4300
Connection ~ 4400 4300
Wire Wire Line
	4400 4300 4900 4300
Wire Wire Line
	4400 4250 4400 4300
Text Label 4500 4300 0    79   ~ 0
RestHeater1
$Comp
L Connector:Conn_01x02_Male J5a1
U 1 1 5E6C76E2
P 3900 5400
F 0 "J5a1" H 4008 5581 50  0000 C CNN
F 1 "Conn_01x02_Male" H 4008 5490 50  0000 C CNN
F 2 "Connector_PinHeader_2.54mm:PinHeader_1x02_P2.54mm_Vertical" H 3900 5400 50  0001 C CNN
F 3 "~" H 3900 5400 50  0001 C CNN
	1    3900 5400
	1    0    0    -1  
$EndComp
$Comp
L Device:C C7a1
U 1 1 5E6C76EC
P 4400 5550
F 0 "C7a1" H 4515 5596 50  0000 L CNN
F 1 "10nF" H 4515 5505 50  0000 L CNN
F 2 "Capacitor_SMD:C_0603_1608Metric" H 4438 5400 50  0001 C CNN
F 3 "~" H 4400 5550 50  0001 C CNN
	1    4400 5550
	1    0    0    -1  
$EndComp
$Comp
L power:GND #PWR0128
U 1 1 5E6C76F6
P 4400 5700
F 0 "#PWR0128" H 4400 5450 50  0001 C CNN
F 1 "GND" H 4405 5527 50  0000 C CNN
F 2 "" H 4400 5700 50  0001 C CNN
F 3 "" H 4400 5700 50  0001 C CNN
	1    4400 5700
	1    0    0    -1  
$EndComp
$Comp
L Device:R R13a1
U 1 1 5E6C7700
P 4400 5200
F 0 "R13a1" V 4300 5200 50  0000 C CNN
F 1 "10k" V 4400 5200 50  0000 C CNN
F 2 "Resistor_SMD:R_0603_1608Metric" V 4330 5200 50  0001 C CNN
F 3 "~" H 4400 5200 50  0001 C CNN
	1    4400 5200
	-1   0    0    1   
$EndComp
Wire Wire Line
	4100 5400 4100 5500
Wire Wire Line
	4100 5400 4400 5400
Connection ~ 4100 5400
Connection ~ 4400 5400
Wire Wire Line
	4400 5400 4900 5400
Wire Wire Line
	4400 5350 4400 5400
Text Label 4500 5400 0    79   ~ 0
RestHeater2
$Comp
L Device:C C8a1
U 1 1 5E6CD6C5
P 1200 7100
F 0 "C8a1" H 1315 7146 50  0000 L CNN
F 1 "10nF" H 1315 7055 50  0000 L CNN
F 2 "Capacitor_SMD:C_0603_1608Metric" H 1238 6950 50  0001 C CNN
F 3 "~" H 1200 7100 50  0001 C CNN
	1    1200 7100
	1    0    0    -1  
$EndComp
$Comp
L power:GND #PWR0130
U 1 1 5E6CD6CF
P 1200 7250
F 0 "#PWR0130" H 1200 7000 50  0001 C CNN
F 1 "GND" H 1205 7077 50  0000 C CNN
F 2 "" H 1200 7250 50  0001 C CNN
F 3 "" H 1200 7250 50  0001 C CNN
	1    1200 7250
	1    0    0    -1  
$EndComp
$Comp
L Device:R R14a1
U 1 1 5E6CD6D9
P 1200 6650
F 0 "R14a1" V 1100 6650 50  0000 C CNN
F 1 "100k" V 1200 6650 50  0000 C CNN
F 2 "Resistor_SMD:R_0603_1608Metric" V 1130 6650 50  0001 C CNN
F 3 "~" H 1200 6650 50  0001 C CNN
	1    1200 6650
	-1   0    0    1   
$EndComp
$Comp
L power:+5V #PWR0131
U 1 1 5E6CD6E3
P 1200 6500
F 0 "#PWR0131" H 1200 6350 50  0001 C CNN
F 1 "+5V" H 1215 6673 50  0000 C CNN
F 2 "" H 1200 6500 50  0001 C CNN
F 3 "" H 1200 6500 50  0001 C CNN
	1    1200 6500
	1    0    0    -1  
$EndComp
Connection ~ 1200 6950
Wire Wire Line
	1200 6950 1700 6950
Wire Wire Line
	1200 6800 1200 6950
Text Label 1300 6950 0    79   ~ 0
NTCtemp1
$Comp
L Device:Thermistor_NTC R16a1
U 1 1 5E6D00E9
P 1700 7100
F 0 "R16a1" H 1798 7146 50  0000 L CNN
F 1 "100k" H 1798 7055 50  0000 L CNN
F 2 "Resistor_SMD:R_0603_1608Metric" H 1700 7150 50  0001 C CNN
F 3 "~" H 1700 7150 50  0001 C CNN
	1    1700 7100
	1    0    0    -1  
$EndComp
$Comp
L power:GND #PWR0132
U 1 1 5E6D1727
P 1700 7250
F 0 "#PWR0132" H 1700 7000 50  0001 C CNN
F 1 "GND" H 1705 7077 50  0000 C CNN
F 2 "" H 1700 7250 50  0001 C CNN
F 3 "" H 1700 7250 50  0001 C CNN
	1    1700 7250
	1    0    0    -1  
$EndComp
Wire Wire Line
	1700 6950 2150 6950
Connection ~ 1700 6950
$Comp
L Device:R R17a1
U 1 1 5E6D3B0D
P 2900 6800
F 0 "R17a1" V 2800 6800 50  0000 C CNN
F 1 "10k" V 2900 6800 50  0000 C CNN
F 2 "Resistor_SMD:R_0603_1608Metric" V 2830 6800 50  0001 C CNN
F 3 "~" H 2900 6800 50  0001 C CNN
	1    2900 6800
	-1   0    0    1   
$EndComp
$Comp
L Device:R R18a1
U 1 1 5E6D3EDB
P 2900 7100
F 0 "R18a1" V 2800 7100 50  0000 C CNN
F 1 "1k" V 2900 7100 50  0000 C CNN
F 2 "Resistor_SMD:R_0603_1608Metric" V 2830 7100 50  0001 C CNN
F 3 "~" H 2900 7100 50  0001 C CNN
	1    2900 7100
	-1   0    0    1   
$EndComp
$Comp
L Device:C C11a1
U 1 1 5E6D4231
P 3150 7100
F 0 "C11a1" H 3265 7146 50  0000 L CNN
F 1 "10nF" H 3265 7055 50  0000 L CNN
F 2 "Capacitor_SMD:C_0603_1608Metric" H 3188 6950 50  0001 C CNN
F 3 "~" H 3150 7100 50  0001 C CNN
	1    3150 7100
	1    0    0    -1  
$EndComp
$Comp
L power:GND #PWR0134
U 1 1 5E6D4605
P 2900 7250
F 0 "#PWR0134" H 2900 7000 50  0001 C CNN
F 1 "GND" H 2905 7077 50  0000 C CNN
F 2 "" H 2900 7250 50  0001 C CNN
F 3 "" H 2900 7250 50  0001 C CNN
	1    2900 7250
	1    0    0    -1  
$EndComp
$Comp
L power:GND #PWR0135
U 1 1 5E6D4931
P 3150 7250
F 0 "#PWR0135" H 3150 7000 50  0001 C CNN
F 1 "GND" H 3155 7077 50  0000 C CNN
F 2 "" H 3150 7250 50  0001 C CNN
F 3 "" H 3150 7250 50  0001 C CNN
	1    3150 7250
	1    0    0    -1  
$EndComp
Wire Wire Line
	2900 6950 3150 6950
Connection ~ 2900 6950
Connection ~ 3150 6950
Wire Wire Line
	3150 6950 3400 6950
Text Label 3050 6950 0    79   ~ 0
Vdcin
Wire Notes Line
	1000 6050 2450 6050
Wire Notes Line
	2450 6050 2450 7600
Wire Notes Line
	2450 7600 1000 7600
Wire Notes Line
	1000 7600 1000 6050
Wire Notes Line
	2550 6050 2550 7600
Wire Notes Line
	2550 7600 3700 7600
Wire Notes Line
	3700 7600 3700 6050
Wire Notes Line
	3700 6050 2550 6050
Text Notes 1100 6200 0    79   ~ 16
Internal Temperature
Text Notes 2650 6200 0    79   ~ 16
Input Voltage
Wire Notes Line
	3500 5950 5550 5950
Wire Notes Line
	5550 5950 5550 3500
Wire Notes Line
	5550 3500 3500 3500
Wire Notes Line
	3500 3500 3500 5950
Text Notes 3600 3700 0    79   ~ 16
Rest connection for heaters
$Comp
L power:+5V #PWR0164
U 1 1 5E722891
P 10200 4300
F 0 "#PWR0164" H 10200 4150 50  0001 C CNN
F 1 "+5V" H 10215 4473 50  0000 C CNN
F 2 "" H 10200 4300 50  0001 C CNN
F 3 "" H 10200 4300 50  0001 C CNN
	1    10200 4300
	0    1    1    0   
$EndComp
$Comp
L power:GND #PWR0165
U 1 1 5E723237
P 10050 4200
F 0 "#PWR0165" H 10050 3950 50  0001 C CNN
F 1 "GND" V 10055 4072 50  0000 R CNN
F 2 "" H 10050 4200 50  0001 C CNN
F 3 "" H 10050 4200 50  0001 C CNN
	1    10050 4200
	0    -1   -1   0   
$EndComp
Wire Wire Line
	10200 4300 10050 4300
Wire Wire Line
	10050 4800 10750 4800
Wire Wire Line
	10050 4900 10750 4900
Wire Wire Line
	10750 5500 10050 5500
Text Label 10100 5000 0    79   ~ 0
NTCtemp1
Text Label 10100 5100 0    79   ~ 0
Vdcin
Text Label 10100 5200 0    79   ~ 0
Vtemp1
Text Label 10100 5300 0    79   ~ 0
Vtemp2
Wire Wire Line
	8550 5300 7750 5300
Wire Wire Line
	8550 5400 7750 5400
Wire Wire Line
	8550 5500 7750 5500
Wire Wire Line
	8550 5600 7750 5600
Text Label 7850 4200 0    79   ~ 0
SW1
Text Label 7850 4300 0    79   ~ 0
SW2
Text Label 7800 4400 0    79   ~ 0
EncoderA
Text Label 7800 4500 0    79   ~ 0
EncoderB
Text Label 7800 4600 0    79   ~ 0
CS
Text Label 7800 4700 0    79   ~ 0
A0-DC
Text Label 7800 4800 0    79   ~ 0
RestHeater1
Text Label 7800 4900 0    79   ~ 0
RestHeater2
Text Label 8450 5000 2    79   ~ 0
EncoderSW
Text Label 7800 5100 0    79   ~ 0
Heater1
Text Label 7800 5200 0    79   ~ 0
Heater2
Text Label 10100 5400 0    79   ~ 0
SCK
Text Label 10100 5600 0    79   ~ 0
MOSI-SDA
Wire Wire Line
	10050 5400 10750 5400
Wire Wire Line
	10050 5600 10750 5600
Wire Wire Line
	10050 5000 10750 5000
Wire Wire Line
	10050 5100 10750 5100
Wire Wire Line
	10050 5200 10750 5200
Wire Wire Line
	10050 5300 10750 5300
Wire Wire Line
	7750 5200 8550 5200
Wire Wire Line
	7750 5100 8550 5100
Wire Wire Line
	7750 5000 8550 5000
Wire Wire Line
	7750 4900 8550 4900
Wire Wire Line
	7750 4800 8550 4800
Wire Wire Line
	7750 4700 8550 4700
Wire Wire Line
	7750 4600 8550 4600
Wire Wire Line
	7750 4500 8550 4500
Wire Wire Line
	7750 4400 8550 4400
Wire Wire Line
	7750 4300 8550 4300
Wire Wire Line
	7750 4200 8550 4200
Wire Notes Line
	7450 3500 10900 3500
Wire Notes Line
	10900 3500 10900 5950
Wire Notes Line
	10900 5950 7450 5950
Wire Notes Line
	7450 5950 7450 3500
Text Notes 7700 3750 0    79   ~ 16
MCU connections
$Sheet
S 4650 6350 1200 1100
U 5E585963
F0 "Channels" 50
F1 "SolderingRT1_Channels.sch" 50
F2 "GND" I R 5850 6700 79 
F3 "Vtemp1" I R 5850 6900 79 
F4 "Vtemp2" I R 5850 7100 79 
F5 "Heater2" I L 4650 7100 79 
F6 "+5V" I R 5850 6600 79 
F7 "+VDC" I R 5850 6500 79 
F8 "Heater1" I L 4650 6900 79 
$EndSheet
Text Label 4100 6900 0    79   ~ 0
Heater1
Text Label 4100 7100 0    79   ~ 0
Heater2
Wire Wire Line
	4050 7100 4650 7100
Wire Wire Line
	4050 6900 4650 6900
Text Label 5900 6900 0    79   ~ 0
Vtemp1
Text Label 5900 7100 0    79   ~ 0
Vtemp2
Wire Wire Line
	5850 6900 6400 6900
Wire Wire Line
	5850 7100 6400 7100
$Comp
L power:GND #PWR0166
U 1 1 5E64338D
P 5850 6700
F 0 "#PWR0166" H 5850 6450 50  0001 C CNN
F 1 "GND" H 5855 6527 50  0000 C CNN
F 2 "" H 5850 6700 50  0001 C CNN
F 3 "" H 5850 6700 50  0001 C CNN
	1    5850 6700
	0    -1   -1   0   
$EndComp
$Comp
L power:+5V #PWR0129
U 1 1 5E6C770A
P 4400 5050
F 0 "#PWR0129" H 4400 4900 50  0001 C CNN
F 1 "+5V" H 4415 5223 50  0000 C CNN
F 2 "" H 4400 5050 50  0001 C CNN
F 3 "" H 4400 5050 50  0001 C CNN
	1    4400 5050
	1    0    0    -1  
$EndComp
$Comp
L power:+5V #PWR0167
U 1 1 5E647964
P 6150 6600
F 0 "#PWR0167" H 6150 6450 50  0001 C CNN
F 1 "+5V" H 6165 6773 50  0000 C CNN
F 2 "" H 6150 6600 50  0001 C CNN
F 3 "" H 6150 6600 50  0001 C CNN
	1    6150 6600
	0    1    1    0   
$EndComp
$Comp
L power:+VDC #PWR0133
U 1 1 5E6D36A6
P 2900 6650
F 0 "#PWR0133" H 2900 6550 50  0001 C CNN
F 1 "+VDC" H 2900 6925 50  0000 C CNN
F 2 "" H 2900 6650 50  0001 C CNN
F 3 "" H 2900 6650 50  0001 C CNN
	1    2900 6650
	1    0    0    -1  
$EndComp
$Comp
L power:+VDC #PWR0168
U 1 1 5E64B802
P 6000 6500
F 0 "#PWR0168" H 6000 6400 50  0001 C CNN
F 1 "+VDC" H 6000 6775 50  0000 C CNN
F 2 "" H 6000 6500 50  0001 C CNN
F 3 "" H 6000 6500 50  0001 C CNN
	1    6000 6500
	1    0    0    -1  
$EndComp
Wire Wire Line
	6000 6500 5850 6500
Wire Wire Line
	6150 6600 5850 6600
Wire Notes Line
	3800 6050 6600 6050
Wire Notes Line
	6600 6050 6600 7600
Wire Notes Line
	6600 7600 3800 7600
Wire Notes Line
	3800 7600 3800 6050
Text Notes 3900 6200 0    79   ~ 16
Heater Channels
$Comp
L Connector:Conn_01x02_Male J7a1
U 1 1 5E6BF13E
P 6350 5600
F 0 "J7a1" V 6400 5400 50  0000 C CNN
F 1 "Conn_01x02_Male" V 6300 5500 50  0000 C CNN
F 2 "Connector_PinHeader_2.54mm:PinHeader_1x02_P2.54mm_Vertical" H 6350 5600 50  0001 C CNN
F 3 "~" H 6350 5600 50  0001 C CNN
	1    6350 5600
	0    -1   -1   0   
$EndComp
$Comp
L power:+VDC #PWR0170
U 1 1 5E6BF801
P 6350 5300
F 0 "#PWR0170" H 6350 5200 50  0001 C CNN
F 1 "+VDC" H 6350 5575 50  0000 C CNN
F 2 "" H 6350 5300 50  0001 C CNN
F 3 "" H 6350 5300 50  0001 C CNN
	1    6350 5300
	0    -1   -1   0   
$EndComp
$Comp
L power:GND #PWR0171
U 1 1 5E6C0489
P 6450 5300
F 0 "#PWR0171" H 6450 5050 50  0001 C CNN
F 1 "GND" H 6455 5127 50  0000 C CNN
F 2 "" H 6450 5300 50  0001 C CNN
F 3 "" H 6450 5300 50  0001 C CNN
	1    6450 5300
	0    -1   -1   0   
$EndComp
Wire Wire Line
	6350 5400 6350 5300
Wire Wire Line
	6450 5400 6450 5300
Wire Notes Line
	5650 3500 7350 3500
Wire Notes Line
	7350 3500 7350 5950
Wire Notes Line
	7350 5950 5650 5950
Wire Notes Line
	5650 5950 5650 3500
Text Notes 5900 3700 0    79   ~ 16
Other Conenctions
$Sheet
S 8550 4050 1500 1700
U 5E551509
F0 "Micro" 50
F1 "SolderingRT1_Micro.sch" 50
F2 "A0" I R 10050 5300 79 
F3 "A1" I R 10050 5200 79 
F4 "A2" I R 10050 5100 79 
F5 "A3" I R 10050 5000 79 
F6 "A4" I R 10050 4900 79 
F7 "A5" I R 10050 4800 79 
F8 "D7" I L 8550 4900 79 
F9 "D6-A7" I L 8550 4800 79 
F10 "D12" I L 8550 5400 79 
F11 "+5V" I R 10050 4300 79 
F12 "GND" I R 10050 4200 79 
F13 "D0-RX" I L 8550 4300 79 
F14 "D2-SDA" I L 8550 4400 79 
F15 "D3-SCL" I L 8550 4500 79 
F16 "D1-TX" I L 8550 4200 79 
F17 "D4-A6" I L 8550 4600 79 
F18 "D13" I L 8550 5500 79 
F19 "D5" I L 8550 4700 79 
F20 "D11" I L 8550 5300 79 
F21 "D10-A10" I L 8550 5200 79 
F22 "D9-A9" I L 8550 5100 79 
F23 "D8-A8" I L 8550 5000 79 
F24 "D14-MISO" I R 10050 5500 79 
F25 "D16-MOSI" I R 10050 5600 79 
F26 "D15-SCLK" I R 10050 5400 79 
F27 "D14" I L 8550 5600 79 
F28 "RST" I R 10050 4400 79 
$EndSheet
Wire Wire Line
	10050 4400 10750 4400
Text Label 10450 4400 0    79   ~ 0
RST
$Comp
L Connector:Screw_Terminal_01x02 J1
U 1 1 5FAC715F
P 1800 4450
F 0 "J1" H 1500 4450 50  0000 C CNN
F 1 "Screw_Terminal_01x02" H 1150 4550 50  0000 C CNN
F 2 "Connectors_Phoenix:PhoenixContact_MC-G_02x5.08mm_Angled" H 1800 4450 50  0001 C CNN
F 3 "~" H 1800 4450 50  0001 C CNN
	1    1800 4450
	-1   0    0    1   
$EndComp
Wire Notes Line
	1000 5950 1000 3500
Wire Wire Line
	1650 4700 2000 4700
Wire Wire Line
	2000 4450 2000 4700
Connection ~ 2000 4700
Wire Wire Line
	2000 4700 3250 4700
Wire Wire Line
	1650 4250 2000 4250
Wire Wire Line
	2000 4350 2000 4250
Connection ~ 2000 4250
Wire Wire Line
	2000 4250 2300 4250
Wire Wire Line
	2700 4350 3250 4350
$Comp
L Connector:Conn_01x02_Male J8a1
U 1 1 5E690A58
P 6250 4650
F 0 "J8a1" V 6300 4450 50  0000 C CNN
F 1 "Conn_01x02_Male" V 6200 4550 50  0000 C CNN
F 2 "Connector_PinHeader_2.54mm:PinHeader_1x02_P2.54mm_Vertical" H 6250 4650 50  0001 C CNN
F 3 "~" H 6250 4650 50  0001 C CNN
	1    6250 4650
	0    -1   -1   0   
$EndComp
$Comp
L power:GND #PWR0169
U 1 1 5E696488
P 6500 4450
F 0 "#PWR0169" H 6500 4200 50  0001 C CNN
F 1 "GND" H 6505 4277 50  0000 C CNN
F 2 "" H 6500 4450 50  0001 C CNN
F 3 "" H 6500 4450 50  0001 C CNN
	1    6500 4450
	0    -1   -1   0   
$EndComp
Wire Wire Line
	6350 4450 6500 4450
Wire Wire Line
	6250 4450 6100 4450
$Comp
L power:+5V #PWR0202
U 1 1 5FB854FF
P 6100 4450
F 0 "#PWR0202" H 6100 4300 50  0001 C CNN
F 1 "+5V" H 6115 4623 50  0000 C CNN
F 2 "" H 6100 4450 50  0001 C CNN
F 3 "" H 6100 4450 50  0001 C CNN
	1    6100 4450
	0    -1   -1   0   
$EndComp
$EndSCHEMATC
