"Start Time","Track","Series","Hosted Session Name"
"2021.02.07 7:31 PM GMT","Nürburgring Grand-Prix-Strecke - Grand Prix w/out Arena","Hosted iRacing","Praxis Motorsport League"



"League Name","League ID","League Season","League Season ID","Points System"
"Praxis Motorsport League","3699","Walk Before You Run LMP2/GTE League","61191","None"

"Fin Pos","Car ID","Car","Car Class ID","Car Class","Team ID","Cust ID","Name","Start Pos","Car #","Out ID","Out","Interval","Laps Led","Qualify Time","Average Lap Time","Fastest Lap Time","Fast Lap#","Laps Comp","Inc","League Points","Max Fuel Fill%","Weight Penalty (KG)","League Agg Points"
"1","128","Dallara P217","2523","Dallara P217","362203","362203","Tero Merentie","1","8","0","Running","-00.000","16","","1:35.802","1:33.027","4","16","5","0","100","0","0"
"2","128","Dallara P217","2523","Dallara P217","84864","84864","Jordan Ward","3","27","0","Running","-06.556","0","","1:36.211","1:33.520","12","16","7","0","100","0","0"
"3","128","Dallara P217","2523","Dallara P217","404787","404787","Michael Holler","2","12","0","Running","-07.532","0","","1:36.273","1:33.130","5","16","7","0","100","0","0"
"4","128","Dallara P217","2523","Dallara P217","480677","480677","Jason Williamson2","4","54","0","Running","-1 L","0","","1:39.006","1:34.761","15","15","3","0","100","0","0"
"5","102","Porsche 911 RSR","100","GTE Class","438221","438221","Bryan Elliott","5","911","0","Running","-1 L","0","","1:43.444","1:40.420","3","15","2","0","100","0","0"
"6","127","Chevrolet Corvette C8.R GTE","100","GTE Class","496912","496912","Gabriel Larsson-Rowe","8","11","0","Running","-1 L","0","","1:43.975","1:40.059","10","15","4","0","100","0","0"
"7","92","Ford GTE","100","GTE Class","384575","384575","John Dinkel","6","33","0","Running","-1 L","0","","1:43.781","1:40.552","3","15","8","0","100","0","0"
"8","127","Chevrolet Corvette C8.R GTE","100","GTE Class","538138","538138","Derek Carboni2","9","14","0","Running","-1 L","0","","1:44.278","1:40.556","14","15","4","0","100","0","0"
"9","127","Chevrolet Corvette C8.R GTE","100","GTE Class","412407","412407","Jeff Karau","7","3","0","Running","-1 L","0","","1:44.886","1:40.538","5","15","6","0","100","0","0"
"10","102","Porsche 911 RSR","100","GTE Class","369469","369469","Deryk Morrish","11","34","0","Running","-1 L","0","","1:45.564","1:41.712","10","15","1","0","100","0","0"
"11","93","Ferrari 488 GTE","100","GTE Class","451962","451962","Elijah Trepper","10","13","0","Running","-1 L","0","","1:46.513","1:43.060","14","15","5","0","100","0","0"
"12","127","Chevrolet Corvette C8.R GTE","100","GTE Class","340689","340689","Matthew James2","12","7","0","Running","-1 L","0","","1:47.130","1:42.340","7","15","12","0","100","0","0"
"13","128","Dallara P217","2523","Dallara P217","386413","386413","John Stuplich","13","76","32","Disconnected","-16 L","0","","00.000","","","0","0","0","100","0","0"
