"Start Time","Track","Series","Hosted Session Name"
"2021.03.07 7:30 PM GMT","Charlotte Motor Speedway - Roval","Hosted iRacing","Praxis Motorsport League"



"League Name","League ID","League Season","League Season ID","Points System"
"Praxis Motorsport League","3699","Walk Before You Run LMP2/GTE League","61191","None"

"Fin Pos","Car ID","Car","Car Class ID","Car Class","Team ID","Cust ID","Name","Start Pos","Car #","Out ID","Out","Interval","Laps Led","Qualify Time","Average Lap Time","Fastest Lap Time","Fast Lap#","Laps Comp","Inc","League Points","Max Fuel Fill%","Weight Penalty (KG)","League Agg Points"
"1","128","Dallara P217","2523","Dallara P217","404787","404787","Michael Holler","1","12","0","Running","-00.000","14","","1:11.993","1:09.144","4","21","2","","100","0",""
"2","128","Dallara P217","2523","Dallara P217","84864","84864","Jordan Ward","2","27","0","Running","-01.976","7","","1:12.087","1:09.230","8","21","2","","100","0",""
"3","127","Chevrolet Corvette C8.R GTE","100","GTE Class","538138","538138","Derek Carboni2","7","6","0","Running","-00.000","0","","1:17.517","1:15.013","11","20","2","","100","0",""
"4","127","Chevrolet Corvette C8.R GTE","100","GTE Class","590035","590035","Joncarlo Schooler","4","7","0","Running","-00.000","0","","1:18.769","1:15.309","5","20","6","","100","0",""
"5","127","Chevrolet Corvette C8.R GTE","100","GTE Class","480677","480677","Jason Williamson2","5","54","0","Running","-00.000","0","","1:17.928","1:15.537","7","20","0","","100","0",""
"6","127","Chevrolet Corvette C8.R GTE","100","GTE Class","496912","496912","Gabriel Larsson-Rowe","3","5","0","Running","-00.000","0","","1:17.004","1:14.663","10","20","7","","100","0",""
"7","102","Porsche 911 RSR","100","GTE Class","438221","438221","Bryan Elliott","6","911","0","Running","-00.000","0","","1:20.706","1:15.345","7","19","4","","100","0",""
