"Start Time","Track","Series","Hosted Session Name"
"2021.02.21 7:30 PM GMT","Twin Ring Motegi - Grand Prix","Hosted iRacing","Praxis Motorsport League"



"League Name","League ID","League Season","League Season ID","Points System"
"Praxis Motorsport League","3699","Walk Before You Run LMP2/GTE League","61191","None"

"Fin Pos","Car ID","Car","Car Class ID","Car Class","Team ID","Cust ID","Name","Start Pos","Car #","Out ID","Out","Interval","Laps Led","Qualify Time","Average Lap Time","Fastest Lap Time","Fast Lap#","Laps Comp","Inc","League Points","Max Fuel Fill%","Weight Penalty (KG)","League Agg Points"
"1","128","Dallara P217","2523","Dallara P217","404787","404787","Michael Holler","2","12","0","Running","-00.000","9","","1:40.766","1:37.951","5","15","2","","100","0",""
"2","128","Dallara P217","2523","Dallara P217","362203","362203","Tero Merentie","3","5","0","Running","-21.467","0","","1:42.197","1:38.719","8","15","4","","100","0",""
"3","128","Dallara P217","2523","Dallara P217","480677","480677","Jason Williamson2","4","54","0","Running","-48.429","0","","1:43.994","1:40.672","14","15","8","","100","0",""
"4","128","Dallara P217","2523","Dallara P217","84864","84864","Jordan Ward","1","27","0","Running","-1:30.778","6","","1:43.853","1:38.151","5","15","2","","100","0",""
"5","102","Porsche 911 RSR","100","GTE Class","438221","438221","Bryan Elliott","5","911","0","Running","-00.000","0","","1:49.125","1:45.892","2","14","0","","100","0",""
"6","92","Ford GTE","100","GTE Class","384575","384575","John Dinkel","7","33","0","Running","-00.000","0","","1:50.587","1:46.158","2","14","7","","100","0",""
"7","127","Chevrolet Corvette C8.R GTE","100","GTE Class","538138","538138","Derek Carboni2","9","9","0","Running","-00.000","0","","1:53.316","1:46.469","10","14","5","","100","0",""
"8","127","Chevrolet Corvette C8.R GTE","100","GTE Class","412407","412407","Jeff Karau","8","3","0","Running","-00.000","0","","1:49.736","1:46.280","2","14","5","","100","0",""
"9","102","Porsche 911 RSR","100","GTE Class","369469","369469","Deryk Morrish","6","34","0","Running","-00.000","0","","1:49.007","1:46.869","2","14","2","","100","0",""
