"Start Time","Track","Series","Hosted Session Name"
"2020.10.11 6:30 PM GMT","WeatherTech Raceway at Laguna Seca - Full Course","Hosted iRacing","Praxis Motorsport League"



"League Name","League ID","League Season","League Season ID","Points System"
"Praxis Motorsport League","3699","League 4: Audi TCR Championship","58799","None"

"Fin Pos","Car ID","Car","Car Class ID","Car Class","Team ID","Cust ID","Name","Start Pos","Car #","Out ID","Out","Interval","Laps Led","Qualify Time","Average Lap Time","Fastest Lap Time","Fast Lap#","Laps Comp","Inc","League Points","Max Fuel Fill%","Weight Penalty (KG)"
"1","112","Audi RS 3 LMS","0","Hosted All Cars Class","386413","386413","John Stuplich","5","76","0","Running","-00.000","8","","1:34.891","1:32.254","3","16","1","0","100","0"
"2","112","Audi RS 3 LMS","0","Hosted All Cars Class","404787","404787","Michael Holler","3","12","0","Running","-07.049","7","","1:35.331","1:32.114","5","16","3","0","100","0"
"3","112","Audi RS 3 LMS","0","Hosted All Cars Class","84864","84864","Jordan Ward","4","27","0","Running","-07.994","1","","1:35.390","1:31.852","15","16","5","0","100","0"
"4","112","Audi RS 3 LMS","0","Hosted All Cars Class","384575","384575","John Dinkel","2","33","0","Running","-28.700","0","","1:36.684","1:32.280","14","16","9","0","100","0"
"5","112","Audi RS 3 LMS","0","Hosted All Cars Class","336569","336569","Forrest Bullen","6","87","0","Running","-28.873","0","","1:36.695","1:33.412","5","16","6","0","100","0"
"6","112","Audi RS 3 LMS","0","Hosted All Cars Class","369228","369228","Jeremy Driesler","12","9","0","Running","-31.374","0","","1:36.851","1:33.675","13","16","9","0","100","0"
"7","112","Audi RS 3 LMS","0","Hosted All Cars Class","431058","431058","Isaac Allen2","13","37","0","Running","-33.004","0","","1:36.953","1:33.673","5","16","11","0","100","0"
"8","112","Audi RS 3 LMS","0","Hosted All Cars Class","515067","515067","Andrew Cave","11","92","0","Running","-36.028","0","","1:37.142","1:32.516","12","16","9","0","100","0"
"9","112","Audi RS 3 LMS","0","Hosted All Cars Class","451962","451962","Elijah Trepper","17","13","0","Running","-1:00.745","0","","1:38.686","1:34.941","6","16","2","0","100","0"
"10","112","Audi RS 3 LMS","0","Hosted All Cars Class","255520","255520","Rocco Romeo","15","32","0","Running","-1:12.650","0","","1:39.431","1:35.665","5","16","3","0","100","0"
"11","112","Audi RS 3 LMS","0","Hosted All Cars Class","260780","260780","Christian S. Ost","8","15","0","Running","-1:35.676","0","","1:40.618","1:32.749","4","16","14","0","100","0"
"12","112","Audi RS 3 LMS","0","Hosted All Cars Class","303703","303703","Harry Weir","1","7","0","Running","-1 L","0","","1:37.521","1:33.506","5","15","11","0","100","0"
"13","112","Audi RS 3 LMS","0","Hosted All Cars Class","408411","408411","David Paliwoda","9","404","0","Running","-1 L","0","","1:39.473","1:32.363","12","15","19","0","100","0"
"14","112","Audi RS 3 LMS","0","Hosted All Cars Class","420351","420351","Johan Von Hacht","7","69","0","Running","-1 L","0","","1:43.227","1:32.621","9","15","16","0","100","0"
"15","112","Audi RS 3 LMS","0","Hosted All Cars Class","438221","438221","Bryan Elliott","10","911","0","Running","-2 L","0","","1:45.274","1:34.355","6","14","30","0","100","0"
"16","112","Audi RS 3 LMS","0","Hosted All Cars Class","470964","470964","Brandon Dean2","14","20","0","Running","-2 L","0","","1:40.200","1:36.915","2","14","27","0","100","0"
"17","112","Audi RS 3 LMS","0","Hosted All Cars Class","369469","369469","Deryk Morrish","16","34","0","Running","-9 L","0","","1:46.644","1:35.808","5","7","6","0","100","0"
"18","112","Audi RS 3 LMS","0","Hosted All Cars Class","507418","507418","Ricky Montgomery","18","2","32","Disconnected","-12 L","0","","2:07.619","","","4","16","0","100","0"
"19","112","Audi RS 3 LMS","0","Hosted All Cars Class","411552","411552","Jason Lauborough","19","42","32","Disconnected","-16 L","0","","00.000","","","0","0","0","100","0"
"20","112","Audi RS 3 LMS","0","Hosted All Cars Class","252677","252677","Vincent Sprenger","20","6","32","Disconnected","-16 L","0","","00.000","","","0","0","0","100","0"
