"Start Time","Track","Series","Hosted Session Name"
"2020.11.22 7:30 PM GMT","Sebring International Raceway - International","Hosted iRacing","Praxis Motorsport League"



"League Name","League ID","League Season","League Season ID","Points System"
"Praxis Motorsport League","3699","League 4: Audi TCR Championship","58799","None"

"Fin Pos","Car ID","Car","Car Class ID","Car Class","Team ID","Cust ID","Name","Start Pos","Car #","Out ID","Out","Interval","Laps Led","Qualify Time","Average Lap Time","Fastest Lap Time","Fast Lap#","Laps Comp","Inc","League Points","Max Fuel Fill%","Weight Penalty (KG)"
"1","112","Audi RS 3 LMS","0","Hosted All Cars Class","84864","84864","Jordan Ward","3","27","0","Running","-00.000","1","","2:20.287","2:15.600","4","11","5","","100","0"
"2","112","Audi RS 3 LMS","0","Hosted All Cars Class","260780","260780","Christian S. Ost","1","15","0","Running","-00.104","7","","2:20.297","2:15.892","4","11","0","","100","0"
"3","112","Audi RS 3 LMS","0","Hosted All Cars Class","386413","386413","John Stuplich","2","76","0","Running","-00.628","0","","2:20.344","2:15.630","4","11","11","","100","0"
"4","112","Audi RS 3 LMS","0","Hosted All Cars Class","438221","438221","Bryan Elliott","6","911","0","Running","-00.856","0","","2:20.365","2:15.179","4","11","11","","100","0"
"5","112","Audi RS 3 LMS","0","Hosted All Cars Class","404787","404787","Michael Holler","4","12","0","Running","-03.863","3","","2:20.638","2:15.629","5","11","5","","100","0"
"6","112","Audi RS 3 LMS","0","Hosted All Cars Class","408411","408411","David Paliwoda","8","404","0","Running","-04.779","0","","2:20.721","2:15.861","4","11","2","","100","0"
"7","112","Audi RS 3 LMS","0","Hosted All Cars Class","470964","470964","Brandon Dean2","7","69","0","Running","-24.276","0","","2:22.494","2:17.342","4","11","2","","100","0"
"8","112","Audi RS 3 LMS","0","Hosted All Cars Class","336569","336569","Forrest Bullen","9","87","0","Running","-25.335","0","","2:22.590","2:17.069","9","11","5","","100","0"
"9","112","Audi RS 3 LMS","0","Hosted All Cars Class","369469","369469","Deryk Morrish","5","34","0","Running","-26.256","0","","2:22.674","2:17.126","8","11","2","","100","0"
"10","112","Audi RS 3 LMS","0","Hosted All Cars Class","507418","507418","Ricky Montgomery","10","2","0","Running","-00.000","0","","00.000","","","5","5","","100","0"
