"Start Time","Track","Series","Hosted Session Name"
"2020.08.16 6:30 PM GMT","Twin Ring Motegi - Grand Prix","Hosted iRacing","Praxis Motorsport League"



"League Name","League ID","League Season","League Season ID","Points System"
"Praxis Motorsport League","3699","Summer of Legends: USF 2000 Championship","55868","Grand Prix"

"Fin Pos","Car ID","Car","Car Class ID","Car Class","Team ID","Cust ID","Name","Start Pos","Car #","Out ID","Out","Interval","Laps Led","Qualify Time","Average Lap Time","Fastest Lap Time","Fast Lap#","Laps Comp","Inc","League Points","Max Fuel Fill%","Weight Penalty (KG)"
"1","121","USF 2000","0","Hosted All Cars Class","84864","84864","Jordan Ward","1","27","0","Running","-00.000","14","","1:54.858","1:52.577","4","14","0","25","100","0"
"2","121","USF 2000","0","Hosted All Cars Class","343276","343276","Luca Becker","2","4","0","Running","-00.878","0","","1:54.921","1:52.599","14","14","0","18","100","0"
"3","121","USF 2000","0","Hosted All Cars Class","392656","392656","Jorrit Havermans","6","7","0","Running","-14.685","0","","1:55.907","1:53.272","11","14","0","15","100","0"
"4","121","USF 2000","0","Hosted All Cars Class","384575","384575","John Dinkel","3","33","0","Running","-16.120","0","","1:56.010","1:53.313","10","14","5","12","100","0"
"5","121","USF 2000","0","Hosted All Cars Class","404787","404787","Michael Holler","4","12","0","Running","-21.381","0","","1:56.385","1:53.436","3","14","2","10","100","0"
"6","121","USF 2000","0","Hosted All Cars Class","420351","420351","Johan Von Hacht","7","69","0","Running","-36.690","0","","1:57.479","1:52.595","13","14","8","8","100","0"
"7","121","USF 2000","0","Hosted All Cars Class","397054","397054","Chris Michaels","10","8","0","Running","-56.248","0","","1:58.875","1:54.198","4","14","8","6","100","0"
"8","121","USF 2000","0","Hosted All Cars Class","396920","396920","Isaac Stevens","13","96","0","Running","-1:00.872","0","","1:59.205","1:55.893","3","14","2","4","100","0"
"9","121","USF 2000","0","Hosted All Cars Class","369469","369469","Deryk Morrish","5","34","0","Running","-1:04.631","0","","1:59.475","1:53.186","6","14","8","2","100","0"
"10","121","USF 2000","0","Hosted All Cars Class","438221","438221","Bryan Elliott","11","5","0","Running","-1:05.703","0","","1:59.551","1:53.707","13","14","8","1","100","0"
"11","121","USF 2000","0","Hosted All Cars Class","255520","255520","Rocco Romeo","8","32","0","Running","-2 L","0","","2:03.305","1:56.620","4","12","13","0","100","0"
"12","121","USF 2000","0","Hosted All Cars Class","470964","470964","Brandon Dean2","9","3","32","Disconnected","-11 L","0","","1:58.850","1:56.551","3","3","5","0","100","0"
"13","121","USF 2000","0","Hosted All Cars Class","260780","260780","Christian S. Ost","12","15","32","Disconnected","-14 L","0","","00.000","","","0","4","0","100","0"
"14","121","USF 2000","0","Hosted All Cars Class","412407","412407","Jeff Karau","14","13","32","Disconnected","-14 L","0","","00.000","","","0","0","0","100","0"
