"Start Time","Track","Series","Hosted Session Name"
"2020.07.26 7:30 PM GMT","WeatherTech Raceway at Laguna Seca - Full Course","Hosted iRacing","Praxis Motorsport League"



"League Name","League ID","League Season","League Season ID","Points System"
"Praxis Motorsport League","3699","Summer of Legends: USF 2000 Championship","55868","Grand Prix"

"Fin Pos","Car ID","Car","Car Class ID","Car Class","Team ID","Cust ID","Name","Start Pos","Car #","Out ID","Out","Interval","Laps Led","Qualify Time","Average Lap Time","Fastest Lap Time","Fast Lap#","Laps Comp","Inc","League Points","Max Fuel Fill%","Weight Penalty (KG)"
"1","121","USF 2000","0","Hosted All Cars Class","404787","404787","Michael Holler","2","12","0","Running","-00.000","12","","1:25.567","1:23.229","2","18","1","8","100","0"
"2","121","USF 2000","0","Hosted All Cars Class","84864","84864","Jordan Ward","3","27","0","Running","-08.580","0","","1:26.044","1:24.020","8","18","1","7","100","0"
"3","121","USF 2000","0","Hosted All Cars Class","392656","392656","Jorrit Havermans","5","8","0","Running","-20.466","0","","1:26.704","1:23.974","14","18","5","6","100","0"
"4","121","USF 2000","0","Hosted All Cars Class","260780","260780","Christian S. Ost","6","15","0","Running","-20.560","0","","1:26.709","1:23.465","13","18","5","5","100","0"
"5","121","USF 2000","0","Hosted All Cars Class","384575","384575","John Dinkel","7","33","0","Running","-24.409","0","","1:26.923","1:23.879","13","18","7","4","100","0"
"6","121","USF 2000","0","Hosted All Cars Class","386413","386413","John Stuplich","4","76","0","Running","-28.571","0","","1:27.154","1:23.976","9","18","5","3","100","0"
"7","121","USF 2000","0","Hosted All Cars Class","343276","343276","Luca Becker","1","14","0","Running","-37.775","6","","1:27.095","1:23.247","14","18","12","2","100","0"
"8","121","USF 2000","0","Hosted All Cars Class","397054","397054","Chris Michaels","8","4","0","Running","-49.191","0","","1:28.300","1:24.159","14","18","5","1","100","0"
"9","121","USF 2000","0","Hosted All Cars Class","386130","386130","Jakub Sochacki","10","2","0","Running","-1:13.392","0","","1:26.338","1:24.587","17","18","0","0","100","0"
"10","121","USF 2000","0","Hosted All Cars Class","438221","438221","Bryan Elliott","9","5","0","Running","-1:24.276","0","","1:30.249","1:25.472","15","18","9","0","100","0"
"11","121","USF 2000","0","Hosted All Cars Class","470964","470964","Brandon Dean2","11","3","0","Running","-00.000","0","","1:32.254","1:25.396","17","17","8","0","100","0"
"12","121","USF 2000","0","Hosted All Cars Class","255520","255520","Rocco Romeo","14","32","0","Running","-00.000","0","","1:32.751","1:27.194","14","17","9","0","100","0"
"13","121","USF 2000","0","Hosted All Cars Class","451962","451962","Elijah Trepper","15","10","0","Running","-00.000","0","","1:34.330","1:28.035","13","17","5","0","100","0"
"14","121","USF 2000","0","Hosted All Cars Class","369228","369228","Jeremy Driesler","13","9","0","Running","-00.000","0","","1:32.186","1:26.316","6","16","8","0","100","0"
"15","121","USF 2000","0","Hosted All Cars Class","396920","396920","Isaac Stevens","12","96","0","Running","-00.000","0","","1:29.404","1:25.997","12","15","10","0","100","0"
