Division,WeightClassKg,Place,Name,Team,BodyweightKg,Best3SquatKg,Best3BenchKg,Best3DeadliftKg,TotalKg,Equipment,Event,Sex
Boys,55.79,1,Herquin Chable,Channelview,51.8,111.13,65.77,151.95,328.85,Single-ply,SBD,M
Boys,51.71,2,Jonathon Cardenas,Freeport Brazosport,50.26,99.79,65.77,122.47,288.03,Single-ply,SBD,M
Boys,51.71,3,Paul Bass,Katy Mayde Creek,51.35,115.67,47.63,115.67,278.96,Single-ply,SBD,M
Boys,55.79,4,Brandon Jordan,Dickinson,51.94,92.99,63.5,106.59,263.08,Single-ply,SBD,M
Boys,51.71,DQ,Edward Taylor #2,La Porte,49.71,97.52,63.5,,,Single-ply,SBD,M
Boys,55.79,1,Trey Marrero,Alvin,55.61,158.76,95.25,149.69,403.7,Single-ply,SBD,M
Boys,59.87,2,Dominic Monsivaiz,Dickinson,55.93,136.08,65.77,140.61,342.46,Single-ply,SBD,M
Boys,55.79,3,Eric Flores,Katy Mayde Creek,55.79,113.4,65.77,138.35,317.51,Single-ply,SBD,M
Boys,55.79,4,Carlos Salazar,Manvel,54.79,117.93,65.77,124.74,308.44,Single-ply,SBD,M
Boys,59.87,5,Adrian Martinez #6,Texas City,56.02,106.59,61.23,92.99,260.82,Single-ply,SBD,M
Boys,55.79,6,Matt Britt,Manvel,52.62,79.38,54.43,102.06,235.87,Single-ply,SBD,M
Boys,55.79,DQ,Cecilio Hernandez,Dickinson,55.75,158.76,102.06,,,Single-ply,SBD,M
Boys,59.87,1,Jakob Rios,Clute Brazoswood,59.51,142.88,88.45,154.22,385.55,Single-ply,SBD,M
Boys,59.87,2,Alec Amador,Freeport Brazosport,57.79,142.88,70.31,154.22,367.41,Single-ply,SBD,M
Boys,59.87,3,Brandon Coon,Conroe Caney Creek,59.6,142.88,70.31,149.69,362.87,Single-ply,SBD,M
Boys,67.13,4,Brandon Martinez,Dickinson,59.92,140.61,86.18,136.08,362.87,Single-ply,SBD,M
Boys,59.87,5,Matt Rice,Conroe Oak Ridge,59.15,113.4,90.72,136.08,340.19,Single-ply,SBD,M
Boys,67.13,6,Michael Northern,Conroe Oak Ridge,59.96,113.4,90.72,133.81,337.93,Single-ply,SBD,M
Boys,59.87,7,Zac Caminade,Santa Fe,56.61,95.25,56.7,129.27,281.23,Single-ply,SBD,M
Boys,67.13,8,Michael Marcantel,Santa Fe,60.1,90.72,52.16,108.86,251.74,Single-ply,SBD,M
Boys,59.87,9,Ej Smith,Beaumont Ozen,57.97,70.31,52.16,102.06,224.53,Single-ply,SBD,M
Boys,59.87,DQ,Cameron Guillen,Clute Brazoswood,57.88,133.81,,,,Single-ply,SBD,M
Boys,67.13,1,Tyler Marcel,Conroe Oak Ridge,65.95,197.31,136.08,210.92,544.31,Single-ply,SBD,M
Boys,74.84,2,Alec DeLeon,Dickinson,67.22,222.26,113.4,195.04,530.7,Single-ply,SBD,M
Boys,67.13,3,Michael Latapie,Palacios,64.5,172.37,138.35,188.24,498.95,Single-ply,SBD,M
Boys,67.13,4,Garrett Shantz,Montgomery,64.5,185.97,104.33,197.31,487.61,Single-ply,SBD,M
Boys,67.13,5,Ricardo Barragan,Alvin,66.59,170.1,113.4,172.37,455.86,Single-ply,SBD,M
Boys,67.13,6,Gregory Hunter,Channelview,65.59,165.56,92.99,174.63,433.18,Single-ply,SBD,M
Boys,74.84,7,Marshall Surovik,Texas City,67.36,156.49,97.52,174.63,428.64,Single-ply,SBD,M
Boys,67.13,8,Hernan Rameriz,Alvin,66.5,142.88,111.13,170.1,424.11,Single-ply,SBD,M
Boys,67.13,9,Chris Patton,Katy Mayde Creek,66.68,161.03,79.38,183.7,424.11,Single-ply,SBD,M
Boys,67.13,10,Donovan Lee,Katy Mayde Creek,61.23,147.42,88.45,183.7,419.57,Single-ply,SBD,M
Boys,67.13,11,William Williams,Channelview,61.96,149.69,74.84,151.95,376.48,Single-ply,SBD,M
Boys,67.13,12,Ricky Delacerda,Dickinson,65.23,129.27,83.91,158.76,371.95,Single-ply,SBD,M
Boys,67.13,13,Chance Price,New Caney Porter,66.95,140.61,79.38,142.88,362.87,Single-ply,SBD,M
Boys,67.13,14,Dylan Billiot,La Marque,60.33,124.74,74.84,142.88,342.46,Single-ply,SBD,M
Boys,67.13,15,Jacob Mears,Beaumont Ozen,62.6,108.86,77.11,142.88,328.85,Single-ply,SBD,M
Boys,67.13,16,Chase Dodge,Clute Brazoswood,65.77,124.74,79.38,122.47,326.59,Single-ply,SBD,M
Boys,67.13,17,Keith Chesson,Manvel,62.69,102.06,79.38,102.06,283.5,Single-ply,SBD,M
Boys,67.13,DQ,Eleazar Pena,Hitchcock,67.13,,,,,Single-ply,SBD,M
Boys,67.13,DQ,Tyler Idom,New Caney Porter,62.23,127.01,,,,Single-ply,SBD,M
Boys,74.84,1,Calvin Laskey,Katy Mayde Creek,73.66,199.58,136.08,226.8,562.45,Single-ply,SBD,M
Boys,82.1,2,Trey Vaughans,Dickinson,75.02,195.04,122.47,181.44,498.95,Single-ply,SBD,M
Boys,74.84,3,Mike Salazar,Manvel,71.85,183.7,120.2,185.97,489.88,Single-ply,SBD,M
Boys,74.84,4,Nick Durst,Conroe Oak Ridge,74.66,181.44,102.06,201.85,485.34,Single-ply,SBD,M
Boys,74.84,5,David Broussard,Channelview,69.58,190.51,102.06,183.7,476.27,Single-ply,SBD,M
Boys,74.84,6,Alan Cooper,La Marque,73.84,170.1,106.59,183.7,460.4,Single-ply,SBD,M
Boys,74.84,7,Kameron Harris,Channelview,74.66,170.1,88.45,183.7,442.25,Single-ply,SBD,M
Boys,74.84,8,Joshua McKinney,Santa Fe,73.94,154.22,102.06,183.7,439.98,Single-ply,SBD,M
Boys,74.84,9,Anthony Wright,La Marque,74.21,158.76,83.91,170.1,412.77,Single-ply,SBD,M
Boys,74.84,10,Charles Manuel,Alvin,71.3,158.76,99.79,149.69,408.23,Single-ply,SBD,M
Boys,82.1,11,Alex Semler,New Caney Porter,74.93,158.76,83.91,165.56,408.23,Single-ply,SBD,M
Boys,82.1,12,Dezmon Simpson,Beaumont Ozen,75.07,136.08,88.45,183.7,408.23,Single-ply,SBD,M
Boys,74.84,13,Caleb Hall,Montgomery,69.4,154.22,90.72,161.03,405.97,Single-ply,SBD,M
Boys,74.84,14,Christopher Narcisse,Beaumont Ozen,73.48,124.74,102.06,151.95,378.75,Single-ply,SBD,M
Boys,74.84,15,Tim Clay,New Caney Porter,69.22,136.08,86.18,151.95,374.21,Single-ply,SBD,M
Boys,74.84,16,Jared Hernandez,Texas City,68.49,147.42,68.04,151.95,367.41,Single-ply,SBD,M
Boys,74.84,17,Armando Cuevas,New Caney Porter,73.3,131.54,92.99,142.88,367.41,Single-ply,SBD,M
Boys,74.84,18,Jose Garcia #3,Manvel,72.3,129.27,65.77,147.42,342.46,Single-ply,SBD,M
Boys,74.84,19,Nick Warner,Conroe Caney Creek,68.86,106.59,83.91,142.88,333.39,Single-ply,SBD,M
Boys,74.84,20,Corey Holmes,La Marque,67.59,120.2,61.23,129.27,310.71,Single-ply,SBD,M
Boys,74.84,21,Zack Fisher,Texas City,69.85,111.13,70.31,129.27,310.71,Single-ply,SBD,M
Boys,74.84,DQ,Vincent Chachere,La Porte,68.72,113.4,79.38,,,Single-ply,SBD,M
Boys,74.84,DQ,Seth Newman,La Porte,67.95,142.88,74.84,,,Single-ply,SBD,M
Boys,74.84,DQ,London Harris,Manvel,74.12,102.06,,136.08,,Single-ply,SBD,M
Boys,74.84,DQ,Jordan Perry,Beaumont Ozen,72.67,120.2,,136.08,,Single-ply,SBD,M
Boys,82.1,1,Oziel Rios,Palacios,81.01,197.31,151.95,210.92,560.19,Single-ply,SBD,M
Boys,82.1,2,Thomas Bridges,Dickinson,79.83,206.38,147.42,192.78,546.58,Single-ply,SBD,M
Boys,89.81,3,Terrence Giles,Alvin,82.28,183.7,138.35,210.92,532.97,Single-ply,SBD,M
Boys,82.1,4,Logan Phillips,Conroe Caney Creek,80.47,179.17,138.35,197.31,514.83,Single-ply,SBD,M
Boys,82.1,5,Dodi Vasquez,Dickinson,77.11,176.9,124.74,183.7,485.34,Single-ply,SBD,M
Boys,89.81,6,Eric Hembling,Clute Brazoswood,82.33,174.63,106.59,204.12,485.34,Single-ply,SBD,M
Boys,82.1,7,Alex Holsinger,Conroe Caney Creek,76.66,183.7,115.67,183.7,483.08,Single-ply,SBD,M
Boys,82.1,8,Carson Neal,Montgomery,76.29,185.97,113.4,181.44,480.81,Single-ply,SBD,M
Boys,82.1,9,Eloi Fernandez,Alvin,77.47,170.1,115.67,170.1,455.86,Single-ply,SBD,M
Boys,82.1,10,Peyton Mellor,Montgomery,79.38,151.95,120.2,181.44,453.59,Single-ply,SBD,M
Boys,82.1,11,Malik Campbell,Freeport Brazosport,76.75,163.29,106.59,161.03,430.91,Single-ply,SBD,M
Boys,82.1,12,Drew Lowery,Clute Brazoswood,76.93,158.76,102.06,170.1,430.91,Single-ply,SBD,M
Boys,82.1,13,Jaun Isais,Freeport Brazosport,75.75,147.42,99.79,170.1,417.3,Single-ply,SBD,M
Boys,89.81,14,James Ash,Clute Brazoswood,82.33,151.95,74.84,151.95,378.75,Single-ply,SBD,M
Boys,82.1,15,Matthew Richardson,Hitchcock,81.56,102.06,102.06,149.69,353.8,Single-ply,SBD,M
Boys,82.1,16,Anthony Berry,Beaumont Ozen,79.02,117.93,90.72,136.08,344.73,Single-ply,SBD,M
Boys,82.1,17,Rowdy Brakhage,Santa Fe,75.75,102.06,74.84,133.81,310.71,Single-ply,SBD,M
Boys,82.1,18,Kolbi Foster,Clute Brazoswood,78.65,102.06,63.5,108.86,274.42,Single-ply,SBD,M
Boys,89.81,DQ,John Saenz,Clute Brazoswood,82.19,229.06,,192.78,,Single-ply,SBD,M
Boys,89.81,DQ,Austin McKean,Conroe Caney Creek,82.33,183.7,,181.44,,Single-ply,SBD,M
Boys,82.1,DQ,Cole Turner,Alvin,82.1,,,,,Single-ply,SBD,M
Boys,82.1,DQ,Nathan Lewis,Freeport Brazosport,82.01,,83.91,192.78,,Single-ply,SBD,M
Boys,82.1,DQ,Zech Bowen,La Porte,82.1,,,,,Single-ply,SBD,M
Boys,82.1,DQ,Reese Thompson,La Porte,80.92,158.76,117.93,,,Single-ply,SBD,M
Boys,82.1,DQ,Julien Rolison,La Porte,82.1,,,,,Single-ply,SBD,M
Boys,82.1,DQ,Chase Thompson,Santa Fe,76.2,,,,,Single-ply,SBD,M
Boys,82.1,DQ,Aaron Theut,Santa Fe,79.38,,,,,Single-ply,SBD,M
Boys,89.81,1,George Stephenson,Conroe Oak Ridge,89.81,260.82,149.69,235.87,646.37,Single-ply,SBD,M
Boys,89.81,2,Dustin Hoeffler,New Caney Porter,89.27,217.72,131.54,217.72,566.99,Single-ply,SBD,M
Boys,89.81,3,Carlos García,Alvin,85,208.65,124.74,208.65,542.04,Single-ply,SBD,M
Boys,89.81,4,Tj Combs,Hitchcock,84.64,183.7,117.93,219.99,521.63,Single-ply,SBD,M
Boys,89.81,5,Jalen Hurts,Channelview,85.55,201.85,102.06,217.72,521.63,Single-ply,SBD,M
Boys,89.81,6,Caleb Lamberth,Manvel,85.73,197.31,124.74,197.31,519.36,Single-ply,SBD,M
Boys,89.81,7,Tyler Tullos,Conroe Oak Ridge,85.46,192.78,129.27,176.9,498.95,Single-ply,SBD,M
Boys,89.81,8,Cody Mullins,Montgomery,86.45,183.7,117.93,170.1,471.74,Single-ply,SBD,M
Boys,89.81,9,Aaron Sollock,Clute Brazoswood,84.91,179.17,127.01,163.29,469.47,Single-ply,SBD,M
Boys,89.81,10,Malik Pounds,Conroe Oak Ridge,86.82,165.56,122.47,181.44,469.47,Single-ply,SBD,M
Boys,89.81,11,Logan Holt,Hitchcock,83.64,183.7,90.72,163.29,437.72,Single-ply,SBD,M
Boys,89.81,12,Chesson Gene,Manvel,87.54,185.97,104.33,142.88,433.18,Single-ply,SBD,M
Boys,89.81,13,James Jacobs #2,La Porte,86,158.76,113.4,158.76,430.91,Single-ply,SBD,M
Boys,89.81,14,David Eudoxie,Clute Brazoswood,88.45,161.03,90.72,158.76,410.5,Single-ply,SBD,M
Boys,89.81,15,Jason Forsberg,Dickinson,84.28,136.08,102.06,156.49,394.63,Single-ply,SBD,M
Boys,89.81,16,Brent Smith,Hitchcock,89.18,158.76,77.11,154.22,390.09,Single-ply,SBD,M
Boys,89.81,17,Emmanuel Ramirez,Pasadena Memorial,86.45,124.74,68.04,106.59,299.37,Single-ply,SBD,M
Boys,89.81,DQ,Tanner Hohman,Alvin,89.81,,,,,Single-ply,SBD,M
Boys,89.81,DQ,Stanley Thuy,Alvin,89.81,,,,,Single-ply,SBD,M
Boys,109.77,1,Corey Green,Freeport Brazosport,99.97,208.65,151.95,192.78,553.38,Single-ply,SBD,M
Boys,99.79,2,D Vonte Hinton,Texas City,95.89,204.12,124.74,204.12,532.97,Single-ply,SBD,M
Boys,99.79,3,Damon Burkett,Manvel,94.08,201.85,115.67,188.24,505.76,Single-ply,SBD,M
Boys,109.77,4,Johnathon Delrey,Conroe Oak Ridge,99.97,192.78,117.93,192.78,503.49,Single-ply,SBD,M
Boys,99.79,5,Louis Hickman,New Caney Porter,93.35,199.58,127.01,167.83,494.42,Single-ply,SBD,M
Boys,99.79,6,Mark Contreras,Freeport Brazosport,98.7,174.63,113.4,195.04,483.08,Single-ply,SBD,M
Boys,99.79,7,Jaron Dykstra,La Porte,91.26,163.29,106.59,156.49,426.38,Single-ply,SBD,M
Boys,99.79,8,Deandre Washington,Beaumont Ozen,92.9,142.88,113.4,158.76,415.04,Single-ply,SBD,M
Boys,99.79,9,Robert Hurta,Freeport Brazosport,94.17,174.63,72.57,158.76,405.97,Single-ply,SBD,M
Boys,99.79,10,Jesse Castillo,Santa Fe,94.8,147.42,90.72,149.69,387.82,Single-ply,SBD,M
Boys,99.79,11,Hunter Theim,Hitchcock,92.62,136.08,86.18,147.42,369.68,Single-ply,SBD,M
Boys,99.79,DQ,Jayson Kline,La Porte,97.16,215.46,,219.99,,Single-ply,SBD,M
Boys,99.79,DQ,Josh DeLeon,La Porte,99.79,,,,,Single-ply,SBD,M
Boys,99.79,DQ,Steven Gonzalves,Clute Brazoswood,96.62,233.6,,,,Single-ply,SBD,M
Boys,124.74,1,Kaylond North,Dickinson,109.95,272.16,142.88,238.14,653.17,Single-ply,SBD,M
Boys,124.74,2,Anietie Etuk,Dickinson,109.86,222.26,129.27,244.94,596.47,Single-ply,SBD,M
Boys,109.77,3,David Nunez,Freeport Brazosport,109.59,235.87,158.76,195.04,589.67,Single-ply,SBD,M
Boys,109.77,4,Nestor Mendez,Freeport Brazosport,106.14,213.19,142.88,226.8,582.87,Single-ply,SBD,M
Boys,109.77,5,Travis Ritchie,Conroe Oak Ridge,106.32,226.8,115.67,213.19,555.65,Single-ply,SBD,M
Boys,109.77,6,Carlos Alvarez,Hitchcock,104.78,215.46,142.88,183.7,542.04,Single-ply,SBD,M
Boys,109.77,7,Larenzo Beaza,Texas City,101.15,183.7,124.74,204.12,512.56,Single-ply,SBD,M
Boys,124.74,8,Jared Reedy,Dickinson,109.95,215.46,111.13,183.7,510.29,Single-ply,SBD,M
Boys,109.77,9,Jorge Oviedo,Pasadena Memorial,100.97,181.44,102.06,215.46,498.95,Single-ply,SBD,M
Boys,109.77,10,Josh Miller,Montgomery,108.14,195.04,111.13,192.78,498.95,Single-ply,SBD,M
Boys,109.77,11,Christian Rodriquez,Pasadena Memorial,102.33,204.12,108.86,183.7,496.68,Single-ply,SBD,M
Boys,109.77,12,Arthur Rosemond,La Marque,103.96,195.04,102.06,192.78,489.88,Single-ply,SBD,M
Boys,109.77,13,Jason Weeden,Pasadena Memorial,104.51,204.12,90.72,192.78,487.61,Single-ply,SBD,M
Boys,109.77,14,C. Corey,Clute Brazoswood,106.14,183.7,106.59,197.31,487.61,Single-ply,SBD,M
Boys,109.77,15,Lance Zeno,Beaumont Ozen,109.68,163.29,115.67,192.78,471.74,Single-ply,SBD,M
Boys,109.77,16,Dejohn Handy,Beaumont Ozen,106.87,181.44,113.4,170.1,464.93,Single-ply,SBD,M
Boys,109.77,17,Brandon Clay,Dickinson,105.23,174.63,136.08,149.69,460.4,Single-ply,SBD,M
Boys,109.77,18,Livan Lopez,Dickinson,104.33,174.63,102.06,176.9,453.59,Single-ply,SBD,M
Boys,109.77,19,Remington Felder,Katy Mayde Creek,102.42,165.56,86.18,165.56,417.3,Single-ply,SBD,M
Boys,109.77,20,Gavan Cooper,Channelview,104.33,147.42,83.91,151.95,383.29,Single-ply,SBD,M
Boys,109.77,21,Sam Spicer,Clute Brazoswood,101.6,124.74,97.52,158.76,381.02,Single-ply,SBD,M
Boys,109.77,22,Troy Beckham,Clute Brazoswood,107.32,133.81,113.4,131.54,378.75,Single-ply,SBD,M
Boys,109.77,23,Arthur Harmon,Beaumont Ozen,106.05,124.74,79.38,145.15,349.27,Single-ply,SBD,M
Boys,109.77,24,Eligha Piere,Beaumont Ozen,107.77,92.99,90.72,158.76,342.46,Single-ply,SBD,M
Boys,109.77,25,Dustin Powell,Santa Fe,108.05,129.27,74.84,136.08,340.19,Single-ply,SBD,M
Boys,109.77,26,Santos Lazos,Clute Brazoswood,109.32,124.74,65.77,115.67,306.17,Single-ply,SBD,M
Boys,109.77,DQ,Deangelo Hernandez,Manvel,109.77,,,,,Single-ply,SBD,M
Boys,124.74,1,Jacoby Callahan,New Caney Porter,116.75,251.74,136.08,238.14,625.96,Single-ply,SBD,M
Boys,124.74,2,Ernesto Reales,Dickinson,122.56,258.55,133.81,204.12,596.47,Single-ply,SBD,M
Boys,124.74,3,Chris Gomez,Freeport Brazosport,115.76,226.8,161.03,199.58,587.4,Single-ply,SBD,M
Boys,124.74,4,Jonathon Alfred,Manvel,121.65,219.99,140.61,219.99,580.6,Single-ply,SBD,M
Boys,124.74,5,Koda Martin,Manvel,121.93,204.12,136.08,229.06,569.26,Single-ply,SBD,M
Boys,124.74,6,Andrew Velasco,Katy Mayde Creek,119.29,226.8,138.35,188.24,553.38,Single-ply,SBD,M
Boys,124.74,7,Marquez Baker,La Marque,112.04,208.65,104.33,226.8,539.77,Single-ply,SBD,M
Boys,124.74,8,Malik Essilfie,Katy Mayde Creek,117.21,215.46,124.74,195.04,535.24,Single-ply,SBD,M
Boys,124.74,9,Markel Bright,La Porte,119.93,197.31,129.27,192.78,519.36,Single-ply,SBD,M
Boys,124.74,10,Christian Jackson,Conroe Oak Ridge,111.49,183.7,138.35,181.44,503.49,Single-ply,SBD,M
Boys,124.74,11,Scott Christ,Manvel,123.74,197.31,106.59,199.58,503.49,Single-ply,SBD,M
Boys,124.74,12,Sean Shahzad,Katy Mayde Creek,119.11,190.51,122.47,185.97,498.95,Single-ply,SBD,M
Boys,124.74,13,Donte Hayes,Texas City,112.04,183.7,102.06,199.58,485.34,Single-ply,SBD,M
Boys,124.74,14,Ramsey Ramirez,Texas City,112.31,165.56,108.86,183.7,458.13,Single-ply,SBD,M
Boys,124.74,15,CJ Bench,Clute Brazoswood,114.67,138.35,92.99,145.15,376.48,Single-ply,SBD,M
Boys,124.74,16,Tim Thomas,Pasadena Memorial,121.11,142.88,83.91,145.15,371.95,Single-ply,SBD,M
Boys,124.74,17,Victor Esquivel,Clute Brazoswood,114.58,129.27,102.06,138.35,369.68,Single-ply,SBD,M
Boys,124.74,18,D Selmon,Beaumont Ozen,110.59,90.72,70.31,149.69,310.71,Single-ply,SBD,M
Boys,124.74,19,Diante Granger,Beaumont Ozen,112.72,104.33,63.5,140.61,308.44,Single-ply,SBD,M
Boys,124.74,20,Tyrese Henderson,Beaumont Ozen,115.85,102.06,63.5,140.61,306.17,Single-ply,SBD,M
Boys,124.74,DQ,Terrence Broussard,Beaumont Ozen,120.38,104.33,,90.72,,Single-ply,SBD,M
Boys,124.74,DQ,Brent Holmes,Conroe Caney Creek,112.4,,,,,Single-ply,SBD,M
Boys,124.74,DQ,Denaus Ferguson,La Porte,118.75,219.99,,,,Single-ply,SBD,M
Boys,124.74,DQ,Victor Saldierna,Hitchcock,124.74,,,,,Single-ply,SBD,M
Boys,124.74,DQ,Chris Mock,Texas City,116.3,142.88,,183.7,,Single-ply,SBD,M
Boys,124.74,DQ,Jimmy LaFata,Clute Brazoswood,112.31,226.8,127.01,206.38,,Single-ply,SBD,M
Boys,124.74+,1,Alonzo Crittendon,Dickinson,136.08,317.51,142.88,260.82,721.21,Single-ply,SBD,M
Boys,124.74+,2,Chance Harmanson,Dickinson,136.17,281.23,149.69,233.6,664.51,Single-ply,SBD,M
Boys,124.74+,3,Darin Slater,Dickinson,150.23,258.55,140.61,226.8,625.96,Single-ply,SBD,M
Boys,124.74+,4,Ryan Sagmiller,Conroe Oak Ridge,138.44,238.14,151.95,192.78,582.87,Single-ply,SBD,M
Boys,124.74+,5,Anthony Hunter,Manvel,147.87,238.14,113.4,197.31,548.85,Single-ply,SBD,M
Boys,124.74+,6,Darian Tryals,Texas City,142.43,210.92,124.74,204.12,539.77,Single-ply,SBD,M
Boys,124.74+,7,Edward Cook,Montgomery,132.72,188.24,138.35,197.31,523.9,Single-ply,SBD,M
Boys,124.74+,8,Chance Cummings,Dickinson,137.08,195.04,115.67,208.65,519.36,Single-ply,SBD,M
Boys,124.74+,9,Alex Pina,Clute Brazoswood,125.66,206.38,124.74,183.7,514.83,Single-ply,SBD,M
Boys,124.74+,10,Luis Atilano,La Porte,125.46,142.88,115.67,192.78,451.32,Single-ply,SBD,M
Boys,124.74+,11,Colton Lowe,Conroe Caney Creek,140.98,165.56,95.25,163.29,424.11,Single-ply,SBD,M
Boys,124.74+,12,Qiunton Smith,Beaumont Ozen,150.05,149.69,97.52,170.1,417.3,Single-ply,SBD,M
Boys,124.74+,DQ,Chris Lewis,Beaumont Ozen,136.08,,,,,Single-ply,SBD,M
Boys,124.74+,DQ,Kalique Ferguson,Beaumont Ozen,136.08,,,,,Single-ply,SBD,M
Boys,124.74+,DQ,LaLa Simpson,Beaumont Ozen,136.08,,,,,Single-ply,SBD,M
