Division,WeightClassKg,Place,Name,Team,BodyweightKg,Best3SquatKg,Best3BenchKg,Best3DeadliftKg,TotalKg,Equipment,Event,Sex
Boys,51.71,1,Jaime Luna,Palmer,51.17,140.61,61.23,129.27,331.12,Single-ply,SBD,M
Boys,55.79,2,Trey Russell,Eustace,51.8,104.33,63.5,129.27,297.1,Single-ply,SBD,M
Boys,51.71,3,Nathan Upshaw,Rusk,47.17,108.86,54.43,99.79,263.08,Single-ply,SBD,M
Boys,51.71,DQ,Allan Boyd,Malakoff,44.13,65.77,,,,Single-ply,SBD,M
Boys,55.79,1,Max Snodgrass,Blooming Grove,55.7,113.4,72.57,145.15,331.12,Single-ply,SBD,M
Boys,55.79,2,Luis Camacho,Athens,53.16,106.59,61.23,129.27,297.1,Single-ply,SBD,M
Boys,55.79,3,Caleb Terrell,Frankston,53.89,92.99,65.77,129.27,288.03,Single-ply,SBD,M
Boys,59.87,1,Aj Durham,Kemp,58.24,174.63,106.59,167.83,449.06,Single-ply,SBD,M
Boys,59.87,2,Jj Masters,Sunnyvale,57.52,151.95,86.18,163.29,401.43,Single-ply,SBD,M
Boys,67.13,3,Colton Monroe,Blooming Grove,59.96,133.81,77.11,167.83,378.75,Single-ply,SBD,M
Boys,59.87,4,Salvador Perez,Palmer,56.79,138.35,68.04,154.22,360.61,Single-ply,SBD,M
Boys,59.87,5,Nathan Stibbens,Scurry-Rosser,56.97,154.22,74.84,131.54,360.61,Single-ply,SBD,M
Boys,59.87,6,Jesus Barcenas,Eustace,59.69,131.54,77.11,145.15,353.8,Single-ply,SBD,M
Boys,59.87,7,Jeremy Turner,Rusk,57.29,142.88,63.5,122.47,328.85,Single-ply,SBD,M
Boys,59.87,8,Mike Owens,Milford,57.15,122.47,65.77,133.81,322.05,Single-ply,SBD,M
Boys,59.87,DQ,Jacob McCloud,Malakoff,57.33,97.52,,,,Single-ply,SBD,M
Boys,67.13,1,Chaston Bennett,Rusk,64.41,174.63,83.91,163.29,421.84,Single-ply,SBD,M
Boys,67.13,2,Jordan Walker,Athens,63.32,149.69,86.18,154.22,390.09,Single-ply,SBD,M
Boys,67.13,3,Hector Zamarripa,Palmer,66.95,142.88,95.25,149.69,387.82,Single-ply,SBD,M
Boys,67.13,4,Karson Street,Malakoff,64.32,136.08,81.65,131.54,349.27,Single-ply,SBD,M
Boys,67.13,5,Daniel Salazar,Athens,64.5,115.67,79.38,145.15,340.19,Single-ply,SBD,M
Boys,67.13,6,Dalton Wassinger,Blooming Grove,66.13,136.08,72.57,131.54,340.19,Single-ply,SBD,M
Boys,67.13,7,Ben Nicholson,Blooming Grove,60.33,131.54,72.57,127.01,331.12,Single-ply,SBD,M
Boys,67.13,8,Davis Wammack,Malakoff,64.86,122.47,70.31,136.08,328.85,Single-ply,SBD,M
Boys,67.13,9,Michael Murray #4,Rusk,63.96,131.54,56.7,136.08,324.32,Single-ply,SBD,M
Boys,67.13,10,Chad Sherrell,Malakoff Cross Roads,65.32,106.59,54.43,120.2,281.23,Single-ply,SBD,M
Boys,67.13,11,Wayne Wernicke,Kemp,65.41,86.18,63.5,129.27,278.96,Single-ply,SBD,M
Boys,67.13,12,Shawn Himes,Malakoff Cross Roads,64.59,90.72,56.7,113.4,260.82,Single-ply,SBD,M
Boys,74.84,1,Justin Lawler,Kemp,72.94,195.04,124.74,215.46,535.24,Single-ply,SBD,M
Boys,74.84,2,Caleb Williams #2,Frankston,72.3,158.76,99.79,208.65,467.2,Single-ply,SBD,M
Boys,74.84,3,Tyler Garrison,Scurry-Rosser,73.48,167.83,95.25,197.31,460.4,Single-ply,SBD,M
Boys,74.84,4,Brandon Garza,Sunnyvale,72.57,151.95,108.86,197.31,458.13,Single-ply,SBD,M
Boys,74.84,5,Chase Emerson,Rusk,74.57,192.78,104.33,158.76,455.86,Single-ply,SBD,M
Boys,74.84,6,Preston Amason,Eustace,68.67,158.76,99.79,158.76,417.3,Single-ply,SBD,M
Boys,82.1,7,Zach Starkey,Kerens,75.02,165.56,83.91,161.03,410.5,Single-ply,SBD,M
Boys,74.84,8,Jose Salazar,Malakoff,71.67,151.95,83.91,172.37,408.23,Single-ply,SBD,M
Boys,74.84,9,Jalcolby Cox,Scurry-Rosser,69.85,142.88,88.45,170.1,401.43,Single-ply,SBD,M
Boys,74.84,10,Cesar Garcia,Malakoff,69.13,149.69,77.11,142.88,369.68,Single-ply,SBD,M
Boys,74.84,11,Jason Burgett,Palmer,69.22,140.61,74.84,154.22,369.68,Single-ply,SBD,M
Boys,74.84,12,Brandon Peyrefitte,Malakoff Cross Roads,70.03,124.74,92.99,136.08,353.8,Single-ply,SBD,M
Boys,82.1,13,Jordan Harris #5,Malakoff,75.02,108.86,81.65,136.08,326.59,Single-ply,SBD,M
Boys,74.84,14,Kolton Edwards,Malakoff,71.49,122.47,70.31,129.27,322.05,Single-ply,SBD,M
Boys,74.84,15,Dakota Grimes,Rusk,68.95,113.4,70.31,136.08,319.78,Single-ply,SBD,M
Boys,74.84,DQ,Will Moss,Sunnyvale,74.21,142.88,95.25,,,Single-ply,SBD,M
Boys,74.84,DQ,Rylee Littrell,Scurry-Rosser,73.21,174.63,,,,Single-ply,SBD,M
Boys,74.84,DQ,Cody Davies,Malakoff,74.39,,,,,Single-ply,SBD,M
Boys,74.84,DQ,Gabe Cruces,Malakoff,70.31,,,,,Single-ply,SBD,M
Boys,74.84,DQ,Juan Ochoa,Eustace,69.76,115.67,,,,Single-ply,SBD,M
Boys,82.1,1,Dj Woods,Kerens,81.19,215.46,124.74,231.33,571.53,Single-ply,SBD,M
Boys,82.1,2,Johnny Kilgore,Kemp,77.38,219.99,138.35,210.92,569.26,Single-ply,SBD,M
Boys,82.1,3,Ray Rosales,Rusk,76.66,197.31,106.59,204.12,508.02,Single-ply,SBD,M
Boys,82.1,4,Matthew Bullock,Malakoff,78.93,190.51,99.79,172.37,462.66,Single-ply,SBD,M
Boys,82.1,5,Jawuan Martin,Athens,81.65,158.76,108.86,181.44,449.06,Single-ply,SBD,M
Boys,82.1,6,Jose Chavez,Frankston,76.84,167.83,81.65,190.51,439.98,Single-ply,SBD,M
Boys,82.1,7,Thomas Tilford,Scurry-Rosser,76.84,181.44,104.33,149.69,435.45,Single-ply,SBD,M
Boys,82.1,8,Garrett Trussell,Malakoff Cross Roads,81.47,154.22,99.79,167.83,421.84,Single-ply,SBD,M
Boys,82.1,9,John Day,Scurry-Rosser,78.93,149.69,83.91,140.61,374.21,Single-ply,SBD,M
Boys,82.1,10,Ben Dillon,Kemp,80.83,127.01,92.99,149.69,369.68,Single-ply,SBD,M
Boys,89.81,11,Garrett Yates,Scurry-Rosser,82.28,117.93,79.38,131.54,328.85,Single-ply,SBD,M
Boys,82.1,12,Cory Jones,Frankston,77.84,154.22,95.25,,249.48,Single-ply,SB,M
Boys,82.1,DQ,Austin Goulette,Rusk,77.29,195.04,,,,Single-ply,SB,M
Boys,89.81,1,Alan Harden,Palmer,87.27,204.12,151.95,235.87,591.94,Single-ply,SBD,M
Boys,89.81,2,Josh Wooten,Kerens,87.18,190.51,104.33,219.99,514.83,Single-ply,SBD,M
Boys,89.81,3,Jacob Rose,Milford,87.54,170.1,115.67,188.24,474,Single-ply,SBD,M
Boys,89.81,4,Dustin Higgs,Malakoff,83.14,167.83,117.93,181.44,467.2,Single-ply,SBD,M
Boys,89.81,5,Sam Carroll,Winona,85.46,147.42,106.59,181.44,435.45,Single-ply,SBD,M
Boys,89.81,6,Brock McFarland,Blooming Grove,83.01,167.83,79.38,183.7,430.91,Single-ply,SBD,M
Boys,89.81,7,Jessie Davis,Frankston,85.46,158.76,99.79,170.1,428.64,Single-ply,SBD,M
Boys,89.81,8,Michael Kline,Kerens,86.18,167.83,92.99,167.83,428.64,Single-ply,SBD,M
Boys,89.81,9,Zach Prater,Sunnyvale,83.46,154.22,83.91,165.56,403.7,Single-ply,SBD,M
Boys,89.81,10,Eduardo Limon,Athens,88.63,140.61,81.65,176.9,399.16,Single-ply,SBD,M
Boys,89.81,11,Dancy McCool,Malakoff Cross Roads,88,124.74,90.72,154.22,369.68,Single-ply,SBD,M
Boys,89.81,12,Jordan Bishop,Rusk,82.37,136.08,74.84,124.74,335.66,Single-ply,SBD,M
Boys,89.81,13,Josh Ruiz,Rusk,83.28,117.93,72.57,136.08,326.59,Single-ply,SBD,M
Boys,89.81,14,Montrell Williams,Malakoff,88,117.93,65.77,129.27,312.98,Single-ply,SBD,M
Boys,89.81,DQ,Rustin Feaster,Blooming Grove,87.18,,,,,Single-ply,SBD,M
Boys,99.79,1,Corey Brookins,Malakoff,98.61,244.94,117.93,217.72,580.6,Single-ply,SBD,M
Boys,99.79,2,Caleb Brunham,Winona,96.89,238.14,136.08,204.12,578.33,Single-ply,SBD,M
Boys,99.79,3,Jon Jennings,Kemp,90.81,204.12,120.2,185.97,510.29,Single-ply,SBD,M
Boys,99.79,4,Johnathon Perez,Scurry-Rosser,96.25,201.85,104.33,197.31,503.49,Single-ply,SBD,M
Boys,99.79,5,Dustin Kemp,Palmer,94.71,185.97,102.06,176.9,464.93,Single-ply,SBD,M
Boys,99.79,6,Brian Gutierrez,Athens,99.25,172.37,92.99,149.69,415.04,Single-ply,SBD,M
Boys,99.79,7,Lionel Garcia,Eustace,93.8,170.1,77.11,158.76,405.97,Single-ply,SBD,M
Boys,99.79,8,Brian DeLaCruz,Malakoff,91.35,145.15,81.65,170.1,396.89,Single-ply,SBD,M
Boys,99.79,9,Jj Kummer,Frankston,90.26,149.69,70.31,161.03,381.02,Single-ply,SBD,M
Boys,99.79,10,Diego Medina,Malakoff,93.26,145.15,90.72,142.88,378.75,Single-ply,SBD,M
Boys,99.79,11,Hunter Norwood,Malakoff Cross Roads,92.26,117.93,88.45,165.56,371.95,Single-ply,SBD,M
Boys,99.79,12,Brett Workman,Frankston,96.89,138.35,61.23,133.81,333.39,Single-ply,SBD,M
Boys,99.79,13,Israel Chavez,Malakoff,98.02,124.74,74.84,122.47,322.05,Single-ply,SBD,M
Boys,99.79,DQ,Adam Pessink,Frankston,96.25,,,,,Single-ply,SBD,M
Boys,99.79,DQ,David Allen,Scurry-Rosser,94.53,161.03,,,,Single-ply,SBD,M
Boys,109.77,1,James Forrest,Kemp,109.32,233.6,158.76,195.04,587.4,Single-ply,SBD,M
Boys,109.77,2,Casey Webb #1,Malakoff,106.82,208.65,97.52,201.85,508.02,Single-ply,SBD,M
Boys,109.77,3,Rafael Robles,Sunnyvale,104.14,204.12,104.33,170.1,478.54,Single-ply,SBD,M
Boys,109.77,4,Ricky Dixon,Eustace,100.06,158.76,97.52,181.44,437.72,Single-ply,SBD,M
Boys,109.77,5,Shawn Hatzenbuehler,Malakoff Cross Roads,109.77,154.22,90.72,181.44,426.38,Single-ply,SBD,M
Boys,109.77,6,Mustafa Rabaha,Sunnyvale,109.32,151.95,97.52,167.83,417.3,Single-ply,SBD,M
Boys,109.77,7,Zach Swearingen,Rusk,109.68,158.76,90.72,138.35,387.82,Single-ply,SBD,M
Boys,109.77,DQ,Dustin Raxter,Blooming Grove,104.6,154.22,,,,Single-ply,SBD,M
Boys,124.74,1,Nick Richardson #3,Athens,120.38,213.19,140.61,254.01,607.81,Single-ply,SBD,M
Boys,124.74,2,Cody Parker,Kemp,113.4,226.8,167.83,204.12,598.74,Single-ply,SBD,M
Boys,124.74,3,Raul Torres,Palmer,115.39,204.12,120.2,208.65,532.97,Single-ply,SBD,M
Boys,124.74,4,Chris Hobbs,Kerens,115.21,208.65,115.67,190.51,514.83,Single-ply,SBD,M
Boys,124.74,DQ,Tj Talashek,Sunnyvale,123.65,,,,,Single-ply,SBD,M
Boys,124.74+,1,Andrew Keheley,Malakoff,141.52,281.23,181.44,235.87,698.53,Single-ply,SBD,M
Boys,124.74+,2,Zack Green,Malakoff,127.6,197.31,108.86,204.12,510.29,Single-ply,SBD,M
Boys,124.74+,3,Ethan Still,Kerens,174.18,199.58,99.79,170.1,469.47,Single-ply,SBD,M
Boys,124.74+,4,Thomas Acol,Malakoff,129.73,145.15,70.31,165.56,381.02,Single-ply,SBD,M
Boys,124.74+,DQ,Tyler Heard,Scurry-Rosser,126.92,,,,,Single-ply,SBD,M
