Division,WeightClassKg,Place,Name,Team,BodyweightKg,Best3SquatKg,Best3BenchKg,Best3DeadliftKg,TotalKg,Equipment,Event,Sex
Boys,51.71,1,Tyler Salazar,Donna,51.26,163.29,102.06,163.29,428.64,Single-ply,SBD,M
Boys,51.71,2,Allen Guillen,Brownsville Lopez,51.71,156.49,68.04,161.03,385.55,Single-ply,SBD,M
Boys,51.71,3,Justin Hernandez,Weslaco East,49.99,142.88,72.57,151.95,367.41,Single-ply,SBD,M
Boys,51.71,4,Devon Vela,Edinburg Vela,51.71,120.2,86.18,147.42,353.8,Single-ply,SBD,M
Boys,51.71,5,Cody Acosta,PSJA,47.72,108.86,65.77,124.74,299.37,Single-ply,SBD,M
Boys,51.71,6,Tyrone Irizarry,Brownsville Lopez,51.71,113.4,56.7,124.74,294.84,Single-ply,SBD,M
Boys,51.71,7,Jon Ortega,Mercedes,43.91,102.06,70.31,102.06,274.42,Single-ply,SBD,M
Boys,51.71,8,Tristan Villarreal,Donna North,47.17,81.65,52.16,102.06,235.87,Single-ply,SBD,M
Boys,51.71,DQ,Sam Medillin,Edinburg Vela,51.53,,,,,Single-ply,SBD,M
Boys,55.79,1,Angel Medillin,Edinburg Vela,55.7,161.03,111.13,165.56,437.72,Single-ply,SBD,M
Boys,55.79,2,Marco Pina,Donna North,55.7,161.03,99.79,167.83,428.64,Single-ply,SBD,M
Boys,55.79,3,Michael Puente,PSJA Southwest,52.34,124.74,70.31,136.08,331.12,Single-ply,SBD,M
Boys,55.79,4,Marc Sedillo,San Benito,53.25,108.86,68.04,147.42,324.32,Single-ply,SBD,M
Boys,55.79,5,Diego Gonzalez,Mercedes,53.98,102.06,81.65,136.08,319.78,Single-ply,SBD,M
Boys,55.79,6,Victor Vidal,Pharr Valley View,55.52,102.06,47.63,104.33,254.01,Single-ply,SBD,M
Boys,55.79,DQ,Fernando Martinez #2,Weslaco,55.79,,,,,Single-ply,SBD,M
Boys,59.87,1,Jose Alvarado #2,Brownsville Lopez,59.87,247.21,124.74,210.92,582.87,Single-ply,SBD,M
Boys,59.87,2,Nick De Leon,Brownsville Lopez,59.69,183.7,104.33,188.24,476.27,Single-ply,SBD,M
Boys,59.87,3,Marcus Ysaguirre,Donna,59.42,172.37,102.06,154.22,428.64,Single-ply,SBD,M
Boys,59.87,4,Christian Garcia,San Benito,59.6,161.03,92.99,167.83,421.84,Single-ply,SBD,M
Boys,59.87,5,Jose Serna,Weslaco East,58.33,176.9,88.45,145.15,410.5,Single-ply,SBD,M
Boys,59.87,6,Ozzy Garza,PSJA Southwest,59.69,140.61,86.18,165.56,392.36,Single-ply,SBD,M
Boys,59.87,7,Jerry Chavez,Donna North,58.69,145.15,83.91,161.03,390.09,Single-ply,SBD,M
Boys,59.87,8,Mark Ortega,Mercedes,56.97,131.54,92.99,149.69,374.21,Single-ply,SBD,M
Boys,59.87,9,Julian Villanueva,Donna North,58.06,138.35,70.31,138.35,347,Single-ply,SBD,M
Boys,59.87,10,Albert Cervantes,Brownsville Lopez,59.87,142.88,56.7,147.42,347,Single-ply,SBD,M
Boys,59.87,11,Kevin Romo,Edinburg,58.24,108.86,92.99,124.74,326.59,Single-ply,SBD,M
Boys,59.87,12,Nathan Lazo,Weslaco,59.87,104.33,72.57,113.4,290.3,Single-ply,SBD,M
Boys,59.87,DQ,Michael Garcia,Edinburg Vela,58.51,113.4,,,,Single-ply,SBD,M
Boys,59.87,DQ,Miguel Tovar,Donna North,59.69,165.56,88.45,,,Single-ply,SBD,M
Boys,67.13,1,Robert Alaniz,Weslaco East,66.5,190.51,117.93,210.92,519.36,Single-ply,SBD,M
Boys,67.13,2,Angel Sandoval,Donna North,65.59,167.83,104.33,183.7,455.86,Single-ply,SBD,M
Boys,67.13,3,Christian Gamez,Brownsville Lopez,65.77,192.78,102.06,161.03,455.86,Single-ply,SBD,M
Boys,67.13,4,Ruben Garza,Donna North,66.95,142.88,111.13,174.63,428.64,Single-ply,SBD,M
Boys,67.13,5,Hugo Gomez,Edinburg North,65.5,151.95,106.59,151.95,410.5,Single-ply,SBD,M
Boys,67.13,6,Marcos Chavez,Donna,66.22,156.49,86.18,158.76,401.43,Single-ply,SBD,M
Boys,67.13,7,Carlos Sanchez,San Benito,67.13,149.69,92.99,151.95,394.63,Single-ply,SBD,M
Boys,67.13,8,Carlos Coronado,Edinburg North,65.86,131.54,99.79,154.22,385.55,Single-ply,SBD,M
Boys,67.13,9,Guadalupe Garcia #4,Edinburg North,61.51,138.35,97.52,147.42,383.29,Single-ply,SBD,M
Boys,67.13,10,Justin Berner,Edinburg North,62.78,142.88,90.72,149.69,383.29,Single-ply,SBD,M
Boys,67.13,11,Angel Hernandez #10,Edinburg,61.14,131.54,97.52,138.35,367.41,Single-ply,SBD,M
Boys,67.13,12,Edwin Garcia,Pharr Valley View,65.86,124.74,72.57,133.81,331.12,Single-ply,SBD,M
Boys,67.13,13,Javier Renteria,Edinburg North,62.23,102.06,74.84,136.08,312.98,Single-ply,SBD,M
Boys,67.13,14,Jose Alvarez,Edinburg,61.33,108.86,65.77,111.13,285.76,Single-ply,SBD,M
Boys,67.13,DQ,Joe Colunga,Mercedes,63.32,165.56,,,,Single-ply,SBD,M
Boys,67.13,DQ,Jose Soto,Edinburg Economedes,63.41,165.56,,,,Single-ply,SBD,M
Boys,67.13,DQ,Tony Sauceda,Edinburg Economedes,64.86,,,,,Single-ply,SBD,M
Boys,67.13,DQ,Juan Gonzales,PSJA Southwest,64.68,142.88,99.79,,,Single-ply,SBD,M
Boys,74.84,1,Jorge Almanza,Edinburg Economedes,74.39,217.72,138.35,224.53,580.6,Single-ply,SBD,M
Boys,74.84,2,Leo Diaz,Brownsville Lopez,73.39,233.6,124.74,210.92,569.26,Single-ply,SBD,M
Boys,74.84,3,Jorge Cavazos,Mercedes,71.85,215.46,129.27,195.04,539.77,Single-ply,SBD,M
Boys,74.84,4,Richard Reza,San Benito,73.94,195.04,122.47,219.99,537.51,Single-ply,SBD,M
Boys,74.84,5,Alex Franco,Edinburg Vela,68.67,204.12,124.74,179.17,508.02,Single-ply,SBD,M
Boys,74.84,6,Danny Salinas,Weslaco East,71.21,204.12,117.93,183.7,505.76,Single-ply,SBD,M
Boys,74.84,7,Seb De Leon,Mercedes,68.86,172.37,129.27,183.7,485.34,Single-ply,SBD,M
Boys,74.84,8,Arath Martinez,Donna North,73.94,172.37,102.06,181.44,455.86,Single-ply,SBD,M
Boys,74.84,9,Mathew Trevino,Edinburg Vela,72.03,165.56,111.13,174.63,451.32,Single-ply,SBD,M
Boys,74.84,10,Eduardo Mujica,Edinburg,73.66,161.03,106.59,170.1,437.72,Single-ply,SBD,M
Boys,74.84,11,Leo Cuellar,Pharr Valley View,69.22,158.76,102.06,170.1,430.91,Single-ply,SBD,M
Boys,74.84,12,Daniel Mireles,PSJA Memorial,68.13,170.1,92.99,158.76,421.84,Single-ply,SBD,M
Boys,74.84,13,Armando Ayala,Pharr Valley View,70.13,142.88,81.65,136.08,360.61,Single-ply,SBD,M
Boys,74.84,DQ,Luis Cuellar,Pharr Valley View,73.39,,,,,Single-ply,SBD,M
Boys,74.84,DQ,Jason Navaro,San Benito,74.48,192.78,111.13,,,Single-ply,SBD,M
Boys,82.1,1,David Enriquez,Edinburg Vela,82.1,204.12,142.88,215.46,562.45,Single-ply,SBD,M
Boys,82.1,2,Angel Lopez #2,Donna North,81.65,224.53,124.74,181.44,530.7,Single-ply,SBD,M
Boys,82.1,3,Fernando Garza,Weslaco East,81.83,208.65,117.93,204.12,530.7,Single-ply,SBD,M
Boys,82.1,4,Adrian Vargas,Edinburg,81.47,183.7,142.88,172.37,498.95,Single-ply,SBD,M
Boys,82.1,5,Matt Aguirre,San Benito,79.11,192.78,99.79,199.58,492.15,Single-ply,SBD,M
Boys,82.1,6,Juan Rojas,Donna,82.1,183.7,106.59,195.04,485.34,Single-ply,SBD,M
Boys,82.1,7,Christian Cortina,Donna North,79.29,165.56,102.06,188.24,455.86,Single-ply,SBD,M
Boys,82.1,8,Gabriel Salinas,Donna,81.42,185.97,92.99,174.63,453.59,Single-ply,SBD,M
Boys,82.1,9,Mauro Arrieta,Edinburg,81.56,156.49,106.59,183.7,446.79,Single-ply,SBD,M
Boys,82.1,10,JC Pedraza,Weslaco,77.75,172.37,97.52,172.37,442.25,Single-ply,SBD,M
Boys,82.1,11,Edison Flores,Mercedes,78.38,170.1,102.06,170.1,442.25,Single-ply,SBD,M
Boys,82.1,12,Rafael Pena,PSJA Southwest,75.66,165.56,97.52,154.22,417.3,Single-ply,SBD,M
Boys,82.1,13,Tyler Hernandez,PSJA,76.75,149.69,90.72,161.03,401.43,Single-ply,SBD,M
Boys,82.1,14,Anibal Gomez,Edinburg Economedes,79.83,142.88,97.52,158.76,399.16,Single-ply,SBD,M
Boys,82.1,15,Roberto Serna,Donna North,79.38,102.06,52.16,124.74,278.96,Single-ply,SBD,M
Boys,82.1,DQ,Allen Valdez,Edinburg,79.47,138.35,,,,Single-ply,SBD,M
Boys,89.81,1,Roy Pedraza,Weslaco East,83.01,238.14,158.76,276.69,673.58,Single-ply,SBD,M
Boys,89.81,2,Jesse Luna,Brownsville Lopez,89.63,242.67,136.08,256.28,635.03,Single-ply,SBD,M
Boys,89.81,3,Joel Garcia,Pharr Valley View,89.77,219.99,97.52,213.19,530.7,Single-ply,SBD,M
Boys,89.81,4,Carlo Vargas,Donna North,85,190.51,111.13,215.46,517.1,Single-ply,SBD,M
Boys,89.81,5,Matthew Vela,Weslaco East,88.45,188.24,115.67,210.92,514.83,Single-ply,SBD,M
Boys,89.81,6,Hector Palencia,Donna,89.13,217.72,108.86,176.9,503.49,Single-ply,SBD,M
Boys,89.81,7,Isaac Rangel,Donna,89.36,195.04,99.79,190.51,485.34,Single-ply,SBD,M
Boys,89.81,8,Diego Moreno,Edinburg Vela,89.81,170.1,104.33,199.58,474,Single-ply,SBD,M
Boys,89.81,9,Ryan Perales,Donna,89.36,183.7,124.74,158.76,467.2,Single-ply,SBD,M
Boys,89.81,10,Ruben Quintenilla,PSJA Southwest,89.81,172.37,97.52,192.78,462.66,Single-ply,SBD,M
Boys,89.81,11,Jose Vera,PSJA,88.09,181.44,102.06,165.56,449.06,Single-ply,SBD,M
Boys,89.81,12,Brandon Vega,Edinburg North,89.09,131.54,111.13,167.83,410.5,Single-ply,SBD,M
Boys,89.81,13,Joe Ramirez,Donna,89.36,136.08,102.06,165.56,403.7,Single-ply,SBD,M
Boys,89.81,14,David Martinez #10,Edinburg,86.36,127.01,88.45,165.56,381.02,Single-ply,SBD,M
Boys,89.81,15,Alfonso Cerda,Donna North,89.81,102.06,92.99,167.83,362.87,Single-ply,SBD,M
Boys,89.81,16,Leo Pena,Weslaco,86.27,136.08,70.31,120.2,326.59,Single-ply,SBD,M
Boys,89.81,DQ,Humberto Martinez,Edinburg North,89.63,,,,,Single-ply,SBD,M
Boys,89.81,DQ,Ernesto Preciado,Pharr Valley View,89.81,222.26,136.08,,,Single-ply,SBD,M
Boys,89.81,DQ,Juan Sanchez #6,Edinburg North,84.19,,,,,Single-ply,SBD,M
Boys,99.79,1,Daniel Ramos,Brownsville Lopez,97.79,278.96,167.83,233.6,680.39,Single-ply,SBD,M
Boys,99.79,2,Omar Salazar,Brownsville Lopez,90.81,247.21,133.81,231.33,612.35,Single-ply,SBD,M
Boys,99.79,3,Osvaldo Gomez,Edinburg Economedes,97.25,219.99,147.42,229.06,596.47,Single-ply,SBD,M
Boys,99.79,4,Eddie Hinojosa,Edinburg Vela,95.07,213.19,133.81,229.06,576.06,Single-ply,SBD,M
Boys,99.79,5,Joey Castillo,PSJA Southwest,95.44,215.46,142.88,208.65,566.99,Single-ply,SBD,M
Boys,99.79,6,Israel Cerda,Donna North,99.79,215.46,129.27,204.12,548.85,Single-ply,SBD,M
Boys,99.79,7,Juan Flores,PSJA,95.62,215.46,131.54,183.7,530.7,Single-ply,SBD,M
Boys,99.79,8,Roger Juarez,PSJA,98.79,192.78,142.88,195.04,530.7,Single-ply,SBD,M
Boys,99.79,9,Gustavo Escalante,Donna North,92.08,195.04,104.33,195.04,494.42,Single-ply,SBD,M
Boys,99.79,10,Brian Garcia,Edinburg North,98.52,170.1,127.01,195.04,492.15,Single-ply,SBD,M
Boys,99.79,11,Cain Rodriguez,PSJA,90.26,176.9,117.93,183.7,478.54,Single-ply,SBD,M
Boys,99.79,12,Alex Zuniga,Edinburg Economedes,90.9,197.31,102.06,151.95,451.32,Single-ply,SBD,M
Boys,99.79,13,Josafat Florez,Edinburg North,98.79,142.88,106.59,183.7,433.18,Single-ply,SBD,M
Boys,99.79,14,Felix Hernandez,Edinburg Vela,94.08,174.63,99.79,151.95,426.38,Single-ply,SBD,M
Boys,99.79,15,Augustin Villegas,Edinburg Economedes,94.17,124.74,92.99,179.17,396.89,Single-ply,SBD,M
Boys,99.79,16,Moises Vazaldua,PSJA,93.62,145.15,83.91,149.69,378.75,Single-ply,SBD,M
Boys,99.79,DQ,Aaron Garza,Edinburg,99.25,,,,,Single-ply,SBD,M
Boys,99.79,DQ,Eric Curiel,San Benito,97.79,,,,,Single-ply,SBD,M
Boys,99.79,DQ,Josh Hernandez,Donna,99.79,,,,,Single-ply,SBD,M
Boys,99.79,DQ,Ernie Tijerina,Edinburg Economedes,96.43,183.7,,,,Single-ply,SBD,M
Boys,109.77,1,Juan Martinez,Donna North,109.77,317.51,167.83,283.5,768.84,Single-ply,SBD,M
Boys,109.77,2,Jacob Banda,Weslaco East,108.68,263.08,151.95,256.28,671.32,Single-ply,SBD,M
Boys,109.77,3,Gus Silva,Donna,107.5,278.96,158.76,231.33,669.05,Single-ply,SBD,M
Boys,109.77,4,Marcos Garza,Edinburg Economedes,107.59,254.01,151.95,224.53,630.49,Single-ply,SBD,M
Boys,109.77,5,Mario Trevino,Weslaco East,106.23,226.8,163.29,238.14,628.23,Single-ply,SBD,M
Boys,109.77,6,Alexis Garces,PSJA Southwest,101.6,226.8,151.95,199.58,578.33,Single-ply,SBD,M
Boys,109.77,7,Caleb Zerato,PSJA Memorial,101.42,235.87,104.33,226.8,566.99,Single-ply,SBD,M
Boys,109.77,8,Miguel Perales,Donna North,103.42,217.72,140.61,204.12,562.45,Single-ply,SBD,M
Boys,109.77,9,Alex Trevino,PSJA Memorial,107.41,183.7,122.47,226.8,532.97,Single-ply,SBD,M
Boys,109.77,10,JJ Barrientes,PSJA,100.79,183.7,113.4,190.51,487.61,Single-ply,SBD,M
Boys,109.77,11,Joel Lopez,San Benito,102.24,192.78,113.4,170.1,476.27,Single-ply,SBD,M
Boys,109.77,12,Jose Tovar,PSJA Memorial,103.78,183.7,124.74,165.56,474,Single-ply,SBD,M
Boys,109.77,13,Rogelio Rada,Donna,105.23,183.7,92.99,183.7,460.4,Single-ply,SBD,M
Boys,109.77,14,Jesus Segura,Weslaco,104.87,158.76,92.99,158.76,410.5,Single-ply,SBD,M
Boys,109.77,15,Jose Jimenez #4,Donna North,104.33,163.29,72.57,151.95,387.82,Single-ply,SBD,M
Boys,109.77,DQ,Angel Gutierrez,Pharr Valley View,106.68,188.24,,,,Single-ply,SBD,M
Boys,124.74,1,Fabian Castillo,Edinburg Economedes,121.93,281.23,183.7,260.82,725.75,Single-ply,SBD,M
Boys,124.74,2,Danny Melendez,Mercedes,116.48,272.16,151.95,210.92,635.03,Single-ply,SBD,M
Boys,124.74,3,Chris Vargas,San Benito,120.2,229.06,136.08,217.72,582.87,Single-ply,SBD,M
Boys,124.74,4,Diego Trevino,PSJA Southwest,120.66,204.12,136.08,224.53,564.72,Single-ply,SBD,M
Boys,124.74,5,Jaime Hurtado,PSJA,119.39,210.92,147.42,195.04,553.38,Single-ply,SBD,M
Boys,124.74,6,Fernando Mata,Donna,122.02,204.12,124.74,183.7,512.56,Single-ply,SBD,M
Boys,124.74,7,Oscar Lopez,PSJA Southwest,113.31,204.12,124.74,179.17,508.02,Single-ply,SBD,M
Boys,124.74,8,Leroy Carrizalez,PSJA Memorial,113.58,197.31,104.33,181.44,483.08,Single-ply,SBD,M
Boys,124.74,9,Louis Rodriguez,Edinburg,111.22,197.31,108.86,174.63,480.81,Single-ply,SBD,M
Boys,124.74,10,Manny Lozano,Pharr Valley View,118.57,165.56,113.4,188.24,467.2,Single-ply,SBD,M
Boys,124.74,11,Gabriel Cano,Edinburg,119.29,142.88,111.13,167.83,421.84,Single-ply,SBD,M
Boys,124.74+,1,Eli Olivo,Donna North,138.8,326.59,219.99,265.35,811.93,Single-ply,SBD,M
Boys,124.74+,2,Daniel Roque,Weslaco East,155.76,272.16,136.08,244.94,653.17,Single-ply,SBD,M
Boys,124.74+,3,Hector Garcia,San Benito,148.51,254.01,142.88,233.6,630.49,Single-ply,SBD,M
Boys,124.74+,4,Isaac Maynez,PSJA Southwest,128.09,215.46,147.42,188.24,551.11,Single-ply,SBD,M
Boys,124.74+,5,Isaac Olvera,Donna North,148.32,224.53,124.74,199.58,548.85,Single-ply,SBD,M
Boys,124.74+,6,Aaron Aguilar,Edinburg Vela,128.82,201.85,131.54,204.12,537.51,Single-ply,SBD,M
Boys,124.74+,7,Hector De Jesus,San Benito,126.1,201.85,120.2,213.19,535.24,Single-ply,SBD,M
Boys,124.74+,8,Orlando Cabrera,Weslaco East,126.55,215.46,127.01,188.24,530.7,Single-ply,SBD,M
Boys,124.74+,9,David Chapa,PSJA,131.45,204.12,113.4,188.24,505.76,Single-ply,SBD,M
Boys,124.74+,10,Jordan Muller,PSJA Memorial,151.41,190.51,106.59,204.12,501.22,Single-ply,SBD,M
Boys,124.74+,11,Sam Perez,Weslaco,126.28,195.04,120.2,174.63,489.88,Single-ply,SBD,M
Boys,124.74+,12,Valentine Lopez,PSJA Memorial,148.78,170.1,104.33,167.83,442.25,Single-ply,SBD,M
Boys,124.74+,13,Jose Vaquera,PSJA Memorial,142.61,179.17,95.25,163.29,437.72,Single-ply,SBD,M
