WeightClassKg,Name,State,Country,BodyweightKg,Best3SquatKg,Squat4Kg,Best3BenchKg,Best3DeadliftKg,Deadlift4Kg,TotalKg,Place,Event,Division,Sex,Equipment,AgeRange
44,Pat Reeves,WM,England,42.5,55,,40,95,,190,1,SBD,Open,F,Single-ply,
48,Marie Durk,WM,England,44.8,85,93,45,100,105,230,1,SBD,Open,F,Single-ply,18.5-19.5
60,Violet Wilson,WM,England,60,157.5,,82.5,170,,410,1,SBD,Open,F,Single-ply,
67.5,Sue Hall,WM,England,66.8,125,,50,150,,325,1,SBD,Open,F,Single-ply,
82.5,Sara Hill,WM,England,77,145,,60,165,,370,1,SBD,Open,F,Single-ply,
90+,Pauline Reeves,WM,England,115.3,105,,65,127.5,,297.5,1,SBD,Open,F,Single-ply,
