Place,Name,Division,Equipment,Event,BirthDate,BirthYear,Sex,BodyweightKg,WeightClassKg,Squat1Kg,Squat2Kg,Squat3Kg,Best3SquatKg,Bench1Kg,Bench2Kg,Bench3Kg,Best3BenchKg,Deadlift1Kg,Deadlift2Kg,Deadlift3Kg,Best3DeadliftKg,TotalKg
1,Audrey Ancelin,Seniors,Raw,SBD,,1995,F,57,57,115,-122.5,122.5,122.5,60,62.5,65,65,142.5,-150,150,150,337.5
1,Amélie Mierger,Seniors,Raw,SBD,,1992,F,134.9,84+,215,220,,220,137.5,142.5,150,150,210,222.5,230,230,600
1,Marie Marguerite Michaud,Masters 1,Raw,SBD,,1980,F,57,57,85,90,95,95,45,50,52.5,52.5,110,120,125,125,272.5
1,Julien Idier,Seniors,Raw,SBD,,1982,M,92.4,93,220,235,245,245,165,172.5,175,175,240,260,,260,680
DQ,Benjamin Pinto Izambard,Juniors,Raw,B,,1998,M,72.7,74,,,,,-110,-110,-110,,,,,,
1,Philippe Szezepanski,Masters 2,Raw,B,,1964,M,101.1,105,,,,,152.5,162.5,170,170,,,,,170
1,Philippe Valladas,Masters 3,Raw,B,,1959,M,74,74,,,,,110,120,130,130,,,,,130
1,Jean Noel Dubus,Masters 4,Raw,B,,1949,M,103.2,105,,,,,127.5,132.5,140,140,,,,,140
