Place,Name,Division,BodyweightKg,Squat1Kg,Squat2Kg,Squat3Kg,Best3SquatKg,Squat4Kg,Bench1Kg,Bench2Kg,Bench3Kg,Best3BenchKg,Bench4Kg,Deadlift1Kg,Deadlift2Kg,Deadlift3Kg,Best3DeadliftKg,Deadlift4Kg,TotalKg,WeightClassKg,Sex,CyrillicName,BirthYear,Tested,Equipment,Event
1,Ekaterina Lesnikova,Teen 16-17,50.8,60,70,-75,70,,35,40,-42.5,40,,60,70,-75,70,,180,52,F,Екатерина Лесникова,1998,Yes,Wraps,SBD
1,Darya Evdokimova,Open,53.8,60,67.5,-70,67.5,,40,45,-47.5,45,,-110,117.5,125,125,,237.5,56,F,Дарья Евдокимова,1988,Yes,Wraps,SBD
1,Yana Vorotovova,Open,57.8,65,-72.5,72.5,72.5,,-47.5,47.5,-50,47.5,,-85,85,100,100,,220,60,F,Яна Воротовова,1990,Yes,Wraps,SBD
1,Mariya Donskova,Teen 16-17,62.5,80,85,90,90,95,35,37.5,-40,37.5,,95,107.5,-110,107.5,,235,67.5,F,Мария Донскова,1998,Yes,Wraps,SBD
1,Tatyana Obraztsova,Open,65.7,95,105,110,110,,62.5,67.5,70,70,,100,120,130,130,,310,67.5,F,Татьяна Образцова,1978,Yes,Wraps,SBD
DQ,Nataliya Schekina,Open,65.9,-92.5,-92.5,100,100,,-47.5,-50,-50,,,,,,,,,67.5,F,Наталия Щекина,1983,Yes,Wraps,SBD
1,Natalya Agapova,Open,72.5,90,-100,105,105,,50,55,60,60,,120,125,130,130,,295,75,F,Наталья Агапова,1978,Yes,Wraps,SBD
2,Oksana Maksimova,Open,69.5,85,90,95,95,,40,45,-47.5,45,,105,112.5,115,115,,255,75,F,Оксана Максимова,1987,Yes,Wraps,SBD
1,Mikhail Vorozhtsov,Open,67.5,170,-180,-185,170,,130,135,-140,135,,180,190,-200,190,,495,67.5,M,Михаил Ворожцов,1979,Yes,Wraps,SBD
1,Kirill Zhirnov,Teen 16-17,75,110,-115,120,120,,70,75,-80,75,,-120,120,130,130,,325,75,M,Кирилл Жирнов,1997,Yes,Wraps,SBD
DQ,Aleksey Gaybura,Teen 16-17,73.2,-155,-160,-162.5,,,,,,,,,,,,,,75,M,Алексей Гайбура,1997,Yes,Wraps,SBD
1,Mikhail Ronzhin,Teen 18-19,73.2,-155,-160,160,160,,-100,-100,105,105,,-160,160,-172.5,160,,425,75,M,Михаил Ронжин,1996,Yes,Wraps,SBD
1,Andrey Arsenichev,Juniors 20-23,72.2,-180,-200,200,200,,-105,112.5,-115,112.5,,170,190,-200,190,,502.5,75,M,Андрей Арсеничев,1991,Yes,Wraps,SBD
1,Aleksey Markin,Open,74.7,190,205,-215,205,,125,135,-140,135,,180,195,-207.5,195,,535,75,M,Алексей Маркин,1986,Yes,Wraps,SBD
1,Aleksandr Astakhov,Open,81.9,190,210,220,220,,105,115,-120,115,,180,190,,190,,525,82.5,M,Александр Астахов,1985,Yes,Wraps,SBD
2,Kirill Marakshin,Open,78.5,140,150,-155,150,,102.5,-105,105,105,,180,190,-200,190,,445,82.5,M,Кирилл Маракшин,1988,Yes,Wraps,SBD
DQ,Vasiliy Uzdyaev,Teen 16-17,84.5,-150,-160,-160,,,,,,,,,,,,,,90,M,Василий Уздяев,1998,Yes,Wraps,SBD
1,Denis Mikhalev,Open,89.3,-180,180,190,190,,127.5,135,-142.5,135,,230,240,-250,240,,565,90,M,Денис Михалев,1990,Yes,Wraps,SBD
1,Arsen Akopyan,Masters 40-44,82.9,160,-175,-175,160,,107.5,115,-117.5,115,,175,185,-190,185,,460,90,M,Арсен Акопян,1970,Yes,Wraps,SBD
1,Aleksandr Bukharin,Teen 13-15,95.7,180,200,-205,200,,150,-155,-155,150,,190,200,-205,200,,550,100,M,Александр Бухарин,1999,Yes,Wraps,SBD
DQ,Viktor Umrik,Juniors 20-23,91.1,-150,-155,-162.5,,,,,,,,,,,,,,100,M,Виктор Умрик,1993,Yes,Wraps,SBD
1,Aleksey Gruzin,Open,97.7,220,-240,-240,220,,140,150,-155,150,,215,225,232.5,232.5,,602.5,100,M,Алексей Грузин,1983,Yes,Wraps,SBD
2,Nikolay Mingalov,Open,97.7,180,190,205,205,,135,142.5,150,150,,220,235,245,245,,600,100,M,Николай Мингалов,1981,Yes,Wraps,SBD
3,Roman Kroshkin,Open,95.1,180,205,212.5,212.5,,130,145,152.5,152.5,,200,220,230,230,,595,100,M,Роман Крошкин,1981,Yes,Wraps,SBD
4,Sergey Fedorov #8,Open,95,180,190,200,200,,130,140,-145,140,,210,225,230,230,,570,100,M,Сергей Федоров,1980,Yes,Wraps,SBD
DQ,Aleksandr Gezhenko,Masters 60-64,99.8,-120,-120,-120,,,,,,,,,,,,,,100,M,Александр Геженко,1953,Yes,Wraps,SBD
1,Aleksandr Belyaev,Teen 16-17,103,180,200,-220,200,,-120,130,-135,130,,-200,205,215,215,,545,110,M,Александр Беляев,1998,Yes,Wraps,SBD
DQ,Artem Kutsenko,Teen 18-19,102.1,-180,-180,-180,,,,,,,,,,,,,,110,M,Артем Куценко,1995,Yes,Wraps,SBD
1,Yuriy Sergeev,Juniors 20-23,104.1,180,190,205,205,,-130,137.5,142.5,142.5,,205,215,,215,,562.5,110,M,Юрий Сергеев,1993,Yes,Wraps,SBD
1,Aleksandr Chirikov,Open,102.7,150,160,-165,160,,-105,105,,105,,-140,140,160,160,,425,110,M,Александр Чириков,1983,Yes,Wraps,SBD
DQ,Artem Prysyazhnyy,Open,107.5,-225,-225,-225,,,,,,,,,,,,,,110,M,Артем Присяжний,1981,Yes,Wraps,SBD
1,Aleksey Oshurkov,Open,117.4,-260,-260,260,260,,150,155,-160,155,,265,280,290,290,,705,125,M,Алексей Ошурков,1977,Yes,Wraps,SBD
1,Svyatoslav Kotik,Masters 40-44,113.5,205,215,225,225,,155,160,-165,160,,200,215,-225,215,,600,125,M,Святослав Котик,1972,Yes,Wraps,SBD
1,Oksana Lomova,Open,74.9,135,140,145,145,,75,80,-90,80,,150,160,165,165,,390,75,F,Оксана Ломова,1983,No,Wraps,SBD
1,Daniil Bobryshev,Teen 16-17,63.6,-95,-110,120,120,,-65,75,-80,75,,-120,135,-140,135,,330,67.5,M,Даниил Бобрышев,1997,No,Wraps,SBD
1,Aleksandr Rek,Open,65.6,190,202.5,207.5,207.5,215,105,110,-112.5,110,,175,187.5,-195,187.5,,505,67.5,M,Александр Рек,1987,No,Wraps,SBD
1,Anton Altukhov,Juniors 20-23,82.5,-230,-230,230,230,,170,180,-187.5,180,,240,250,257.5,257.5,,667.5,82.5,M,Антон Алтухов,1991,No,Wraps,SBD
2,Kirill Kotov,Juniors 20-23,81.9,220,-235,-240,220,,-130,140,150,150,,240,255,-267.5,255,,625,82.5,M,Кирилл Котов,1994,No,Wraps,SBD
DQ,Vasiliy Bank,Juniors 20-23,80.9,-210,-210,-210,,,-140,,,,,-225,,,,,,82.5,M,Василий Банк,1992,No,Wraps,SBD
1,Aleksey Nikulin #1,Open,81,320,335,-345,335,,160,167.5,170,170,,-305,305,-317.5,305,,810,82.5,M,Алексей Никулин,1982,No,Wraps,SBD
2,Maksim Luzin,Open,80.2,215,-222.5,-227.5,215,,147.5,-155,-155,147.5,,245,255,262.5,262.5,,625,82.5,M,Максим Лузин,1987,No,Wraps,SBD
3,Aleksandr Skorobogatov,Open,81.9,230,240,245,245,,135,140,145,145,,235,-240,-240,235,,625,82.5,M,Александр Скоробогатов,1981,No,Wraps,SBD
4,Aram Grigoryan,Open,76.9,200,-230,-230,200,,130,-135,-140,130,,-250,-260,260,260,,590,82.5,M,Арам Григорян,1989,No,Wraps,SBD
5,Dmitriy Zimnyakov,Open,80.6,200,215,225,225,,125,132.5,137.5,137.5,,190,205,212.5,212.5,,575,82.5,M,Дмитрий Зимняков,1989,No,Wraps,SBD
DQ,Aleksandr Kulish,Open,81.1,-200,-200,-210,,,,,,,,,,,,,,82.5,M,Александр Кулиш,1990,No,Wraps,SBD
1,Sergey Rukavichnikov,Juniors 20-23,87,-195,-195,200,200,,142.5,147.5,-152.5,147.5,,195,-205,-205,195,,542.5,90,M,Сергей Рукавичников,1994,No,Wraps,SBD
1,Anton Anikanov,Open,88.9,250,265,275,275,,190,195,-200,195,,270,-285,-285,270,,740,90,M,Антон Аниканов,1985,No,Wraps,SBD
2,Aleksandr Zinovyev,Open,88.8,-240,250,-265,250,,160,170,-180,170,,240,252.5,-260,252.5,,672.5,90,M,Александр Зиновьев,1985,No,Wraps,SBD
3,Andrey Bubin,Open,88.3,240,-250,255,255,,150,155,-160,155,,240,-252.5,252.5,252.5,,662.5,90,M,Андрей Бубин,1981,No,Wraps,SBD
4,Artem Glazkov,Open,86,220,240,255,255,,145,155,165,165,,-220,230,-250,230,,650,90,M,Артем Глазков,1990,No,Wraps,SBD
5,Maksim Amanatov,Open,84.4,-190,190,210,210,,110,120,-130,120,,250,270,-277.5,270,,600,90,M,Максим Аманатов,1990,No,Wraps,SBD
6,Tochiddin Abdurokhmonov,Open,86,130,140,-155,140,,110,115,-120,115,,160,170,-180,170,,425,90,M,,1982,No,Wraps,SBD
1,Oleg Kuznetsov,Masters 40-44,85.3,220,235,245,245,,160,-170,-180,160,,220,240,-250,240,,645,90,M,Олег Кузнецов,1974,No,Wraps,SBD
1,Mikhail Kalmykov,Teen 16-17,98.6,-200,-205,205,205,,135,-142.5,145,145,,190,200,205,205,,555,100,M,Михаил Калмыков,1998,No,Wraps,SBD
1,Yaroslav Lomtev,Juniors 20-23,98.2,-265,265,-275,265,,160,167.5,172.5,172.5,,260,270,-280,270,,707.5,100,M,Ярослав Ломтев,1992,No,Wraps,SBD
1,Vladimir Bardin,Open,98.2,300,-322.5,335,335,,185,-200,-200,185,,255,267.5,277.5,277.5,,797.5,100,M,Владимир Бардин,1985,No,Wraps,SBD
2,Aleksey Sizov,Open,95.7,265,280,-295,280,,190,200,-207.5,200,,270,290,-297.5,290,,770,100,M,Алексей Сизов,1979,No,Wraps,SBD
3,Igor Paramonov,Open,99.1,272.5,292.5,-305,292.5,,175,-185,-190,175,,290,302.5,-307.5,302.5,,770,100,M,Игорь Парамонов,1983,No,Wraps,SBD
4,Sergey Zotov,Open,95.6,180,190,-197.5,190,,105,115,-120,115,,180,190,-195,190,,495,100,M,Сергей Зотов,1988,No,Wraps,SBD
DQ,Andrey Vorivodin,Open,96.5,-315,-330,-330,,,,,,,,,,,,,,100,M,Андрей Вориводин,1990,No,Wraps,SBD
1,Vitaliy Kulikov,Masters 40-44,95,185,200,210,210,,135,-145,145,145,,235,250,-255,250,,605,100,M,Виталий Куликов,1971,No,Wraps,SBD
2,Valeriy Sytnikov,Masters 40-44,99.5,170,182.5,-195,182.5,,147.5,152.5,-165,152.5,,250,270,-277.5,270,,605,100,M,Валерий Сытников,1970,No,Wraps,SBD
1,Aleksandr Tsvetkov,Masters 55-59,90.6,200,-225,225,225,,110,115,-120,115,,200,230,245,245,,585,100,M,Александр Цветков,1957,No,Wraps,SBD
1,Grigoriy Bebenin,Juniors 20-23,108.9,300,-315,-315,300,,195,205,-215,205,,280,290,300,300,,805,110,M,Григорий Бебенин,1993,No,Wraps,SBD
2,Aleksey Andriyanov,Juniors 20-23,108,230,240,250,250,,160,-170,-170,160,,250,-270,,250,,660,110,M,Алексей Андриянов,1994,No,Wraps,SBD
3,Aleksey Averyanov,Juniors 20-23,108.6,200,220,-225,220,,130,-150,150,150,,212.5,-222.5,-222.5,212.5,,582.5,110,M,Алексей Аверьянов,1993,No,Wraps,SBD
1,Shakhrukh Igamov,Open,100.6,-235,240,-250,240,,155,160,-165,160,,230,240,250,250,,650,110,M,Шахрух Игамов,1978,No,Wraps,SBD
2,Aleksandr Drozdov,Open,101,-220,220,230,230,,140,150,155,155,,220,240,-250,240,,625,110,M,Александр Дроздов,1980,No,Wraps,SBD
3,Nikolay Zamp,Open,106.1,-220,220,-240,220,,-140,-150,150,150,,220,235,-245,235,,605,110,M,Николай Замп,1990,No,Wraps,SBD
4,Andrey Zolotarenok,Open,105.7,-185,195,210,210,,145,150,155,155,,200,215,225,225,,590,110,M,Андрей Золотаренок,1978,No,Wraps,SBD
5,Nikolay Kotov,Open,100.4,180,190,205,205,,140,147.5,150,150,,190,205,-220,205,,560,110,M,Николай Котов,1975,No,Wraps,SBD
1,Marat Savosin,Open,112.7,325.5,-340,-340,325.5,,205,212.5,-215,212.5,,285,295,-300,295,,833,125,M,Марат Савосин,1990,No,Wraps,SBD
2,Aleksandr Chervyakov,Open,123.2,240,255,-260,255,,210,217.5,-220,217.5,,315,-325,-325,315,,787.5,125,M,Александр Червяков,1988,No,Wraps,SBD
3,Sergey Ustinov,Open,117.6,-270,285,300,300,,175,185,-192.5,185,,270,290,-300,290,,775,125,M,Сергей Устинов,1988,No,Wraps,SBD
4,Evgeniy Kirin,Open,112.5,-200,200,250,250,,140,-150,160,160,,240,270,-290,270,,680,125,M,Евгений Кирин,1990,No,Wraps,SBD
5,Ilya Potolitsyn,Open,121.5,210,-230,230,230,,-140,140,160,160,,230,250,270,270,,660,125,M,Илья Потолицын,1991,No,Wraps,SBD
6,Aleksey Oleshko,Open,110.2,185,200,217.5,217.5,,167.5,175,182.5,182.5,,-205,-225,235,235,,635,125,M,Алексей Олешко,1980,No,Wraps,SBD
1,Yuriy Vartabedyan,Juniors 20-23,125.5,320,-330,-340,320,,-225,225,-227.5,225,,280,-287.5,-287.5,280,,825,140,M,Юрий Вартабедьян,1991,No,Wraps,SBD
DQ,Konstantin Sapunkov,Open,81.7,-280,-282.5,-287.5,,,,,,,,,,,,,,82.5,M,Константин Сапунков,1981,Yes,Multi-ply,SBD
1,Dmitriy Ryzhnikov,Open,87.7,100,,,100,,130,135,145,145,,180,-200,205,205,,450,90,M,Дмитрий Рыжников,1984,Yes,Multi-ply,SBD
2,Sergey Nikolaev,Open,83.2,-140,140,155,155,,120,130,-140,130,,-130,130,150,150,,435,90,M,Сергей Николаев,1979,Yes,Multi-ply,SBD
1,Nikita Maksimov,Open,67.3,220,235,250,250,,140,157.5,167.5,167.5,,225,245,-270,245,,662.5,67.5,M,Никита Максимов,1990,No,Multi-ply,SBD
1,Ilya Lebedev,Masters 40-44,89.5,285,-320,-320,285,,180,200,210,210,,260,282.5,-302.5,282.5,,777.5,90,M,Илья Лебедев,1972,No,Multi-ply,SBD
1,Andrey Drozhzhin,Open,100,310,330,-345,330,,185,195,205,205,,280,-290,,280,,815,100,M,Андрей Дрожжин,1977,No,Multi-ply,SBD
2,Maksim Aleksandrov,Open,99,270,285,,285,,195,-205,205,205,,250,-270,-280,250,,740,100,M,Максим Александров,1988,No,Multi-ply,SBD
DQ,Vadim Kasparov,Teen 18-19,121.7,-300,-300,-305,,,,,,,,,,,,,,125,M,Вадим Каспаров,1996,No,Multi-ply,SBD
1,Natalya Sycheva,Teen 18-19,41,,,,,,37.5,-40,-40,37.5,,,,,,,37.5,44,F,Наталья Сычева,1995,Yes,Raw,B
1,Yuliya Murasheva,Masters 40-44,43,,,,,,75,77.5,80,80,,,,,,,80,44,F,Юлия Мурашева,1970,Yes,Raw,B
1,Svetlana Kadantseva,Juniors 20-23,46.6,,,,,,45,-47.5,-47.5,45,,,,,,,45,48,F,Светлана Каданцева,1991,Yes,Raw,B
1,Tatyana Primak,Open,48,,,,,,47.5,52.5,55,55,-57.5,,,,,,55,48,F,Татьяна Примак,1983,Yes,Raw,B
2,Ekaterina Potekhina,Open,46.8,,,,,,40,42.5,45,45,,,,,,,45,48,F,Екатерина Потехина,1988,Yes,Raw,B
1,Oksana Grigoryeva,Teen 16-17,51.9,,,,,,40,42.5,45,45,,,,,,,45,52,F,Оксана Григорьева,1997,Yes,Raw,B
1,Margarita Ryabchikova,Juniors 20-23,51.3,,,,,,57.5,60,-62.5,60,,,,,,,60,52,F,Маргарита Рябчикова,1994,Yes,Raw,B
1,Gulnara Garifullina,Open,50.6,,,,,,57.5,-60,-60,57.5,,,,,,,57.5,52,F,Гульнара Гарифуллина,1975,Yes,Raw,B
1,Darya Galaeva,Teen 13-15,54.1,,,,,,50,55,-57.5,55,,,,,,,55,56,F,Дарья Галаева,1999,Yes,Raw,B
1,Vera Storozhenko,Juniors 20-23,55.3,,,,,,50,-55,,50,,,,,,,50,56,F,Вера Стороженко,1994,Yes,Raw,B
1,Ekaterina Ilinskaya,Open,56,,,,,,65,-70,-72.5,65,,,,,,,65,56,F,Екатерина Ильинская,1988,Yes,Raw,B
2,Tatyana Sakhnova,Open,55.3,,,,,,50,55,-57.5,55,,,,,,,55,56,F,Татьяна Сахнова,1980,Yes,Raw,B
3,Irina Pragina,Open,53.5,,,,,,-50,50,-55,50,,,,,,,50,56,F,Ирина Прагина,1989,Yes,Raw,B
1,Svetlana Vlasova,Masters 40-44,54.5,,,,,,62.5,-67.5,-67.5,62.5,,,,,,,62.5,56,F,Светлана Власова,1972,Yes,Raw,B
1,Ekaterina Paseshnyuk,Juniors 20-23,57.8,,,,,,62.5,65,67.5,67.5,,,,,,,67.5,60,F,Екатерина Пасешнюк,1994,Yes,Raw,B
1,Nadezhda Pankina,Open,59.8,,,,,,-57.5,60,-65,60,,,,,,,60,60,F,Надежда Панкина,1989,Yes,Raw,B
1,Natalya Dobrova,Masters 40-44,56.3,,,,,,-65,67.5,-70,67.5,,,,,,,67.5,60,F,Наталья Доброва,1970,Yes,Raw,B
1,Galina Kondratyeva,Masters 60-64,57.8,,,,,,45,47.5,50,50,-52.5,,,,,,50,60,F,Галина Кондратьева,1952,Yes,Raw,B
DQ,Evgeniya Guseva,Teen 16-17,62.5,,,,,,-32.5,-35,-35,,,,,,,,,67.5,F,Евгения Гусева,1997,Yes,Raw,B
1,Natalya Tyulyukova,Open,82.5,,,,,,-50,52.5,55,55,57.5,,,,,,55,82.5,F,Наталья Тюлюкова,1979,Yes,Raw,B
1,Olga Gavrilova,Masters 50-54,93,,,,,,55,-57.5,-57.5,55,,,,,,,55,100,F,Ольга Гаврилова,1960,Yes,Raw,B
1,Artem Demin,Teen 13-15,48,,,,,,45,50,55,55,-57.5,,,,,,55,52,M,Артем Демин,2000,Yes,Raw,B
1,Roman Britasov,Teen 18-19,54,,,,,,75,-80,-80,75,,,,,,,75,56,M,Роман Бритасов,1995,Yes,Raw,B
1,Egor Arkharov,Teen 13-15,58.8,,,,,,67.5,70,-77.5,70,,,,,,,70,60,M,Егор Архаров,1998,Yes,Raw,B
1,Dmitriy Egorov,Teen 13-15,64.4,,,,,,100,105,107.5,107.5,,,,,,,107.5,67.5,M,Дмитрий Егоров,1999,Yes,Raw,B
2,Ilya Medvedev,Teen 13-15,67.5,,,,,,75,82.5,-87.5,82.5,,,,,,,82.5,67.5,M,Илья Медведев,1999,Yes,Raw,B
1,Ivan Luchenkov,Juniors 20-23,61.5,,,,,,120,-122.5,125,125,,,,,,,125,67.5,M,Иван Лученков,1991,Yes,Raw,B
1,Pavel Khokhryakov,Open,64.5,,,,,,105,107.5,112.5,112.5,,,,,,,112.5,67.5,M,Павел Хохряков,1982,Yes,Raw,B
2,Vitaliy Gluschenko,Open,62.6,,,,,,102.5,107.5,-110,107.5,,,,,,,107.5,67.5,M,Виталий Глущенко,1984,Yes,Raw,B
1,Ilya Kuvshinov,Teen 13-15,68,,,,,,102.5,112.5,117.5,117.5,,,,,,,117.5,75,M,Илья Кувшинов,1999,Yes,Raw,B
1,Suleyman Suleymanov,Teen 18-19,69.9,,,,,,127.5,135,137.5,137.5,140,,,,,,137.5,75,M,Сулейман Сулейманов,1996,Yes,Raw,B
1,Aleksandr Dyakov,Juniors 20-23,72.1,,,,,,135,-142.5,-142.5,135,,,,,,,135,75,M,Александр Дьяков,1994,Yes,Raw,B
2,Aleksey Gritsan,Juniors 20-23,71.7,,,,,,115,-122.5,-122.5,115,,,,,,,115,75,M,Алексей Грицан,1992,Yes,Raw,B
DQ,Taras Shepitko,Juniors 20-23,74,,,,,,-110,-117.5,-117.5,,,,,,,,,75,M,Тарас Шепитько,1992,Yes,Raw,B
1,Dmitriy Firsaev,Open,74.7,,,,,,142.5,147.5,-150,147.5,,,,,,,147.5,75,M,Дмитрий Фирсаев,1983,Yes,Raw,B
2,Vladislav Atlashkin,Open,74,,,,,,-145,145,-147.5,145,,,,,,,145,75,M,Владислав Атлашкин,1985,Yes,Raw,B
3,Dmitriy Chernikov,Open,73.5,,,,,,-125,135,140,140,,,,,,,140,75,M,Дмитрий Черников,1989,Yes,Raw,B
4,Maksim Baydin,Open,74.6,,,,,,130,135,-140,135,,,,,,,135,75,M,Максим Байдин,1986,Yes,Raw,B
5,Sergey Schukin,Open,74.6,,,,,,130,135,-140,135,,,,,,,135,75,M,Сергей Щукин,1988,Yes,Raw,B
6,Aleksey Minaev,Open,74.4,,,,,,120,127.5,-130,127.5,,,,,,,127.5,75,M,Алексей Минаев,1976,Yes,Raw,B
7,Ilya Sidorenko,Open,73,,,,,,120,-135,-135,120,,,,,,,120,75,M,Илья Сидоренко,1990,Yes,Raw,B
8,Timofey Grishkov,Open,73,,,,,,102.5,-107.5,-107.5,102.5,,,,,,,102.5,75,M,Тимофей Гришков,1990,Yes,Raw,B
9,Farkhod Shadiev,Open,72.5,,,,,,75,77.5,80,80,,,,,,,80,75,M,Фарход Шадиев,1988,Yes,Raw,B
DQ,Artem Glazatov,Open,73.7,,,,,,-135,-135,-135,,,,,,,,,75,M,Артем Глазатов,1989,Yes,Raw,B
1,Mikhail Buyanov,Masters 40-44,74.5,,,,,,125,132.5,-135,132.5,,,,,,,132.5,75,M,Михаил Буянов,1974,Yes,Raw,B
2,Pavel Kurinkov,Masters 40-44,74,,,,,,127.5,-135,-135,127.5,,,,,,,127.5,75,M,Павел Куринков,1974,Yes,Raw,B
1,Andrey Belyakov,Masters 45-49,74.7,,,,,,125,135,,135,,,,,,,135,75,M,Андрей Беляков,1966,Yes,Raw,B
2,Aleksey Shalunov,Masters 45-49,71.9,,,,,,112.5,115,117.5,117.5,,,,,,,117.5,75,M,Алексей Шалунов,1969,Yes,Raw,B
1,Georgiy Dubrovin,Teen 16-17,77.2,,,,,,140,150,-155,150,,,,,,,150,82.5,M,Георгий Дубровин,1997,Yes,Raw,B
2,Nikita Nagaytsev,Teen 16-17,79.4,,,,,,117.5,-122.5,-127.5,117.5,,,,,,,117.5,82.5,M,Никита Нагайцев,1997,Yes,Raw,B
1,Aleksandr Tvorogov,Teen 18-19,75.4,,,,,,-97.5,-102.5,105,105,,,,,,,105,82.5,M,Александр Творогов,1996,Yes,Raw,B
DQ,Yaroslav Salnikov,Juniors 20-23,81.1,,,,,,-127.5,-127.5,-127.5,,,,,,,,,82.5,M,Ярослав Сальников,1993,Yes,Raw,B
1,Sergey Gorban,Open,82,,,,,,160,162.5,165,165,,,,,,,165,82.5,M,Сергей Горбань,1988,Yes,Raw,B
2,Dmitriy Malyukov,Open,82.5,,,,,,145,-150,150,150,,,,,,,150,82.5,M,Дмитрий Малюков,1980,Yes,Raw,B
3,Petr Zakharov,Open,80.6,,,,,,137.5,-145,-145,137.5,,,,,,,137.5,82.5,M,Петр Захаров,1985,Yes,Raw,B
DQ,Denis Arapov,Open,79.6,,,,,,-150,-150,-150,,,,,,,,,82.5,M,Денис Арапов,1981,Yes,Raw,B
1,Andrey Gilev,Masters 45-49,79.6,,,,,,105,-107.5,-107.5,105,,,,,,,105,82.5,M,Андрей Гилев,1967,Yes,Raw,B
1,Sergey Bazanov,Masters 50-54,80.7,,,,,,140,147.5,150,150,,,,,,,150,82.5,M,Сергей Базанов,1962,Yes,Raw,B
2,Vladimir Fateev,Masters 50-54,79.5,,,,,,115,120,-122.5,120,,,,,,,120,82.5,M,Владимир Фатеев,1964,Yes,Raw,B
1,Bogdan Egorov,Teen 18-19,86.5,,,,,,140,145,155,155,-160,,,,,,155,90,M,Богдан Егоров,1995,Yes,Raw,B
2,Damir Alimov,Teen 18-19,87.5,,,,,,120,132.5,135,135,,,,,,,135,90,M,Дамир Алимов,1995,Yes,Raw,B
1,Evgeniy Fedyainov,Juniors 20-23,89.1,,,,,,142.5,152.5,-157.5,152.5,,,,,,,152.5,90,M,Евгений Федяинов,1991,Yes,Raw,B
1,Vyacheslav Vertev,Open,89.2,,,,,,165,-175,-175,165,,,,,,,165,90,M,Вячеслав Вертев,1984,Yes,Raw,B
2,Viktor Eliseev,Open,89.7,,,,,,-165,165,-170,165,,,,,,,165,90,M,Виктор Елисеев,1987,Yes,Raw,B
3,Sergey Zadubrovskiy,Open,90,,,,,,-160,165,-170,165,,,,,,,165,90,M,Сергей Задубровский,1982,Yes,Raw,B
4,Aleksey Pustovoytov,Open,89.4,,,,,,155,-160,160,160,,,,,,,160,90,M,Алексей Пустовойтов,1984,Yes,Raw,B
5,Bair Badmadashiev,Open,86.6,,,,,,-145,152.5,-160,152.5,,,,,,,152.5,90,M,Баир Бадмадашиев,1976,Yes,Raw,B
6,Vladislav Girko,Open,84.4,,,,,,145,150,-152.5,150,,,,,,,150,90,M,Владислав Гирко,1987,Yes,Raw,B
7,Kayrat Baymuratov,Open,89,,,,,,132.5,135,140,140,,,,,,,140,90,M,,1986,Yes,Raw,B
8,Pavel Gubin,Open,86.6,,,,,,122.5,-132.5,132.5,132.5,,,,,,,132.5,90,M,Павел Губин,1978,Yes,Raw,B
9,Artem Barashyan,Open,89.2,,,,,,132.5,-152.5,-152.5,132.5,,,,,,,132.5,90,M,Артем Барашьян,1989,Yes,Raw,B
1,Yuriy Efremov,Masters 40-44,90,,,,,,155,-160,-160,155,,,,,,,155,90,M,Юрий Ефремов,1972,Yes,Raw,B
2,Vadim Merkulov,Masters 40-44,86.7,,,,,,-130,130,-140,130,,,,,,,130,90,M,Вадим Меркулов,1970,Yes,Raw,B
1,Aleksandr Rumyantsev,Masters 45-49,89.1,,,,,,160,-165,-165,160,,,,,,,160,90,M,Александр Румянцев,1969,Yes,Raw,B
2,Mikhail Pavlov,Masters 45-49,89.9,,,,,,145,152.5,,152.5,,,,,,,152.5,90,M,Михаил Павлов,1967,Yes,Raw,B
1,Leonid Skvortsov,Masters 50-54,89.2,,,,,,160,-170,170,170,,,,,,,170,90,M,Леонид Скворцов,1962,Yes,Raw,B
1,Vladimir Biryukov,Masters 80+,87,,,,,,85,90,92.5,92.5,,,,,,,92.5,90,M,Владимир Бирюков,1934,Yes,Raw,B
1,Aleksey Kotov,Open,96.4,,,,,,180,190,-192.5,190,,,,,,,190,100,M,Алексей Котов,1974,Yes,Raw,B
2,Bogdan Mikhayletskiy,Open,99.5,,,,,,162.5,170,-175,170,,,,,,,170,100,M,Богдан Михайлецкий,1986,Yes,Raw,B
3,Danis Zakiryanov,Open,95.5,,,,,,-145,145,155,155,,,,,,,155,100,M,Данис Закирянов,1986,Yes,Raw,B
4,Evgeniy Shpakov,Open,93.5,,,,,,142.5,152.5,-162.5,152.5,,,,,,,152.5,100,M,Евгений Шпаков,1984,Yes,Raw,B
5,Dmitriy Ilyukhin,Open,97.2,,,,,,145,-150,-150,145,,,,,,,145,100,M,Дмитрий Илюхин,1982,Yes,Raw,B
DQ,Dmitriy Schigirev,Open,97.9,,,,,,-112.5,-112.5,-112.5,,,,,,,,,100,M,Дмитрий Щигирев,1990,Yes,Raw,B
1,Sergey Matveev,Masters 40-44,97.7,,,,,,180,-190,-190,180,,,,,,,180,100,M,Сергей Матвеев,1973,Yes,Raw,B
2,Sergey Yarochkin,Masters 40-44,90.2,,,,,,147.5,155,160,160,,,,,,,160,100,M,Сергей Ярочкин,1971,Yes,Raw,B
3,Aleksey Strulev,Masters 40-44,96.1,,,,,,130,137.5,140,140,,,,,,,140,100,M,Алексей Струлев,1971,Yes,Raw,B
1,Yuriy Lyubach,Masters 45-49,94.9,,,,,,132.5,137.5,-142.5,137.5,,,,,,,137.5,100,M,Юрий Любач,1968,Yes,Raw,B
1,Mikhail Prokopov,Masters 55-59,96.2,,,,,,150,-155,155,155,,,,,,,155,100,M,Михаил Прокопов,1956,Yes,Raw,B
2,Aleksandr Vdovushkin,Masters 55-59,91,,,,,,135,145,150,150,,,,,,,150,100,M,Александр Вдовушкин,1956,Yes,Raw,B
1,Valeriy Fedyaev,Masters 60-64,98.4,,,,,,110,115,120,120,,,,,,,120,100,M,Валерий Федяев,1951,Yes,Raw,B
1,Viorel Bulgak,Open,107.6,,,,,,-170,195,205,205,,,,,,,205,110,M,Виорел Булгак,1985,Yes,Raw,B
2,Aleksey Kanaykin,Open,108,,,,,,-160,-162.5,162.5,162.5,,,,,,,162.5,110,M,Алексей Канайкин,1985,Yes,Raw,B
3,Vladislav Kolesnikov,Open,105.8,,,,,,155,-167.5,-175,155,,,,,,,155,110,M,Владислав Колесников,1984,Yes,Raw,B
4,Dmitriy Merkulov,Open,104.7,,,,,,147.5,-167.5,-167.5,147.5,,,,,,,147.5,110,M,Дмитрий Меркулов,1985,Yes,Raw,B
1,Ivan Burlov,Masters 40-44,109.5,,,,,,162.5,170,-175,170,,,,,,,170,110,M,Иван Бурлов,1970,Yes,Raw,B
2,Vladimir Kotov,Masters 40-44,108,,,,,,155,162.5,-167.5,162.5,,,,,,,162.5,110,M,Владимир Котов,1973,Yes,Raw,B
1,Evgeniy Veles,Masters 45-49,109.3,,,,,,180,-190,-200,180,,,,,,,180,110,M,Евгений Велес,1968,Yes,Raw,B
2,Aleksey Kladovschikov,Masters 45-49,109.5,,,,,,150,160,-167.5,160,,,,,,,160,110,M,Алексей Кладовщиков,1969,Yes,Raw,B
1,Denis Ogloblin,Open,124.2,,,,,,195,200,205,205,,,,,,,205,125,M,Денис Оглоблин,1967,Yes,Raw,B
2,Aleksandr Andreev,Open,114.6,,,,,,190,195,-200,195,,,,,,,195,125,M,Александр Андреев,1977,Yes,Raw,B
1,Artem Berdnik,Masters 40-44,118,,,,,,130,-137.5,-137.5,130,,,,,,,130,125,M,Артем Бердник,1974,Yes,Raw,B
DQ,Aleksey Ilyakov,Masters 40-44,113.5,,,,,,-110,-110,-110,,,,,,,,,125,M,Алексей Ильяков,1973,Yes,Raw,B
1,Denis Ogloblin,Masters 45-49,124.2,,,,,,195,200,205,205,,,,,,,205,125,M,Денис Оглоблин,1967,Yes,Raw,B
1,Vladimir Chubarov,Masters 50-54,113.5,,,,,,145,150,152.5,152.5,,,,,,,152.5,125,M,Владимир Чубаров,1964,Yes,Raw,B
1,Maksim Bogomolov,Juniors 20-23,139.2,,,,,,-145,145,-157.5,145,,,,,,,145,140,M,Максим Богомолов,1993,Yes,Raw,B
1,Sergey Kozlovskiy,Masters 50-54,131.6,,,,,,185,-192.5,-195,185,,,,,,,185,140,M,Сергей Козловский,1963,Yes,Raw,B
1,Roman Mishurenkov,Open,140.4,,,,,,192.5,202.5,212.5,212.5,-213,,,,,,212.5,140+,M,Роман Мишуренков,1982,Yes,Raw,B
DQ,Tatyana Shpeytelshpakher,Juniors 20-23,60,,,,,,-67.5,-67.5,,,,,,,,,,60,F,Татьяна Шпейтельшпахер,1994,No,Raw,B
1,Kristina Gurova,Open,60,,,,,,60,67.5,70,70,,,,,,,70,60,F,Кристина Гурова,1987,No,Raw,B
1,Artur Belous,Open,75,,,,,,165,175,182.5,182.5,,,,,,,182.5,75,M,Артур Белоус,1985,No,Raw,B
2,Aleksandr Yakovlev,Open,73.1,,,,,,150,-155,-160,150,,,,,,,150,75,M,Александр Яковлев,1982,No,Raw,B
3,Aleksey Klyushin,Open,74,,,,,,-150,150,-160,150,,,,,,,150,75,M,Алексей Клюшин,1981,No,Raw,B
1,Yuriy Ermolin,Masters 60-64,73.7,,,,,,90,-100,,90,,,,,,,90,75,M,Юрий Ермолин,1952,No,Raw,B
1,Aleksey Blintsov,Open,81.9,,,,,,175,185,190,190,,,,,,,190,82.5,M,Алексей Блинцов,1980,No,Raw,B
2,Aleksandr Kraev,Open,80.4,,,,,,-155,155,-157.5,155,,,,,,,155,82.5,M,Александр Краев,1982,No,Raw,B
3,Vladislav Fomin,Open,80,,,,,,-132.5,-132.5,132.5,132.5,,,,,,,132.5,82.5,M,Владислав Фомин,1994,No,Raw,B
4,Nikolay Petrakovich,Open,77.5,,,,,,-130,130,-137.5,130,,,,,,,130,82.5,M,Николай Петракович,1979,No,Raw,B
1,Sergey Goncharov,Masters 60-64,79,,,,,,115,120,125,125,,,,,,,125,82.5,M,Сергей Гончаров,1952,No,Raw,B
1,Nikolay Ionov,Masters 65-69,75.7,,,,,,90,100,110,110,,,,,,,110,82.5,M,Николай Ионов,1949,No,Raw,B
1,Anton Dzhafyarov,Open,89.1,,,,,,-200,-200,200,200,,,,,,,200,90,M,Антон Джафяров,1985,No,Raw,B
2,Evgeniy Boytsov,Open,89.2,,,,,,-195,200,-207.5,200,,,,,,,200,90,M,Евгений Бойцов,1988,No,Raw,B
3,Evgeniy Bulakhov,Open,86.5,,,,,,170,175,-180,175,,,,,,,175,90,M,Евгений Булахов,1985,No,Raw,B
1,Sergey Popov,Masters 40-44,89.7,,,,,,190,-195,-195,190,,,,,,,190,90,M,Сергей Попов,1974,No,Raw,B
2,Mikhail Solomatin,Masters 40-44,87.4,,,,,,160,165,170,170,,,,,,,170,90,M,Михаил Соломатин,1970,No,Raw,B
1,Dmitriy Semenov,Masters 45-49,87.2,,,,,,135,-140,-140,135,,,,,,,135,90,M,Дмитрий Семенов,1965,No,Raw,B
1,Aleksey Bastrykin,Juniors 20-23,98.2,,,,,,-180,180,190,190,,,,,,,190,100,M,Алексей Бастрыкин,1991,No,Raw,B
2,Evgeniy Zuykov,Juniors 20-23,97.4,,,,,,-140,-145,145,145,,,,,,,145,100,M,Евгений Зуйков,1994,No,Raw,B
1,Maksim Galichenkov,Open,96.1,,,,,,190,195,200,200,,,,,,,200,100,M,Максим Галиченков,1988,No,Raw,B
2,Anton Schenev,Open,99.1,,,,,,180,190,200,200,,,,,,,200,100,M,Антон Щенев,1985,No,Raw,B
3,Maksim Isachenko,Open,96.2,,,,,,182.5,192.5,197.5,197.5,,,,,,,197.5,100,M,Максим Исаченко,1985,No,Raw,B
4,Andrey Svezhentsev,Open,98.9,,,,,,-175,180,190,190,,,,,,,190,100,M,Андрей Свеженцев,1979,No,Raw,B
5,Anton Bogdanov,Open,99,,,,,,-175,180,187.5,187.5,,,,,,,187.5,100,M,Антон Богданов,1988,No,Raw,B
6,Aleksandr Mokin,Open,97.8,,,,,,147.5,155,-165,155,,,,,,,155,100,M,Александр Мокин,1978,No,Raw,B
7,Dmitriy Serdyuk,Open,96.6,,,,,,132.5,147.5,,147.5,,,,,,,147.5,100,M,Дмитрий Сердюк,1983,No,Raw,B
1,Vladislav Duminika,Masters 40-44,93.9,,,,,,185,190,-192.5,190,,,,,,,190,100,M,Владислав Думиника,1972,No,Raw,B
2,Sergey Vorobyev,Masters 40-44,97.7,,,,,,180,-190,-190,180,,,,,,,180,100,M,Сергей Воробьев,1970,No,Raw,B
3,Valeriy Sytnikov,Masters 40-44,99.5,,,,,,147.5,152.5,-165,152.5,,,,,,,152.5,100,M,Валерий Сытников,1970,No,Raw,B
1,Aleksandr Gorshkov,Masters 45-49,95.9,,,,,,190,205,212.5,212.5,,,,,,,212.5,100,M,Александр Горшков,1967,No,Raw,B
1,Grigoriy Bebenin,Juniors 20-23,108.9,,,,,,195,205,-215,205,,,,,,,205,110,M,Григорий Бебенин,1993,No,Raw,B
2,Vitaliy Chudaykin,Juniors 20-23,106.3,,,,,,160,170,180,180,,,,,,,180,110,M,Виталий Чудайкин,1991,No,Raw,B
1,Anton Koksharov,Open,106.8,,,,,,227.5,-235,237.5,237.5,,,,,,,237.5,110,M,Антон Кокшаров,1977,No,Raw,B
2,Vladimir Svinarchuk,Open,107.5,,,,,,220,230,237.5,237.5,,,,,,,237.5,110,M,Владимир Свинарчук,1983,No,Raw,B
3,Andrey Grudkin,Open,109.7,,,,,,210,217.5,222.5,222.5,,,,,,,222.5,110,M,Андрей Грудкин,1984,No,Raw,B
4,Igor Lipachev,Open,107.1,,,,,,210,217.5,-225,217.5,,,,,,,217.5,110,M,Игорь Липачев,1968,No,Raw,B
DQ,Vladislav Sidorenko,Open,105.5,,,,,,-207.5,-207.5,-207.5,,,,,,,,,110,M,Владислав Сидоренко,1987,No,Raw,B
1,Kirill Potekhin,Masters 40-44,101.2,,,,,,175,-187.5,187.5,187.5,,,,,,,187.5,110,M,Кирилл Потехин,1971,No,Raw,B
2,Dmitriy Kondratenko,Masters 40-44,108.8,,,,,,155,165,-175,165,,,,,,,165,110,M,Дмитрий Кондратенко,1973,No,Raw,B
1,Andrey Skorobogatko,Masters 50-54,107.2,,,,,,140,-150,155,155,,,,,,,155,110,M,Андрей Скоробогатько,1963,No,Raw,B
2,Igor Kurotchenko,Masters 50-54,106,,,,,,135,145,-150,145,,,,,,,145,110,M,Игорь Куротченко,1962,No,Raw,B
1,Roman Antonov,Juniors 20-23,117.9,,,,,,180,190,-200,190,,,,,,,190,125,M,Роман Антонов,1994,No,Raw,B
1,Roman Knischuk,Open,113.2,,,,,,-230,237.5,245,245,,,,,,,245,125,M,Роман Книщук,1975,No,Raw,B
2,Roman Strelkov,Open,121.2,,,,,,230,-240,-240,230,,,,,,,230,125,M,Роман Стрелков,1969,No,Raw,B
3,Dmitriy Zubarev,Open,123.5,,,,,,180,200,-207.5,200,,,,,,,200,125,M,Дмитрий Зубарев,1987,No,Raw,B
4,Pavel Kislov,Open,122.3,,,,,,185,197.5,-207.5,197.5,,,,,,,197.5,125,M,Павел Кислов,1983,No,Raw,B
1,Vadim Pchelkin,Masters 40-44,118.9,,,,,,195,205,212.5,212.5,,,,,,,212.5,125,M,Вадим Пчелкин,1971,No,Raw,B
1,Roman Strelkov,Masters 45-49,121.2,,,,,,230,-240,-240,230,,,,,,,230,125,M,Роман Стрелков,1969,No,Raw,B
1,Igor Lomov,Open,126,,,,,,227.5,-235,,227.5,,,,,,,227.5,140,M,Игорь Ломов,1970,No,Raw,B
1,Sergey Mironov,Masters 40-44,131.4,,,,,,205,215,-220,215,,,,,,,215,140,M,Сергей Миронов,1973,No,Raw,B
1,Viktor Kozlov,Masters 50-54,127.5,,,,,,205,212.5,215,215,217.5,,,,,,215,140,M,Виктор Козлов,1963,No,Raw,B
1,Natalya Agapova,Open,72.5,,,,,,60,65,70,70,,,,,,,70,75,F,Наталья Агапова,1978,Yes,Multi-ply,B
1,Artem Larionov,Open,73.9,,,,,,205,-210,-210,205,,,,,,,205,75,M,Артем Ларионов,1978,Yes,Multi-ply,B
DQ,Konstantin Alekseychuk,Open,79.9,,,,,,-135,-135,-135,,,,,,,,,82.5,M,Константин Алексейчук,1988,Yes,Multi-ply,B
DQ,Pavel Efremenkov,Open,97.2,,,,,,-195,-195,-200,,,,,,,,,100,M,Павел Ефременков,1986,Yes,Multi-ply,B
1,Valeriy Chernov #1,Masters 45-49,99.2,,,,,,170,180,-190,180,,,,,,,180,100,M,Валерий Чернов,1969,Yes,Multi-ply,B
1,Mikhail Antsiferov,Open,107.2,,,,,,200,-215,-215,200,,,,,,,200,110,M,Михаил Анциферов,1981,Yes,Multi-ply,B
1,Aleksandr Nosov,Open,96.9,,,,,,202.5,210,215,215,,,,,,,215,100,M,Александр Носов,1985,No,Multi-ply,B
1,Sergey Mavrenkov,Masters 45-49,100,,,,,,235,-245,-245,235,,,,,,,235,100,M,Сергей Мавренков,1966,No,Multi-ply,B
1,Nikita Maksimov,Open,67.3,,,,,,150,-167.5,-175,150,,,,,,,150,67.5,M,Никита Максимов,1990,No,Single-ply,B
1,Yuriy Kolesnikov #1,Open,74.1,,,,,,100,110,120,120,,,,,,,120,75,M,Юрий Колесников,1981,No,Single-ply,B
1,Ilya Uglichin,Open,87.9,,,,,,-190,190,-205,190,,,,,,,190,90,M,Илья Угличин,1987,No,Single-ply,B
2,Igor Aleshin,Open,89.8,,,,,,-170,-170,175,175,,,,,,,175,90,M,Игорь Алешин,1987,No,Single-ply,B
1,Artem Pokamestov,Juniors 20-23,98.4,,,,,,170,180,190,190,,,,,,,190,100,M,Артем Покаместов,1992,No,Single-ply,B
1,Sergey Tesaruk,Open,98.3,,,,,,200,212.5,217.5,217.5,,,,,,,217.5,100,M,Сергей Тесарук,1984,No,Single-ply,B
1,Aleksandr Shishkin,Open,102.5,,,,,,222.5,235,242.5,242.5,,,,,,,242.5,110,M,Александр Шишкин,1975,No,Single-ply,B
1,Egor Konovalov,Juniors 20-23,111.5,,,,,,200,210,-217.5,210,,,,,,,210,125,M,Егор Коновалов,1991,No,Single-ply,B
1,Aleksey Chaykin,Open,136.6,,,,,,250,260,-270,260,,,,,,,260,140,M,Алексей Чайкин,1978,No,Single-ply,B
1,Dmitriy Shabalin #1,Masters 45-49,133.1,,,,,,280,-290,290,290,,,,,,,290,140,M,Дмитрий Шабалин,1969,No,Single-ply,B
1,Aleksandra Olefir,Open,47.5,,,,,,,,,,,75,-85,85,85,,85,48,F,Александра Олефир,1989,Yes,Raw,D
1,Elena Klimina,Juniors 20-23,54.1,,,,,,,,,,,115,-122.5,-122.5,115,,115,56,F,Елена Климина,1992,Yes,Raw,D
1,Olga Zagubera,Open,59.8,,,,,,,,,,,135,147.5,150,150,,150,60,F,Ольга Загубера,1980,Yes,Raw,D
1,Mariya Donskova,Teen 16-17,62.5,,,,,,,,,,,100,107.5,-110,107.5,,107.5,67.5,F,Мария Донскова,1998,Yes,Raw,D
1,Natalya Agapova,Open,72.5,,,,,,,,,,,125,130,-142.5,130,,130,75,F,Наталья Агапова,1978,Yes,Raw,D
1,Aleksandr Melnikov,Teen 16-17,64,,,,,,,,,,,132.5,140,145,145,,145,67.5,M,Александр Мельников,1998,Yes,Raw,D
1,Aleksandr Shubin,Juniors 20-23,65.5,,,,,,,,,,,150,157.5,-165,157.5,,157.5,67.5,M,Александр Шубин,1994,Yes,Raw,D
1,Aleksey Gritsan,Juniors 20-23,71.7,,,,,,,,,,,150,-160,167.5,167.5,,167.5,75,M,Алексей Грицан,1992,Yes,Raw,D
1,Aleksandr Grechukhin,Open,73.9,,,,,,,,,,,215,230,240,240,-245,240,75,M,Александр Гречухин,1989,Yes,Raw,D
2,Aleksandr Bykhovskiy,Open,73.5,,,,,,,,,,,140,155,160,160,,160,75,M,Александр Быховский,1984,Yes,Raw,D
1,Aleksey Shalunov,Masters 45-49,71.9,,,,,,,,,,,160,165,170,170,,170,75,M,Алексей Шалунов,1969,Yes,Raw,D
1,Andrey Kruglov,Open,80.9,,,,,,,,,,,260,-277.5,-277.5,260,,260,82.5,M,Андрей Круглов,1978,Yes,Raw,D
2,Aleksey Aleksandrov,Open,81,,,,,,,,,,,207.5,-217.5,-217.5,207.5,,207.5,82.5,M,Алексей Александров,1985,Yes,Raw,D
3,Denis Akimov,Open,81,,,,,,,,,,,180,-200,-200,180,,180,82.5,M,Денис Акимов,1988,Yes,Raw,D
4,Vladimir Kulakov,Open,77,,,,,,,,,,,115,125,,125,,125,82.5,M,Владимир Кулаков,1955,Yes,Raw,D
1,Vladimir Kulakov,Masters 55-59,77,,,,,,,,,,,115,125,,125,,125,82.5,M,Владимир Кулаков,1955,Yes,Raw,D
1,Vasiliy Uzdyaev,Teen 16-17,83.7,,,,,,,,,,,200,210,222.5,222.5,,222.5,90,M,Василий Уздяев,1998,Yes,Raw,D
1,Kirill Lomanov,Open,88.5,,,,,,,,,,,270,-290,290,290,-300,290,90,M,Кирилл Ломанов,1987,Yes,Raw,D
2,Vitaliy Zheludev,Open,89.9,,,,,,,,,,,250,-260,-260,250,,250,90,M,Виталий Желудев,1986,Yes,Raw,D
1,Vladimir Dergachev,Masters 40-44,88.4,,,,,,,,,,,170,182.5,-195,182.5,,182.5,90,M,Владимир Дергачев,1972,Yes,Raw,D
DQ,Arsen Akopyan,Masters 40-44,82.9,,,,,,,,,,,-175,,,,,,90,M,Арсен Акопян,1970,Yes,Raw,D
1,Nikolay Novikov,Masters 75-79,89.4,,,,,,,,,,,165,172.5,180,180,,180,90,M,Николай Новиков,1938,Yes,Raw,D
1,Viktor Novikov,Teen 18-19,91.4,,,,,,,,,,,155,165,177.5,177.5,,177.5,100,M,Виктор Новиков,1996,Yes,Raw,D
1,Anton Ilyasov,Open,96,,,,,,,,,,,325,335,342.5,342.5,,342.5,100,M,Антон Илясов,1988,Yes,Raw,D
2,Dmitriy Kalinin,Open,95.1,,,,,,,,,,,245,247.5,-250,247.5,,247.5,100,M,Дмитрий Калинин,1970,Yes,Raw,D
3,Dmitriy Schigirev,Open,97.9,,,,,,,,,,,165,-177.5,-177.5,165,,165,100,M,Дмитрий Щигирев,1990,Yes,Raw,D
1,Dmitriy Kalinin,Masters 40-44,95.1,,,,,,,,,,,245,247.5,-250,247.5,,247.5,100,M,Дмитрий Калинин,1970,Yes,Raw,D
2,Sergey Malanichev,Masters 40-44,98.2,,,,,,,,,,,192.5,-202.5,-202.5,192.5,,192.5,100,M,Сергей Маланичев,1971,Yes,Raw,D
1,Ruslan Kulebyakin,Juniors 20-23,105.1,,,,,,,,,,,245,255,265,265,,265,110,M,Руслан Кулебякин,1991,Yes,Raw,D
1,Kirill Shupinskiy,Open,105.6,,,,,,,,,,,240,260,265,265,,265,110,M,Кирилл Шупинский,1987,Yes,Raw,D
1,Sergey Bulaev,Masters 40-44,105.7,,,,,,,,,,,240,-245,,240,,240,110,M,Сергей Булаев,1972,Yes,Raw,D
2,Sergey Evdokushin,Masters 40-44,104.5,,,,,,,,,,,215,227.5,-240,227.5,,227.5,110,M,Сергей Евдокушин,1974,Yes,Raw,D
1,Aleksey Kladovschikov,Masters 45-49,109.5,,,,,,,,,,,-190,200,210,210,,210,110,M,Алексей Кладовщиков,1969,Yes,Raw,D
1,Galina Bocharova,Juniors 20-23,59.1,,,,,,,,,,,85,97.5,102.5,102.5,,102.5,60,F,Галина Бочарова,1992,No,Raw,D
1,Irina Yaroshenko,Open,91,,,,,,,,,,,180,-197.5,,180,,180,100,F,Ирина Ярошенко,1986,No,Raw,D
1,Evgeniy Shuvalov,Open,72.9,,,,,,,,,,,187.5,200,-210,200,,200,75,M,Евгений Шувалов,1983,No,Raw,D
1,Ilya Katigaridi,Teen 16-17,82.5,,,,,,,,,,,195,200,,200,,200,82.5,M,Илья Катигариди,1997,No,Raw,D
1,Vasiliy Bank,Juniors 20-23,80.9,,,,,,,,,,,227.5,255,-265,255,,255,82.5,M,Василий Банк,1992,No,Raw,D
2,Maksim Pisarevskiy,Juniors 20-23,76.7,,,,,,,,,,,200,-227.5,-227.5,200,,200,82.5,M,Максим Писаревский,1991,No,Raw,D
1,Aleksey Nikulin #1,Open,81,,,,,,,,,,,-305,305,-317.5,305,,305,82.5,M,Алексей Никулин,1982,No,Raw,D
2,Grigoriy Evstigneev,Open,82.4,,,,,,,,,,,-230,230,240,240,,240,82.5,M,Григорий Евстигнеев,1987,No,Raw,D
1,Egor Sharov,Juniors 20-23,84.8,,,,,,,,,,,160,-175,-175,160,,160,90,M,Егор Шаров,1993,No,Raw,D
1,Kirill Tsaparov,Open,85.1,,,,,,,,,,,290,305,-312.5,305,,305,90,M,Кирилл Цапаров,1984,No,Raw,D
2,Gennadiy Zotov,Open,89.4,,,,,,,,,,,265,275,-282.5,275,,275,90,M,Геннадій Зотов,1985,No,Raw,D
3,Ilya Lebedev,Open,89.5,,,,,,,,,,,240,265,-272.5,265,,265,90,M,Илья Лебедев,1972,No,Raw,D
1,Ilya Lebedev,Masters 40-44,89.5,,,,,,,,,,,240,265,-272.5,265,,265,90,M,Илья Лебедев,1972,No,Raw,D
1,Evgeniy Dmitriev,Juniors 20-23,98.7,,,,,,,,,,,250,-277.5,277.5,277.5,,277.5,100,M,Евгений Дмитриев,1993,No,Raw,D
2,Nikita Romanov,Juniors 20-23,90.1,,,,,,,,,,,205,220,240,240,,240,100,M,Никита Романов,1991,No,Raw,D
1,Aleksandr Mokin,Open,98.8,,,,,,,,,,,215,225,-240,225,,225,100,M,Александр Мокин,1978,No,Raw,D
1,Valeriy Sytnikov,Masters 40-44,99.5,,,,,,,,,,,250,270,-277.5,270,,270,100,M,Валерий Сытников,1970,No,Raw,D
2,Dmitriy Postnov,Masters 40-44,92.6,,,,,,,,,,,200,220,235,235,,235,100,M,Дмитрий Постнов,1971,No,Raw,D
1,Grigoriy Bebenin,Juniors 20-23,108.9,,,,,,,,,,,280,290,300,300,,300,110,M,Григорий Бебенин,1993,No,Raw,D
1,Aleksey Smirnov,Open,104,,,,,,,,,,,260,270,280,280,,280,110,M,Алексей Смирнов,1977,No,Raw,D
2,Sergey Mishenin,Open,100.5,,,,,,,,,,,210,-220,225,225,,225,110,M,Сергей Мишенин,1978,No,Raw,D
1,Andrey Burakov,Masters 55-59,101.7,,,,,,,,,,,210,-220,220,220,,220,110,M,Андрей Бураков,1958,No,Raw,D
1,Vadim Pchelkin,Masters 40-44,118.9,,,,,,,,,,,230,250,270,270,,270,125,M,Вадим Пчелкин,1971,No,Raw,D
1,Viktor Krylov,Open,129.3,,,,,,,,,,,280,302.5,-310,302.5,,302.5,140,M,Виктор Крылов,1985,No,Raw,D
1,Konstantin Sapunkov,Open,81.7,,,,,,,,,,,265,275,-280,275,,275,82.5,M,Константин Сапунков,1981,Yes,Multi-ply,D
2,Vladimir Kulakov,Open,77,,,,,,,,,,,117.5,125,,125,,125,82.5,M,Владимир Кулаков,1955,Yes,Multi-ply,D
1,Vladimir Kulakov,Masters 55-59,77,,,,,,,,,,,117.5,125,,125,,125,82.5,M,Владимир Кулаков,1955,Yes,Multi-ply,D
1,Igor Umerenkov,Open,89.9,,,,,,,,,,,300,317.5,,317.5,,317.5,90,M,Игорь Умеренков,1980,Yes,Multi-ply,D
1,Alexander Krovikov,Masters 50-54,100,,,,,,,,,,,260,280,-292.5,280,,280,100,M,Александр Кровиков,1961,Yes,Multi-ply,D
1,Artem Artyukhov,Open,110,,,,,,,,,,,262.5,-267.5,,262.5,,262.5,110,M,Артем Артюхов,1987,Yes,Multi-ply,D
1,Kristina Chudnova,Juniors 20-23,54.5,,,,,,,,,,,-132.5,140,145,145,,145,56,F,Кристина Чуднова,1994,No,Multi-ply,D
1,Nikita Maksimov,Open,67.3,,,,,,,,,,,220,230,-235,230,,230,67.5,M,Никита Максимов,1990,No,Multi-ply,D
1,Aleksey Nikolaev,Open,84.2,,,,,,,,,,,270,-280,280,280,,280,90,M,Алексей Николаев,1984,No,Multi-ply,D
1,Egor Makarov,Open,94.5,,,,,,,,,,,160,200,210,210,,210,100,M,Егор Макаров,1984,No,Multi-ply,D
1,Dmitriy Yakovlev,Open,103.5,,,,,,,,,,,-275,275,,275,,275,110,M,Дмитрий Яковлев,1984,No,Multi-ply,D
1,Vasiliy Voropaev,Masters 55-59,108,,,,,,,,,,,210,-230,230,230,,230,110,M,Василий Воропаев,1956,No,Multi-ply,D
1,Ilya Potolitsyn,Juniors 20-23,121.5,,,,,,,,,,,250,270,290,290,,290,125,M,Илья Потолицын,1991,No,Multi-ply,D
