Tested,Equipment,Place,Name,Division,BirthYear,Country,BodyweightKg,Squat1Kg,Squat2Kg,Squat3Kg,Best3SquatKg,Bench1Kg,Bench2Kg,Bench3Kg,Best3BenchKg,Deadlift1Kg,Deadlift2Kg,Deadlift3Kg,Best3DeadliftKg,TotalKg,WeightClassKg,Sex,CyrillicName,Event,Bench4Kg,Deadlift4Kg
Yes,Raw,1,Yuliya Katalova,Amateur Open,1980,Russia,43.4,-60,62.5,67.5,67.5,35,40,-42.5,40,65,70,75,75,182.5,44,F,Юлия Каталова,SBD,,
Yes,Raw,2,Natalya Kondrashova,Amateur Open,1988,Russia,43.7,-50,50,-70,50,30,35,-40,35,50,65,72.5,72.5,157.5,44,F,Наталья Кондрашова,SBD,,
Yes,Raw,1,Yuliya Shilova,Amateur Open,1984,Russia,47.5,72.5,77.5,80,80,40,45,47.5,47.5,95,-102.5,-105,95,222.5,48,F,Юлия Шилова,SBD,,
Yes,Raw,2,Viktoriya Avdeenko,Amateur Open,1991,Russia,47.4,55,-60,60,60,42.5,-47.5,-47.5,42.5,65,75,85,85,187.5,48,F,Виктория Авдеенко,SBD,,
Yes,Raw,3,Evgeniya Astafyeva,Amateur Open,1982,Russia,47,50,55,60,60,30,-35,35,35,55,-60,60,60,155,48,F,Евгения Астафьева,SBD,,
Yes,Raw,DQ,Anna Yusupova,Amateur Open,1988,Russia,46.7,-70,-70,-70,,,,,,,,,,,48,F,Анна Юсупова,SBD,,
Yes,Raw,DQ,Viktoriya Shpaykher,Amateur Teen 13-15,1997,Russia,51.1,-55,-55,-55,,,,,,,,,,,52,F,Виктория Шпайхер,SBD,,
Yes,Raw,1,Olga Razdorozhnaya,Amateur Juniors 20-23,1990,Russia,51,60,70,-80,70,35,40,45,45,65,-75,75,75,190,52,F,Ольга Раздорожная,SBD,,
Yes,Raw,1,Tatyana Grafova,Amateur Open,1981,Russia,51.4,82.5,87.5,92.5,92.5,45,-50,52.5,52.5,125,130,135,135,280,52,F,Татьяна Графова,SBD,,
Yes,Raw,2,Liliya Kinzhagulova,Amateur Open,1973,Russia,50,55,65,72.5,72.5,47.5,52.5,55,55,80,100,112.5,112.5,240,52,F,Лилия Кинжагулова,SBD,,
Yes,Raw,3,Zarina Chikina,Amateur Open,1986,Russia,49.7,-60,60,-70,60,35,40,-42.5,40,-85,90,97.5,97.5,197.5,52,F,Зарина Чикина,SBD,,
Yes,Raw,4,Lidiya Sedova,Amateur Open,1988,Russia,51.6,-60,60,-70,60,35,40,-42.5,40,70,80,-85,80,180,52,F,Лидия Седова,SBD,,
Yes,Raw,1,Liliya Kinzhagulova,Amateur Masters 40-44,1973,Russia,50,55,65,72.5,72.5,47.5,52.5,55,55,80,100,112.5,112.5,240,52,F,Лилия Кинжагулова,SBD,,
Yes,Raw,1,Lyubov Terekhova,Amateur Open,1980,Russia,53.5,85,95,-100,95,47.5,52.5,-55,52.5,95,110,112.5,112.5,260,56,F,Любовь Терехова,SBD,,
Yes,Raw,2,Evgeniya Ryzhkova,Amateur Open,1989,Russia,53,80,90,-95,90,45,50,-52.5,50,90,100,-117.5,100,240,56,F,Евгения Рыжкова,SBD,,
Yes,Raw,1,Larisa Kolesnikova,Amateur Juniors 20-23,1990,Russia,58.4,95,105,-107.5,105,50,55,-57.5,55,110,120,-130,120,280,60,F,Лариса Колесникова,SBD,,
Yes,Raw,2,Anna Kozhukhar,Amateur Juniors 20-23,1990,Russia,60,90,97.5,-102.5,97.5,52.5,-57.5,57.5,57.5,110,-115,-115,110,265,60,F,Анна Кожухарь,SBD,,
Yes,Raw,3,Irina Karpova,Amateur Juniors 20-23,1989,Russia,58.85,92.5,100,-105,100,55,-60,-60,55,97.5,-105,-105,97.5,252.5,60,F,Ирина Карпова,SBD,,
Yes,Raw,1,Anna Kutina,Amateur Open,1978,Russia,59,102.5,-105,105,105,62.5,65,70,70,130,135,140,140,315,60,F,Анна Кутьина,SBD,,
Yes,Raw,2,Yuliya Kurova,Amateur Open,1981,Russia,59.9,75,-82.5,82.5,82.5,-40,40,42.5,42.5,70,77.5,-82.5,77.5,202.5,60,F,Юлия Курова,SBD,,
Yes,Raw,3,Ekaterina Yunak,Amateur Open,1986,Russia,58.1,50,57.5,62.5,62.5,40,45,47.5,47.5,60,67.5,72.5,72.5,182.5,60,F,Екатерина Юнак,SBD,,
Yes,Raw,1,Galina Kalinina,Amateur Open,1981,Russia,67.4,-120,120,125,125,65,70,75,75,145,-155,-155,145,345,67.5,F,Галина Калинина,SBD,,
Yes,Raw,2,Valeriya Ippolitova,Amateur Open,1983,Russia,63.7,-80,85,90,90,45,50,-52.5,50,85,92.5,97.5,97.5,237.5,67.5,F,Валерия Ипполитова,SBD,,
Yes,Raw,3,Anna Kuznetsova,Amateur Open,1984,Russia,61.4,80,-90,-90,80,47.5,50,-55,50,-85,90,95,95,225,67.5,F,Анна Кузнецова,SBD,,
Yes,Raw,4,Anastasiya Frolova,Amateur Open,1981,Russia,66.3,-50,60,-75,60,40,-50,-50,40,60,80,90,90,190,67.5,F,Анастасия Фролова,SBD,,
Yes,Raw,DQ,Elena Bugakova,Amateur Open,1985,Russia,64.8,85,-95,95,95,52.5,-60,-60,52.5,-130,-130,-130,,,67.5,F,Елена Бугакова,SBD,,
Yes,Raw,1,Lyubov Golenkova,Amateur Juniors 20-23,1991,Russia,67.9,65,70,75,75,37.5,40,-42.5,40,75,85,100,100,215,75,F,Любовь Голенкова,SBD,,
Yes,Raw,1,Olga Karkischenko,Amateur Open,1983,Russia,73,100,110,117.5,117.5,60,-65,-65,60,100,107.5,-110,107.5,285,75,F,Ольга Каркищенко,SBD,,
Yes,Raw,2,Elena Davydova,Amateur Open,1973,Russia,72.5,80,-85,-85,80,50,55,-60,55,110,115,,115,250,75,F,Елена Давыдова,SBD,,
Yes,Raw,1,Ekaterina Mamicheva,Amateur Open,1979,Russia,79.6,80,95,-105,95,55,62.5,67.5,67.5,125,135,147.5,147.5,310,82.5,F,Екатерина Мамичева,SBD,,
Yes,Raw,2,Oksana Novikova,Amateur Open,1984,Russia,76.9,-95,95,-105,95,55,60,65,65,100,115,120,120,280,82.5,F,Оксана Новикова,SBD,,
Yes,Raw,3,Kseniya Safronova,Amateur Open,1986,Russia,78.6,82.5,-87.5,87.5,87.5,40,45,-50,45,95,105,115,115,247.5,82.5,F,Ксения Сафронова,SBD,,
Yes,Raw,1,Irina Yaroshenko,Amateur Open,1986,Russia,98,150,160,170,170,90,97.5,102.5,102.5,185,205,-217.5,205,477.5,90+,F,Ирина Ярошенко,SBD,,
Yes,Raw,1,Evgeniy Pleshkov,Amateur Teen 16-17,1995,Russia,55.3,95,100,105,105,57.5,62.5,-65,62.5,120,133,135,135,302.5,56,M,Евгений Плешков,SBD,,
Yes,Raw,1,Grigoriy Kapustin,Amateur Teen 13-15,1998,Russia,58.1,70,75,80,80,42.5,47.5,50,50,90,97.5,102.5,102.5,232.5,60,M,Григорий Капустин,SBD,,
Yes,Raw,1,Andrey Panov,Amateur Open,1976,Russia,60,97.5,105,-107.5,105,90,97.5,-102.5,97.5,140,150,157.5,157.5,360,60,M,Андрей Панов,SBD,,
Yes,Raw,1,Miroslav Bakhtinov,Amateur Teen 16-17,1997,Russia,62.4,100,110,115,115,70,75,-77.5,75,130,140,150,150,340,67.5,M,Мирослав Бахтинов,SBD,,
Yes,Raw,1,Aleksandr Lukin,Amateur Teen 18-19,1995,Russia,65,130,-145,155,155,95,105,112.5,112.5,145,160,172.5,172.5,440,67.5,M,Александр Лукин,SBD,,
Yes,Raw,1,Vladimir Avdeev,Amateur Juniors 20-23,1992,Russia,62.9,75,85,95,95,57.5,62.5,67.5,67.5,90,100,110,110,272.5,67.5,M,Владимир Авдеев,SBD,,
Yes,Raw,DQ,Amiran Dzutsev,Amateur Open,1986,Russia,66.6,130,140,-150,140,110,115,117.5,117.5,150,160,-165,160,,67.5,M,Амиран Дзуцев,SBD,,
Yes,Raw,1,Dmitriy Kovalenko,Amateur Masters 40-44,1972,Russia,66.3,72.5,75,80,80,72.5,75,77.5,77.5,110,115,117.5,117.5,275,67.5,M,Дмитрий Коваленко,SBD,,
Yes,Raw,1,Georgiy Kovalevskiy,Amateur Teen 13-15,1997,Russia,72.3,-145,145,155,155,85,92.5,-100,92.5,155,165,180,180,427.5,75,M,Георгий Ковалевский,SBD,,
Yes,Raw,1,Vladimir Pechenkov,Amateur Teen 18-19,1994,Russia,72.5,140,-147.5,-147.5,140,100,105,107.5,107.5,180,187.5,192.5,192.5,440,75,M,Владимир Печенков,SBD,,
Yes,Raw,2,Kirill Lebedkin,Amateur Teen 18-19,1995,Russia,71.9,-120,130,-140,130,70,80,-90,80,140,150,-170,150,360,75,M,Кирилл Лебедкин,SBD,,
Yes,Raw,DQ,Pavel Kolosov,Amateur Teen 18-19,1994,Russia,70.45,-130,-137.5,-142.5,,,,,,,,,,,75,M,Павел Колосов,SBD,,
Yes,Raw,1,Aleksandr Krasutskiy,Amateur Juniors 20-23,1990,Russia,73.8,165,172.5,180,180,132.5,137.5,142.5,142.5,210,232.5,235,235,557.5,75,M,Александр Красуцкий,SBD,,
Yes,Raw,2,Mikhail Vorobyev,Amateur Juniors 20-23,1990,Russia,74.75,165,175,180,180,145,150,155,155,210,222.5,-227.5,222.5,557.5,75,M,Михаил Воробьев,SBD,,
Yes,Raw,3,Aleksey Karaulov,Amateur Juniors 20-23,1990,Russia,72.4,125,135,-145,135,80,-90,90,90,150,165,-177.5,165,390,75,M,Алексей Караулов,SBD,,
Yes,Raw,1,Aleksey Solovyev #2,Amateur Open,1988,Russia,72.8,170,180,185,185,135,145,-150,145,220,230,-240,230,560,75,M,Алексей Соловьев,SBD,,
Yes,Raw,2,Dmitriy Gromov,Amateur Open,1987,Russia,71.4,150,160,170,170,107.5,115,125,125,180,190,200,200,495,75,M,Дмитрий Громов,SBD,,
Yes,Raw,3,Dmitriy Polivanov,Amateur Open,1975,Russia,73.9,130,140,-150,140,110,115,117.5,117.5,150,170,175,175,432.5,75,M,Дмитрий Поливанов,SBD,,
Yes,Raw,4,Ilya Razuvaev,Amateur Open,1982,Russia,74.6,140,-150,150,150,-110,110,-115,110,150,165,-175,165,425,75,M,Илья Разуваев,SBD,,
Yes,Raw,5,Petr Kutilov,Amateur Open,1986,Russia,68.8,-115,115,132.5,132.5,85,92.5,100,100,140,160,-167.5,160,392.5,75,M,Петр Кутилов,SBD,,
Yes,Raw,1,Aleksey Boyko,Amateur Masters 40-44,1971,Russia,72.1,-87.5,95,105,105,100,110,115,115,100,115,130,130,350,75,M,Алексей Бойко,SBD,,
Yes,Raw,1,Vladimir Ermokhin,Amateur Masters 50-54,1961,Russia,74.1,-100,100,110,110,95,100,102.5,102.5,150,160,170,170,382.5,75,M,Владимир Ермохин,SBD,,
Yes,Raw,1,Vladimir Kulakov,Amateur Masters 55-59,1955,Russia,75,95,102.5,,102.5,85,92.5,,92.5,115,127.5,,127.5,322.5,75,M,Владимир Кулаков,SBD,,
Yes,Raw,1,Viktor Popov #3,Amateur Masters 60-64,1952,Russia,74.4,135,145,150,150,75,80,-82.5,80,195,202.5,205,205,435,75,M,Виктор Попов,SBD,,
Yes,Raw,1,Artem Ivankov #1,Amateur Teen 13-15,1998,Russia,81,100,110,117.5,117.5,80,90,95,95,110,122.5,127.5,127.5,340,82.5,M,Артем Иваньков,SBD,,
Yes,Raw,1,Sergey Delianidi,Amateur Teen 16-17,1996,Russia,78.2,140,150,160,160,110,115,120,120,205,215,225,225,505,82.5,M,Сергей Делианиди,SBD,,
Yes,Raw,DQ,Vitaliy Ignatov,Amateur Teen 16-17,1995,Russia,80,-165,-165,-165,,,,,,,,,,,82.5,M,Виталий Игнатов,SBD,,
Yes,Raw,1,Aleksey Kryukov,Amateur Teen 18-19,1995,Russia,81.8,120,130,-140,130,90,95,100,100,130,145,155,155,385,82.5,M,Алексей Крюков,SBD,,
Yes,Raw,1,Dmitriy Pavlov,Amateur Juniors 20-23,1991,Russia,80,195,202.5,,202.5,-160,-160,160,160,240,-260,-267.5,240,602.5,82.5,M,Дмитрий Павлов,SBD,,
Yes,Raw,2,Sherzot Zhuraev,Amateur Juniors 20-23,1990,Russia,80.8,167.5,175,-177.5,175,110,115,-122.5,115,170,180,190,190,480,82.5,M,Шерзот Жураев,SBD,,
Yes,Raw,3,Nikolay Dokuchaev,Amateur Juniors 20-23,1992,Russia,79.1,140,152.5,162.5,162.5,105,-112.5,-112.5,105,180,202.5,-212.5,202.5,470,82.5,M,Николай Докучаев,SBD,,
Yes,Raw,4,Sergey Bobylev,Amateur Juniors 20-23,1990,Russia,77.5,140,150,-155,150,80,85,90,90,160,175,180,180,420,82.5,M,Сергей Бобылев,SBD,,
Yes,Raw,1,Sergey Koptelov,Amateur Open,1988,Russia,81.3,165,180,-187.5,180,135,142.5,-145,142.5,220,-245,245,245,567.5,82.5,M,Сергей Коптелов,SBD,,
Yes,Raw,2,Konstantin Sapunkov,Amateur Open,1981,Russia,82.5,190,195,-200,195,135,-142.5,-142.5,135,190,-215,,190,520,82.5,M,Константин Сапунков,SBD,,
Yes,Raw,3,Andrey Karpov,Amateur Open,1985,Russia,82,175,-182.5,-187.5,175,125,-135,135,135,185,200,207.5,207.5,517.5,82.5,M,Андрей Карпов,SBD,,
Yes,Raw,4,Sergey Stepanov,Amateur Open,1988,Russia,79.4,165,170,175,175,110,115,-120,115,210,220,-225,220,510,82.5,M,Сергей Степанов,SBD,,
Yes,Raw,5,Denis Akhmetshin,Amateur Open,1987,Russia,78,150,160,165,165,107.5,115,120,120,160,170,180,180,465,82.5,M,Денис Ахметшин,SBD,,
Yes,Raw,6,Ilya Yunak,Amateur Open,1987,Russia,79.3,130,145,-155,145,105,-112.5,-112.5,105,165,175,180,180,430,82.5,M,Илья Юнак,SBD,,
Yes,Raw,DQ,Dmitriy Timofeev,Amateur Open,1987,Russia,78.1,-210,-210,-210,,,,,,,,,,,82.5,M,Дмитрий Тимофеев,SBD,,
Yes,Raw,DQ,Vasiliy Perov,Amateur Open,1979,Russia,81.2,-205,-205,-205,,,,,,,,,,,82.5,M,Василий Перов,SBD,,
Yes,Raw,1,Viktor Skokin,Amateur Masters 55-59,1957,Russia,80.5,140,145,150,150,90,95,-100,95,222.5,230,235,235,480,82.5,M,Виктор Скокин,SBD,,
Yes,Raw,2,Vyacheslav Chevordaev,Amateur Masters 65-69,1948,Russia,81.9,180,190,-192.5,190,92.5,-97.5,,92.5,150,180,200,200,482.5,82.5,M,Вячеслав Чевордаев,SBD,,
Yes,Raw,1,Artem Sumnikov,Amateur Teen 18-19,1995,Russia,88.4,-160,165,172.5,172.5,95,100,105,105,192.5,-200,200,200,477.5,90,M,Артем Сумников,SBD,,
Yes,Raw,1,Artemiy Kukoev,Amateur Juniors 20-23,1991,Russia,89.4,210,225,-230,225,140,150,-155,150,250,-270,-270,250,625,90,M,Артемий Кукоев,SBD,,
Yes,Raw,2,Anatoliy Eremin,Amateur Juniors 20-23,1991,Russia,88.7,185,202.5,-210,202.5,155,165,172.5,172.5,215,227.5,-235,227.5,602.5,90,M,Анатолий Еремин,SBD,,
Yes,Raw,1,Sergey Kolotvin,Amateur Open,1985,Russia,90,225,237.5,-242.5,237.5,-187.5,197.5,202.5,202.5,272.5,-287.5,-287.5,272.5,712.5,90,M,Сергей Колотвин,SBD,,
Yes,Raw,2,Sergey Larionov,Amateur Open,1975,Russia,90,180,187.5,-195,187.5,125,135,145,145,200,230,260,260,592.5,90,M,Сергей Ларионов,SBD,,
Yes,Raw,3,Vadim Miruschenko,Amateur Open,1987,Russia,88.4,135,140,150,150,-120,120,-125,120,170,180,195,195,465,90,M,Вадим Мирущенко,SBD,,
Yes,Raw,4,Aleksandr Ezhov,Amateur Open,1977,Russia,84.2,-150,155,162.5,162.5,100,110,-115,110,160,175,185,185,457.5,90,M,Александр Ежов,SBD,,
Yes,Raw,5,Anton Shvedov,Amateur Open,1986,Russia,87.2,130,140,150,150,100,-110,110,110,170,180,185,185,445,90,M,Антон Шведов,SBD,,
Yes,Raw,6,Andrey Kolesnikov,Amateur Open,1988,Russia,90,135,142.5,147.5,147.5,90,97.5,-102.5,97.5,160,167.5,172.5,172.5,417.5,90,M,Андрей Колесников,SBD,,
Yes,Raw,DQ,Aleksey Kholkovskiy,Amateur Open,1974,Russia,88,-190,-190,-190,,,,,,,,,,,90,M,Алексей Холковский,SBD,,
Yes,Raw,1,Mikhail Kozachuk,Amateur Masters 45-49,1963,Russia,87.3,95,100,110,110,70,72.5,75,75,130,140,-145,140,325,90,M,Михаил Козачук,SBD,,
Yes,Raw,1,Nikolay Novikov,Amateur Masters 75-79,1938,Russia,88.2,90,110,115,115,105,110,-115,110,140,150,160,160,385,90,M,Николай Новиков,SBD,,
Yes,Raw,DQ,Nikita Golovan,Amateur Teen 16-17,1996,Russia,97.1,-130,-140,-140,,,,,,,,,,,100,M,Никита Головань,SBD,,
Yes,Raw,1,Artem Bezpalenko,Amateur Juniors 20-23,1990,Russia,99.7,160,-190,195,195,140,150,155,155,220,240,-255,240,590,100,M,Артем Безпаленко,SBD,,
Yes,Raw,2,Nikolay Silkin,Amateur Juniors 20-23,1992,Russia,97.6,-170,180,-190,180,135,-140,145,145,200,210,222.5,222.5,547.5,100,M,Николай Силкин,SBD,,
Yes,Raw,3,Dmitriy Sviridov,Amateur Juniors 20-23,1992,Russia,99.5,-170,170,-180,170,135,-140,-140,135,200,215,-235,215,520,100,M,Дмитрий Свиридов,SBD,,
Yes,Raw,1,Anton Ilyasov,Amateur Open,1988,Russia,92.9,-200,210,225,225,135,-145,-145,135,290,305,-320,305,665,100,M,Антон Илясов,SBD,,
Yes,Raw,2,Pavel Shtatnov,Amateur Open,1980,Russia,99.8,210,220,230,230,155,-160,-160,155,260,-270,-270,260,645,100,M,Павел Штатнов,SBD,,
Yes,Raw,3,Aleksey Vorotnikov,Amateur Open,1980,Russia,97.4,-205,210,217.5,217.5,135,140,-145,140,210,220,227.5,227.5,585,100,M,Алексей Воротников,SBD,,
Yes,Raw,4,Dmitriy Shuyskiy,Amateur Open,1976,Russia,97,190,195,,195,135,-145,145,145,215,225,-232.5,225,565,100,M,Дмитрий Шуйский,SBD,,
Yes,Raw,5,Maksim Terekhov,Amateur Open,1989,Russia,96.3,160,175,185,185,115,122.5,130,130,160,170,187.5,187.5,502.5,100,M,Максим Терехов,SBD,,
Yes,Raw,6,Ruslan Novikov,Amateur Open,1988,Russia,97.2,135,140,145,145,110,115,-120,115,165,172.5,180,180,440,100,M,Руслан Новиков,SBD,,
Yes,Raw,7,Artem Ushakov,Amateur Open,1986,Russia,97.5,205,215,-220,215,130,-135,-135,130,230,240,-245,240,585,100,M,Артем Ушаков,SBD,,
Yes,Raw,1,Aleksandr Mishustin,Amateur Masters 45-49,1964,Russia,97.4,155,-170,170,170,130,142.5,147.5,147.5,175,195,-205,195,512.5,100,M,Александр Мишустин,SBD,,
Yes,Raw,1,Nikolay Dergachev,Amateur Masters 50-54,1960,Russia,99.7,-180,-180,180,180,145,150,152.5,152.5,200,210,-220,210,542.5,100,M,Николай Дергачев,SBD,,
Yes,Raw,1,Aleksandr Lokotkov,Amateur Teen 18-19,1995,Russia,101.55,95,105,110,110,105,110,117.5,117.5,140,160,-170,160,387.5,110,M,Александр Локотков,SBD,,
Yes,Raw,1,Andrey Shevchenko,Amateur Open,1986,,104.7,210,220,230,230,160,170,-177.5,170,265,275,285,285,685,110,M,,SBD,,
Yes,Raw,2,Stanislav Karpov,Amateur Open,1982,Russia,105.1,195,210,215,215,150,160,-165,160,240,250,260,260,635,110,M,Станислав Карпов,SBD,,
Yes,Raw,3,Sergey Oleynikov,Amateur Open,1981,Russia,108.5,180,185,190,190,150,155,160,160,210,220,225,225,575,110,M,Сергей Олейников,SBD,,
Yes,Raw,1,Sergey Ushakov,Amateur Masters 40-44,1971,Russia,102.3,150,160,170,170,-120,125,-130,125,180,190,200,200,495,110,M,Сергей Ушаков,SBD,,
Yes,Raw,1,Maksim Kuchin,Amateur Teen 18-19,1995,Russia,116.6,180,-195,-210,180,150,160,-165,160,225,240,250,250,590,125,M,Максим Кучин,SBD,,
Yes,Raw,1,Evgeniy Baranov,Amateur Open,1982,Russia,117,265,-275,-280,265,185,195,-200,195,280,295,310,310,770,125,M,Евгений Баранов,SBD,,
Yes,Raw,2,Konstantin Agureev,Amateur Open,1975,Russia,121.2,-200,220,-230,220,150,-157.5,-157.5,150,240,250,260,260,630,125,M,Константин Агуреев,SBD,,
Yes,Raw,1,Aleksandr Zorikhin,Amateur Teen 13-15,1997,Russia,130.5,112.5,120,125,125,82.5,92.5,97.5,97.5,-135,135,142.5,142.5,365,140,M,Александр Зорихин,SBD,,
Yes,Raw,1,Nikolay Markin,Amateur Open,1981,Russia,126,240,255,,255,167.5,-175,-175,167.5,265,275,-290,275,697.5,140,M,Николай Маркин,SBD,,
Yes,Single-ply,1,Rail Albikov,Amateur Open,1989,Russia,74.9,-195,,195,195,135,140,147.5,147.5,185,200,207.5,207.5,550,75,M,Раиль Альбиков,SBD,,
Yes,Single-ply,1,Vladimir Kulakov,Amateur Open,1955,Russia,75,100,110,115,115,85,,,85,117.5,130,,130,330,75,M,Владимир Кулаков,SBD,,
Yes,Single-ply,1,Vladimir Kulakov,Amateur Masters 55-59,1955,Russia,75,100,110,115,115,85,,,85,117.5,130,,130,330,75,M,Владимир Кулаков,SBD,,
Yes,Single-ply,1,Valeriy Seleznev,Amateur Juniors 20-23,1993,Russia,81.4,180,190,200,200,120,130,-137.5,130,190,-200,-200,190,520,82.5,M,Валерий Селезнев,SBD,,
Yes,Single-ply,1,Aleksey Selischev,Amateur Open,1978,Russia,82,180,-190,-192.5,180,100,-107.5,-107.5,100,180,192.5,200,200,480,82.5,M,Алексей Селищев,SBD,,
Yes,Single-ply,DQ,Ivan Rak,Amateur Open,1974,Russia,84.8,-165,-170,-185,,,,,,,,,,,90,M,Иван Рак,SBD,,
Yes,Single-ply,1,Nikolay Novikov,Amateur Masters 75-79,1938,Russia,88.2,90,,,90,100,,,100,140,150,162.5,162.5,352.5,90,M,Николай Новиков,SBD,,
Yes,Single-ply,1,Denis Demkin,Amateur Open,1979,Russia,107.5,220,-235,240,240,170,-175,-175,170,180,200,-235,200,610,110,M,Денис Демкин,SBD,,
Yes,Single-ply,1,Andrey Drozhzhin,Amateur Open,1977,Russia,112.9,275,290,300,300,165,175,-180,175,240,255,265,265,740,125,M,Андрей Дрожжин,SBD,,
Yes,Single-ply,1,Aleksey Podgorbunskiy,Amateur Juniors 20-23,1992,Russia,130.4,-200,200,215,215,170,185,-195,185,-230,230,-260,230,630,140,M,Алексей Подгорбунский,SBD,,
Yes,Multi-ply,DQ,Aleksey Kryukov,Amateur Open,1985,Russia,77.3,-150,,-155,,,,,,,,,,,82.5,M,Алексей Крюков,SBD,,
Yes,Multi-ply,1,Evgeniy Pivovarov,Amateur Open,1988,Russia,84.9,280,290,300,300,190,-200,200,200,250,260,272.5,272.5,772.5,90,M,Евгений Пивоваров,SBD,,
Yes,Multi-ply,2,Sergey Polyakov,Amateur Masters 40-44,1972,Russia,88,-190,190,-200,190,130,140,-145,140,180,195,205,205,535,90,M,Сергей Поляков,SBD,,
Yes,Multi-ply,1,Ilya Filippov,Amateur Juniors 20-23,1993,Russia,99.7,250,-260,-260,250,180,200,205,205,260,270,-280,270,725,100,M,Илья Филиппов,SBD,,
No,Raw,1,Tamara Mischenko,Pro Open,1988,Russia,50.7,65,70,75,75,32.5,37.5,-40,37.5,75,82.5,-85,82.5,195,52,F,Тамара Мищенко,SBD,,
No,Raw,1,Alena Sotnikova,Pro Open,1989,Russia,54.3,90,-100,100,100,50,-55,55,55,90,100,110,110,265,56,F,Алена Сотникова,SBD,,
No,Raw,2,Olga Savritskaya,Pro Open,1979,Russia,54.4,-85,90,-95,90,45,50,-52.5,50,85,95,100,100,240,56,F,Ольга Саврицкая,SBD,,
No,Raw,1,Mariya Nekrasova,Pro Open,1989,Russia,56.8,80,85,90,90,-45,45,-47.5,45,107.5,112.5,117.5,117.5,252.5,60,F,Мария Некрасова,SBD,,
No,Raw,DQ,Kseniya Lavrova,Pro Teen 18-19,1995,Russia,66.7,-100,-100,-100,,,,,,,,,,,67.5,F,Ксения Лаврова,SBD,,
No,Raw,1,Alina Fadeeva,Pro Open,1988,Russia,67.4,110,120,,120,90,-97.5,,90,130,140,150,150,360,67.5,F,Алина Фадеева,SBD,,
No,Raw,2,Kseniya Lyapunova,Pro Open,1986,Russia,65.9,65,70,75,75,35,40,-45,40,80,85,-90,85,200,67.5,F,Ксения Ляпунова,SBD,,
No,Raw,1,Maksim Khersonskiy,Pro Teen 16-17,1996,Russia,65.3,-105,110,112.5,112.5,85,90,95,95,135,146,150,150,357.5,67.5,M,Максим Херсонский,SBD,,
No,Raw,1,Dias Dzhelilov,Pro Juniors 20-23,1993,Russia,62.65,130,140,150,150,115,122.5,,122.5,160,170,180,180,452.5,67.5,M,Диас Джелилов,SBD,,
No,Raw,2,Sadyk Danayev,Pro Juniors 20-23,1991,Russia,66,130,140,-145,140,100,-105,-105,100,-160,160,170,170,410,67.5,M,Садык Данаев,SBD,,
No,Raw,1,Nikita Vasilyev,Pro Teen 13-15,1998,Russia,73.5,100,110,120,120,65,70,-75,70,120,130,-140,130,320,75,M,Никита Васильев,SBD,,
No,Raw,1,Kirill Kotov,Pro Teen 18-19,1994,Russia,74.2,-160,-160,160,160,105,115,-125,115,180,210,-242.5,210,485,75,M,Кирилл Котов,SBD,,
No,Raw,1,Aleksandr Yakovlev,Pro Open,1982,Russia,74.4,170,-175,177.5,177.5,130,-135,-137.5,130,220,227.5,240,240,547.5,75,M,Александр Яковлев,SBD,,
No,Raw,1,Andrey Muravyev,Pro Teen 18-19,1994,Russia,79.1,-190,190,-210,190,140,-150,-150,140,240,-255,-270,240,570,82.5,M,Андрей Муравьев,SBD,,
No,Raw,1,Ragim Balakshiev,Pro Juniors 20-23,1990,Russia,81.8,200,210,215,215,140,150,155,155,230,245,252.5,252.5,622.5,82.5,M,Рагим Балакшиев,SBD,,
No,Raw,1,Aleksey Koshuba,Pro Open,1980,Russia,82,190,220,,220,130,140,-145,140,255,,,255,615,82.5,M,Алексей Кошуба,SBD,,
No,Raw,2,Yuriy Bonachev,Pro Open,1986,Russia,80.1,120,140,160,160,85,100,-110,100,150,170,190,190,450,82.5,M,Юрий Боначев,SBD,,
No,Raw,3,Dmitriy Migunov,Pro Open,1986,Russia,80.8,110,130,-150,130,85,100,110,110,130,155,185,185,425,82.5,M,Дмитрий Мигунов,SBD,,
No,Raw,4,Gleb Khloponin,Pro Open,1985,Russia,82,140,150,-160,150,-115,115,-120,115,140,150,160,160,425,82.5,M,Глеб Хлопонин,SBD,,
No,Raw,1,Yuriy Smirnov #7,Pro Teen 16-17,1995,Russia,86.9,-130,-140,140,140,90,95,102.5,102.5,140,-150,155,155,397.5,90,M,Юрий Смирнов,SBD,,
No,Raw,1,Pavel Perov,Pro Juniors 20-23,1990,Russia,87.5,180,-195,-195,180,125,135,140,140,210,250,270,270,590,90,M,Павел Перов,SBD,,
No,Raw,1,Anton Anikanov,Pro Open,1985,Russia,89.1,220,-240,-250,220,170,185,-195,185,250,-265,-265,250,655,90,M,Антон Аниканов,SBD,,
No,Raw,2,Valeriy Beloglazov,Pro Open,1981,Russia,89.8,210,-220,220,220,160,170,175,175,260,-270,-270,260,655,90,M,Валерий Белоглазов,SBD,,
No,Raw,3,Andrey Bubin,Pro Open,1981,Russia,89.9,-210,210,220,220,140,150,-155,150,230,245,-252.5,245,615,90,M,Андрей Бубин,SBD,,
No,Raw,4,Roman Kroshkin,Pro Open,1981,Russia,88.1,190,200,-210,200,140,150,-155,150,220,232.5,240,240,590,90,M,Роман Крошкин,SBD,,
No,Raw,1,Oleg Skorobreschuk,Pro Open,1977,Russia,98.7,230,240,250,250,160,170,-175,170,230,245,262.5,262.5,682.5,100,M,Олег Скоробрещук,SBD,,
No,Raw,2,Roman Terekhov,Pro Open,1981,Russia,97,200,215,225,225,135,145,152.5,152.5,215,230,237.5,237.5,615,100,M,Роман Терехов,SBD,,
No,Raw,3,Artem Kuznetsov,Pro Open,1986,Russia,97,-200,200,-220,200,140,150,,150,220,230,-240,230,580,100,M,Артем Кузнецов,SBD,,
No,Raw,DQ,Pavel Bezuglov,Pro Open,1987,Russia,94.8,-220,,-220,,,,,,,,,,,100,M,Павел Безуглов,SBD,,
No,Raw,1,Dmitriy Postnov,Pro Masters 40-44,1971,Russia,92.7,205,220,,220,142.5,152.5,-157.5,152.5,215,232.5,242.5,242.5,615,100,M,Дмитрий Постнов,SBD,,
No,Raw,1,Kirill Karpov,Pro Teen 13-15,1999,Russia,105.7,105,-115,115,115,50,60,-65,60,110,120,125,125,300,110,M,Кирилл Карпов,SBD,,
No,Raw,1,Marat Savosin,Pro Juniors 20-23,1990,Russia,105.3,250,260,-270,260,180,-190,-190,180,270,-277.5,-277.5,270,710,110,M,Марат Савосин,SBD,,
No,Raw,1,Valeriy Shumbasov,Pro Open,1982,Russia,106.4,260,275,285,285,190,200,-210,200,280,305,315,315,800,110,M,Валерий Шумбасов,SBD,,
No,Raw,2,Artem Kharin,Pro Open,1988,Russia,105.4,-225,,255,255,170,185,187.5,187.5,250,270,272.5,272.5,715,110,M,Артем Харин,SBD,,
No,Raw,3,Michael Thatcher,Pro Open,1977,Russia,108.4,235,245,250,250,155,165,170,170,255,265,275,275,695,110,M,,SBD,,
No,Raw,4,Aleksey Andreykin,Pro Open,1986,Russia,107.6,220,-240,-240,220,160,170,-180,170,-240,250,-270,250,640,110,M,Алексей Андрейкин,SBD,,
No,Raw,5,Anatoliy Khusainov,Pro Open,1978,Russia,109.4,230,240,-250,240,110,120,130,130,-260,270,-300,270,640,110,M,Анатолий Хусаинов,SBD,,
No,Raw,6,Vasiliy Shishov,Pro Open,1983,Russia,107,-150,-160,160,160,120,140,-145,140,160,170,190,190,490,110,M,Василий Шишов,SBD,,
No,Raw,1,Artem Kobanov,Pro Open,1992,Russia,110.35,270,-280,285,285,205,215,220,220,290,300,310,310,815,125,M,Артем Кобанов,SBD,,
No,Raw,DQ,Vadim Petriv,Pro Open,1981,Russia,116.6,-220,,-220,,,,,,,,,,,125,M,Вадим Петрив,SBD,,
No,Raw,1,Aleksandr Smirnov,Pro Masters 40-44,1972,Russia,118.1,-150,150,-170,150,100,-105,-105,100,180,200,205,205,455,125,M,Александр Смирнов,SBD,,
No,Single-ply,1,Evgeniy Konnov,Pro Open,1983,Russia,74.4,205,-215,-215,205,140,150,157.5,157.5,205,-215,-215,205,567.5,75,M,Евгений Коннов,SBD,,
No,Single-ply,1,Vladimir Vasilenko,Pro Open,1994,Russia,81.7,255,-270,-275,255,135,145,-150,145,-230,230,-240,230,630,82.5,M,Володимир Василенко,SBD,,
No,Single-ply,1,Andrey Semunin,Pro Open,1996,Russia,85.1,230,240,-245,240,125,135,140,140,215,-225,-225,215,595,90,M,Андрей Семунин,SBD,,
No,Single-ply,DQ,Aleksandr Evsyutkin,Pro Open,1988,Russia,96.5,220,-235,235,235,-160,-160,-160,,,,,,,100,M,Александр Евсюткин,SBD,,
No,Single-ply,1,Igor Potapov,Pro Open,1987,Russia,103.3,260,-275,-280,260,170,180,-190,180,250,270,-290,270,710,110,M,Игорь Потапов,SBD,,
No,Single-ply,DQ,Oleg Falkovskiy,Pro Open,1989,Russia,105.4,-250,-262.5,-275,,,,,,,,,,,110,M,Олег Фальковский,SBD,,
No,Single-ply,1,Viktor Zhbankov,Pro Juniors 20-23,1992,Russia,119.9,-290,-290,290,290,220,-235,240,240,300,320,-330,320,850,125,M,Виктор Жбанков,SBD,,
No,Single-ply,DQ,Vladislav Okolyshev,Pro Open,1987,Russia,112,340,-360,-360,340,-210,210,-222.5,210,320,-340,,320,,125,M,Владислав Околышев,SBD,,
No,Multi-ply,1,Aleksandr Nosov,Pro Open,1985,Russia,98.9,-260,275,-282.5,275,190,200,-210,200,260,275,,275,750,100,M,Александр Носов,SBD,,
No,Multi-ply,DQ,Denis Makeev #1,Pro Open,1983,Russia,129.8,-250,-255,-255,,,,,,,,,,,140,M,Денис Макеев,SBD,,
Yes,Raw,1,Irina Velkaya,Amateur Teen 18-19,1995,Russia,43.6,,,,,37.5,40,-42.5,40,,,,,40,44,F,Ирина Велькая,B,,
Yes,Raw,DQ,Evgeniya Zhilchenko,Amateur Open,1981,Russia,44,,,,,-30,-35,-35,,,,,,,44,F,Евгения Жильченко,B,,
Yes,Raw,1,Anastasiya Baranova,Amateur Teen 13-15,1998,Russia,48,,,,,52.5,-55,-55,52.5,,,,,52.5,48,F,Анастасия Баранова,B,,
Yes,Raw,1,Natalya Klementyeva,Amateur Open,1980,Russia,47.8,,,,,50,-52.5,-52.5,50,,,,,50,48,F,Наталья Клементьева,B,,
Yes,Raw,2,Irina Suvorova,Amateur Open,1982,Russia,46.2,,,,,45,-47.5,-50,45,,,,,45,48,F,Ирина Суворова,B,,
Yes,Raw,3,Natalya Royanova,Amateur Open,1979,Russia,47.4,,,,,40,-45,45,45,,,,,45,48,F,Наталья Роянова,B,,
Yes,Raw,1,Mariya Goryunova,Amateur Teen 16-17,1996,Russia,48.7,,,,,47.5,-50,50,50,,,,,50,52,F,Мария Горюнова,B,,
Yes,Raw,1,Marina Gorikova,Amateur Open,1983,Russia,51.8,,,,,60,62.5,-65,62.5,,,,,62.5,52,F,Марина Горикова,B,,
Yes,Raw,2,Lyudmila Mikhaleva,Amateur Open,1979,Russia,52,,,,,52.5,55,-57.5,55,,,,,55,52,F,Людмила Михалева,B,,
Yes,Raw,1,Yuliya Teplaya,Amateur Juniors 20-23,1990,Russia,56,,,,,40,42.5,45,45,,,,,45,56,F,Юлия Теплая,B,,
Yes,Raw,DQ,Yuliya Arsentyeva,Amateur Juniors 20-23,1990,Russia,54,,,,,-55,-55,-55,,,,,,,56,F,Юлия Арсентьева,B,,
Yes,Raw,1,Yuliya Tarasova,Amateur Open,1973,Russia,56,,,,,70,72.5,-75.5,72.5,,,,,72.5,56,F,Юлия Тарасова,B,,
Yes,Raw,2,Natalya Zorina,Amateur Open,1970,Russia,55.2,,,,,-67.5,70,-72.5,70,,,,,70,56,F,Наталья Зорина,B,,
Yes,Raw,3,Larisa Smal,Amateur Open,1987,Russia,55.6,,,,,67.5,70,-75,70,,,,,70,56,F,Лариса Смаль,B,,
Yes,Raw,4,Ekaterina Ilinskaya,Amateur Open,1988,Russia,55,,,,,-62.5,62.5,-65,62.5,,,,,62.5,56,F,Екатерина Ильинская,B,,
Yes,Raw,5,Raisa Sharueva,Amateur Open,1983,Russia,55.5,,,,,57.5,-60,60,60,,,,,60,56,F,Раиса Шаруева,B,,
Yes,Raw,1,Yuliya Tarasova,Amateur Masters 40-44,1973,Russia,56,,,,,70,72.5,-75.5,72.5,,,,,72.5,56,F,Юлия Тарасова,B,,
Yes,Raw,2,Natalya Zorina,Amateur Masters 40-44,1970,Russia,55.2,,,,,-67.5,70,-72.5,70,,,,,70,56,F,Наталья Зорина,B,,
Yes,Raw,3,Tatyana Alekseeva,Amateur Masters 40-44,1971,Russia,55,,,,,-47.5,55,-62.5,55,,,,,55,56,F,Татьяна Алексеева,B,,
Yes,Raw,1,Yuliya Dragaytseva,Amateur Teen 13-15,1998,Russia,56.5,,,,,-32.5,,32.5,32.5,,,,,32.5,60,F,Юлия Драгайцева,B,,
Yes,Raw,1,Polina Biryukova,Amateur Teen 16-17,1996,Russia,59.4,,,,,60,62.5,-65,62.5,,,,,62.5,60,F,Полина Бирюкова,B,,
Yes,Raw,DQ,Anastasiya Guseva,Amateur Juniors 20-23,1990,Russia,58.6,,,,,-42.5,,-47.5,,,,,,,60,F,Анастасия Гусева,B,,
Yes,Raw,1,Olga Yaroslavtseva,Amateur Open,1986,Russia,58.6,,,,,47.5,-52.5,-55,47.5,,,,,47.5,60,F,Ольга Ярославцева,B,,
Yes,Raw,DQ,Polina Klimova,Amateur Open,1977,Russia,57.8,,,,,-50,-52.5,-57.5,,,,,,,60,F,Полина Климова,B,,
Yes,Raw,DQ,Darya Golomazova,Amateur Open,1988,Russia,59.5,,,,,-60,,,,,,,,,60,F,Дарья Голомазова,B,,
Yes,Raw,1,Elena Mazavina,Amateur Open,1979,Russia,63.5,,,,,70,75,77.5,77.5,,,,,77.5,67.5,F,Елена Мазавина,B,,
Yes,Raw,2,Ekaterina Korotkova,Amateur Open,1988,Russia,64.7,,,,,40,50,-52.5,50,,,,,50,67.5,F,Екатерина Короткова,B,,
Yes,Raw,1,Mariya Semchagova,Amateur Open,1982,Russia,70.3,,,,,-65,70,-75,70,,,,,70,75,F,Мария Семчагова,B,,
Yes,Raw,2,Anna Zemlyakova,Amateur Open,1987,Russia,73.2,,,,,62.5,-70,-70,62.5,,,,,62.5,75,F,Анна Землякова,B,,
Yes,Raw,1,Natalya Vinokurova,Amateur Masters 40-44,1971,Russia,83.6,,,,,57.5,-62.5,62.5,62.5,,,,,62.5,90,F,Наталья Винокурова,B,,
Yes,Raw,1,Nikita Tremaskin,Amateur Teen 13-15,1999,Russia,52.4,,,,,40,47.5,-50,47.5,,,,,47.5,56,M,Никита Тремаскин,B,,
Yes,Raw,1,Dmitriy Suvorov,Amateur Juniors 20-23,1989,Russia,58.5,,,,,75,77.5,80,80,,,,,80,60,M,Дмитрий Суворов,B,,
Yes,Raw,1,Aleksandr Madaev,Amateur Open,1984,Russia,58.8,,,,,95,100,102.5,102.5,,,,,102.5,60,M,Александр Мадаев,B,,
Yes,Raw,1,Evgeniy Gorshkov,Amateur Teen 13-15,1999,Russia,62.4,,,,,60,65,67.5,67.5,,,,,67.5,67.5,M,Евгений Горшков,B,,
Yes,Raw,1,Aleksandr Aleshin,Amateur Teen 16-17,1996,Russia,65,,,,,100,107.5,110,110,,,,,110,67.5,M,Александр Алешин,B,,
Yes,Raw,2,Grigoriy Asaturyan,Amateur Teen 13-15,1998,Russia,61.4,,,,,65,-75,-75,65,,,,,65,67.5,M,Григорий Асатурян,B,,
Yes,Raw,2,Ilya Dmitriev,Amateur Teen 16-17,1995,Russia,64.2,,,,,62.5,67.5,70,70,,,,,70,67.5,M,Илья Дмитриев,B,,
Yes,Raw,1,Dmitriy Ivanov #12,Amateur Teen 18-19,1995,Russia,66.8,,,,,97.5,-107.5,107.5,107.5,,,,,107.5,67.5,M,Дмитрий Иванов,B,,
Yes,Raw,2,Dmitriy Malykh,Amateur Teen 18-19,1994,Russia,65.8,,,,,97.5,-107.5,-107.5,97.5,,,,,97.5,67.5,M,Дмитрий Малых,B,,
Yes,Raw,3,Nikita Bobrov,Amateur Teen 18-19,1994,Russia,62.7,,,,,90,-95,-95,90,,,,,90,67.5,M,Никита Бобров,B,,
Yes,Raw,1,Andrey Dezhin,Amateur Juniors 20-23,1992,Russia,67,,,,,115,120,-125,120,,,,,120,67.5,M,Андрей Дежин,B,,
Yes,Raw,1,Artem Solntsev,Amateur Open,1988,Russia,65,,,,,135,142.5,-147.5,142.5,,,,,142.5,67.5,M,Артем Солнцев,B,,
Yes,Raw,2,Nikita Samokhvalov,Amateur Open,1988,Russia,63.8,,,,,125,130,135,135,,,,,135,67.5,M,Никита Самохвалов,B,,
Yes,Raw,3,Nikolay Belyaev,Amateur Open,1988,Russia,64.4,,,,,120,-125,-125,120,,,,,120,67.5,M,Николай Беляев,B,,
Yes,Raw,4,Dmitriy Kapitulskiy,Amateur Open,1989,Russia,67,,,,,115,120,-125,120,,,,,120,67.5,M,Дмитрий Капитульский,B,,
Yes,Raw,5,Maksim Popov #9,Amateur Open,1988,Russia,66.3,,,,,-115,115,117.5,117.5,,,,,117.5,67.5,M,Максим Попов,B,,
Yes,Raw,6,Ivan Nikolaev,Amateur Open,1987,Russia,66.6,,,,,102.5,107.5,112.5,112.5,,,,,112.5,67.5,M,Иван Николаев,B,,
Yes,Raw,DQ,Georgiy Maltabar,Amateur Open,1987,Russia,67.25,,,,,-100,-107.5,-107.5,,,,,,,67.5,M,Георгий Малтабар,B,,
Yes,Raw,1,Viktor Kvyatkovskiy,Amateur Masters 40-44,1971,Russia,66.9,,,,,-125,125,130,130,,,,,130,67.5,M,Виктор Квятковский,B,,
Yes,Raw,1,Sergey Melnikov,Amateur Teen 13-15,1997,Russia,74.3,,,,,55,-62.5,-62.5,55,,,,,55,75,M,Сергей Мельников,B,,
Yes,Raw,1,Ilya Levakov,Amateur Teen 13-15,1997,Russia,72.7,,,,,125,-130,-135,125,,,,,125,75,M,Илья Леваков,B,,
Yes,Raw,2,Amrid Khametov,Amateur Teen 16-17,1995,Russia,71.6,,,,,110,117.5,-125,117.5,,,,,117.5,75,M,Амрид Хаметов,B,,
Yes,Raw,3,Ruben Kazaryan,Amateur Teen 16-17,1995,Russia,75,,,,,105,-110,-110,105,,,,,105,75,M,Рубен Казарян,B,,
Yes,Raw,4,Dmitriy Karpenkov,Amateur Teen 16-17,1996,Russia,73,,,,,95,100,-105,100,,,,,100,75,M,Дмитрий Карпенков,B,,
Yes,Raw,5,Arkadiy Ignatov,Amateur Teen 16-17,1996,Russia,75,,,,,95,-102.5,-102.5,95,,,,,95,75,M,Аркадий Игнатов,B,,
Yes,Raw,1,Dmitriy Dzhus,Amateur Teen 18-19,1995,Russia,72.45,,,,,120,122.5,-125,122.5,,,,,122.5,75,M,Дмитрий Джус,B,,
Yes,Raw,2,Yaroslav Pavlyukov,Amateur Teen 18-19,1993,Russia,74.6,,,,,-100,107.5,115,115,,,,,115,75,M,Ярослав Павлюков,B,,
Yes,Raw,3,Pavel Podkovyrov,Amateur Teen 18-19,1994,Russia,73.5,,,,,105,112.5,-117.5,112.5,,,,,112.5,75,M,Павел Подковыров,B,,
Yes,Raw,DQ,Vladislav Kanashevskiy,Amateur Teen 18-19,1995,Russia,71.3,,,,,-107.5,-117.5,-117.5,,,,,,,75,M,Владислав Канашевский,B,,
Yes,Raw,DQ,Andrey Fomushkin,Amateur Teen 18-19,1994,Russia,72,,,,,-110,-110,-117.5,,,,,,,75,M,Андрей Фомушкин,B,,
Yes,Raw,1,Denis Simanovskiy,Amateur Juniors 20-23,1993,Russia,69.7,,,,,140,-145,-145,140,,,,,140,75,M,Денис Симановский,B,,
Yes,Raw,2,Aleksey Obydennykh,Amateur Juniors 20-23,1990,Russia,73.6,,,,,125,127.5,-130,127.5,,,,,127.5,75,M,Алексей Обыденных,B,,
Yes,Raw,3,Vladislav Eroshenko,Amateur Juniors 20-23,1993,Russia,72.9,,,,,-100,100,105,105,,,,,105,75,M,Владислав Ерошенко,B,,
Yes,Raw,4,Artem Panfilov,Amateur Juniors 20-23,1993,Russia,71.9,,,,,95,-100,-100,95,,,,,95,75,M,Артем Панфилов,B,,
Yes,Raw,1,Denis Agafonov,Amateur Open,1978,Russia,73.8,,,,,150,157.5,-160,157.5,,,,,157.5,75,M,Денис Агафонов,B,,
Yes,Raw,2,Aleksey Yushin,Amateur Open,1982,Russia,73.3,,,,,-140,140,145,145,,,,,145,75,M,Алексей Юшин,B,,
Yes,Raw,3,Aleksey Lebed,Amateur Open,1987,Russia,73.5,,,,,140,-145,-145,140,,,,,140,75,M,Алексей Лебедь,B,,
Yes,Raw,4,Konstantin Alekseychuk,Amateur Open,1988,Russia,74,,,,,135,,,135,,,,,135,75,M,Константин Алексейчук,B,,
Yes,Raw,5,Aleksandr Zaytsev,Amateur Open,1987,Russia,74.3,,,,,-135,,135,135,,,,,135,75,M,Александр Зайцев,B,,
Yes,Raw,6,Aleksey Nechaev,Amateur Open,1987,Russia,74.3,,,,,117.5,125,-130,125,,,,,125,75,M,Алексей Нечаев,B,,
Yes,Raw,7,Aleksey Minaev,Amateur Open,1976,Russia,74.6,,,,,105,117.5,122.5,122.5,,,,,122.5,75,M,Алексей Минаев,B,,
Yes,Raw,8,Dmitriy Polivanov,Amateur Open,1975,Russia,73.6,,,,,110,-117.5,-117.5,110,,,,,110,75,M,Дмитрий Поливанов,B,,
Yes,Raw,DQ,Nikita Kravchunov,Amateur Open,1986,Russia,73.45,,,,,-120,-125,-125,,,,,,,75,M,Никита Кравчунов,B,,
Yes,Raw,DQ,Evgeniy Stepura,Amateur Open,1983,Russia,73.5,,,,,-117.5,-117.5,,,,,,,,75,M,Евгений Степура,B,,
Yes,Raw,1,Vladimir Schegolkov,Amateur Masters 40-44,1973,Russia,74.4,,,,,157.5,160,-165,160,,,,,160,75,M,Владимир Щегольков,B,,
Yes,Raw,2,Sergey Zuykov,Amateur Masters 40-44,1970,Russia,73.8,,,,,150,-160,-165,150,,,,,150,75,M,Сергей Зуйков,B,,
Yes,Raw,3,Aleksey Boyko,Amateur Masters 40-44,1971,Russia,71.8,,,,,105,115,-117.5,115,,,,,115,75,M,Алексей Бойко,B,,
Yes,Raw,1,Vladimir Ermokhin,Amateur Masters 50-54,1961,Russia,74,,,,,95,100,102.5,102.5,,,,,102.5,75,M,Владимир Ермохин,B,,
Yes,Raw,1,Viktor Ovsyanyy,Amateur Masters 55-59,1958,Russia,74.4,,,,,120,125,-130,125,,,,,125,75,M,Виктор Овсяный,B,,
Yes,Raw,2,Vladimir Kulakov,Amateur Masters 55-59,1955,Russia,75,,,,,87.5,,,87.5,,,,,87.5,75,M,Владимир Кулаков,B,,
Yes,Raw,DQ,Nikolay Kamanin,Amateur Masters 55-59,1953,Russia,73.1,,,,,-95,-95,-95,,,,,,,75,M,Николай Каманин,B,,
Yes,Raw,1,Daniil Nasyrov,Amateur Teen 13-15,1999,Russia,80,,,,,60,70,-75,70,,,,,70,82.5,M,Даниил Насыров,B,,
Yes,Raw,1,Arseniy Fedorov,Amateur Teen 13-15,1997,Russia,80,,,,,130,-140,140,140,,,,,140,82.5,M,Арсений Федоров,B,,
Yes,Raw,2,Aleksey Kozhevnikov,Amateur Teen 16-17,1996,Russia,80.6,,,,,-105,-105,105,105,,,,,105,82.5,M,Алексей Кожевников,B,,
Yes,Raw,3,Mikhail Naymushin,Amateur Teen 16-17,1996,Russia,82.5,,,,,100,102.5,105,105,,,,,105,82.5,M,Михаил Наймушин,B,,
Yes,Raw,1,Andrey Shashin,Amateur Teen 18-19,1993,Russia,80.4,,,,,110,130,-145,130,,,,,130,82.5,M,Андрей Шашин,B,,
Yes,Raw,2,Lev Sherer,Amateur Teen 18-19,1995,Russia,81.6,,,,,-127.5,-127.5,127.5,127.5,,,,,127.5,82.5,M,Лев Шерер,B,,
Yes,Raw,3,Denis Leschenko,Amateur Teen 18-19,1995,Russia,82.25,,,,,125,-127.5,127.5,127.5,,,,,127.5,82.5,M,Денис Лещенко,B,,
Yes,Raw,4,Aleksandr Gusev,Amateur Teen 18-19,1995,Russia,81.3,,,,,95,-100,-102.5,95,,,,,95,82.5,M,Александр Гусев,B,,
Yes,Raw,1,Dmitriy Pavlov,Amateur Juniors 20-23,1991,Russia,82,,,,,155,160,-162.5,160,,,,,160,82.5,M,Дмитрий Павлов,B,,
Yes,Raw,2,Ashot Oganesyan,Amateur Juniors 20-23,1991,Russia,80.6,,,,,152.5,-160,-160,152.5,,,,,152.5,82.5,M,Ашот Оганесян,B,,
Yes,Raw,3,Dmitriy Zhiltsov,Amateur Juniors 20-23,1991,Russia,80.1,,,,,145,-147.5,-147.5,145,,,,,145,82.5,M,Дмитрий Жильцов,B,,
Yes,Raw,4,Aleksandr Rokhin,Amateur Juniors 20-23,1990,Russia,81.7,,,,,127.5,137.5,145,145,,,,,145,82.5,M,Александр Рохин,B,,
Yes,Raw,5,Artem Elfimov,Amateur Juniors 20-23,1993,Russia,79.8,,,,,130,135,137.5,137.5,,,,,137.5,82.5,M,Артем Елфимов,B,,
Yes,Raw,6,Dmitriy Zverev,Amateur Juniors 20-23,1990,Russia,79.1,,,,,127.5,135,-145,135,,,,,135,82.5,M,Дмитрий Зверев,B,,
Yes,Raw,7,Stanislav Repinskas,Amateur Juniors 20-23,1990,Russia,81,,,,,125,132.5,135,135,,,,,135,82.5,M,Станислав Репинскас,B,,
Yes,Raw,8,Denis Lebedev,Amateur Juniors 20-23,1993,Russia,81.4,,,,,115,127.5,-135,127.5,,,,,127.5,82.5,M,Денис Лебедев,B,,
Yes,Raw,9,Artem Menshikov,Amateur Juniors 20-23,1990,Russia,79.3,,,,,-125,,125,125,,,,,125,82.5,M,Артем Меньшиков,B,,
Yes,Raw,10,Anatoliy Volkov #2,Amateur Juniors 20-23,1990,Russia,78.7,,,,,95,-105,-105,95,,,,,95,82.5,M,Анатолий Волков,B,,
Yes,Raw,DQ,Ivan Grigoryev,Amateur Juniors 20-23,1990,Russia,80.8,,,,,-140,-140,-142.5,,,,,,,82.5,M,Иван Григорьев,B,,
Yes,Raw,1,Dmitriy Popov,Amateur Open,1981,Russia,81.3,,,,,145,147.5,152.5,152.5,,,,,152.5,82.5,M,Дмитрий Попов,B,,
Yes,Raw,2,Aleksandr Kosorebrikov,Amateur Open,1981,Russia,81.5,,,,,140,145,-152.5,145,,,,,145,82.5,M,Александр Косоребриков,B,,
Yes,Raw,3,Arseniy Fedorov,Amateur Open,1997,Russia,80,,,,,140,,,140,,,,,140,82.5,M,Арсений Федоров,B,,
Yes,Raw,4,Dmitriy Gudkov,Amateur Open,1981,Russia,77.4,,,,,-130,130,-135,130,,,,,130,82.5,M,Дмитрий Гудков,B,,
Yes,Raw,5,Aleksey Laferov,Amateur Open,1986,Russia,76,,,,,117.5,122.5,127.5,127.5,,,,,127.5,82.5,M,Алексей Лаферов,B,,
Yes,Raw,6,Denis Kachanov,Amateur Open,1987,Russia,80.5,,,,,105,-107.5,-107.5,105,,,,,105,82.5,M,Денис Качанов,B,,
Yes,Raw,7,Aleksey Fursov,Amateur Open,1987,Russia,81.4,,,,,90,100,-105,100,,,,,100,82.5,M,Алексей Фурсов,B,,
Yes,Raw,DQ,Anton Gorbunov,Amateur Open,1989,Russia,77.7,,,,,-105,-105,-105,,,,,,,82.5,M,Антон Горбунов,B,,
Yes,Raw,DQ,Ivan Kolchitskiy,Amateur Open,1988,Russia,81,,,,,-145,,-145,,,,,,,82.5,M,Иван Кольчицкий,B,,
Yes,Raw,1,Dmitriy Khoroshun,Amateur Masters 40-44,1972,Russia,82.1,,,,,140,150,-155,150,,,,,150,82.5,M,Дмитрий Хорошун,B,,
Yes,Raw,1,Andrey Suslin,Amateur Masters 45-49,1968,Russia,81.25,,,,,137.5,140,145,145,,,,,145,82.5,M,Андрей Суслин,B,,
Yes,Raw,1,Aleksandr Leonov,Amateur Masters 50-54,1959,Russia,77.3,,,,,90,95,100,100,,,,,100,82.5,M,Александр Леонов,B,,
Yes,Raw,1,Vasiliy Mosin,Amateur Masters 55-59,1956,Russia,79.9,,,,,135,145,,145,,,,,145,82.5,M,Василий Мосин,B,,
Yes,Raw,2,Yuriy Babarykin,Amateur Masters 55-59,1958,Russia,81.9,,,,,95,100,105,105,,,,,105,82.5,M,Юрий Бабарыкин,B,,
Yes,Raw,1,Sergey Goncharov,Amateur Masters 60-64,1952,Russia,80.8,,,,,110,120,125,125,,,,,125,82.5,M,Сергей Гончаров,B,,
Yes,Raw,1,Denis Kuzmenko,Amateur Teen 16-17,1995,Russia,87.5,,,,,132.5,140,145,145,,,,,145,90,M,Денис Кузьменко,B,,
Yes,Raw,2,Mikhail Panov,Amateur Teen 16-17,1996,Russia,86.95,,,,,115,120,-132.5,120,,,,,120,90,M,Михаил Панов,B,,
Yes,Raw,3,Sergey Savin,Amateur Teen 16-17,1995,Russia,87.3,,,,,-100,107.5,-115,107.5,,,,,107.5,90,M,Сергей Савин,B,,
Yes,Raw,4,Egor Shepelev,Amateur Teen 16-17,1996,Russia,84.6,,,,,90,95,100,100,,,,,100,90,M,Егор Шепелев,B,,
Yes,Raw,1,Evgeniy Sobolev,Amateur Teen 18-19,1995,Russia,87,,,,,-132.5,132.5,140,140,,,,,140,90,M,Евгений Соболев,B,,
Yes,Raw,2,Sergey Krasheninnikov,Amateur Teen 18-19,1994,Russia,89.5,,,,,120,125,-132.5,125,,,,,125,90,M,Сергей Крашенинников,B,,
Yes,Raw,3,Gleb Gorbatsevich,Amateur Teen 18-19,1994,Russia,88.5,,,,,-115,115,120,120,,,,,120,90,M,Глеб Горбацевич,B,,
Yes,Raw,4,Ivan Starovoytov,Amateur Teen 18-19,1994,Russia,90,,,,,120,-132.5,-132.5,120,,,,,120,90,M,Иван Старовойтов,B,,
Yes,Raw,5,Kirill Trusov,Amateur Teen 18-19,1995,Russia,89.6,,,,,105,110,112.5,112.5,,,,,112.5,90,M,Кирилл Трусов,B,,
Yes,Raw,6,Kirill Frolushkin,Amateur Teen 18-19,1994,Russia,84.3,,,,,110,-132.5,-132.5,110,,,,,110,90,M,Кирилл Фролушкин,B,,
Yes,Raw,7,Mikhail Ermilov,Amateur Teen 18-19,1995,Russia,87.8,,,,,-100,110,-120,110,,,,,110,90,M,Михаил Ермилов,B,,
Yes,Raw,1,Karen Arutyunyan,Amateur Juniors 20-23,1990,Russia,88,,,,,160,165,172.5,172.5,,,,,172.5,90,M,Карен Арутюнян,B,,
Yes,Raw,2,Roman Shikhaleev,Amateur Juniors 20-23,1990,Russia,84.9,,,,,127.5,132.5,140,140,,,,,140,90,M,Роман Шихалеев,B,,
Yes,Raw,3,Oleg Savchenko,Amateur Juniors 20-23,1989,Russia,86,,,,,120,132.5,137.5,137.5,,,,,137.5,90,M,Олег Савченко,B,,
Yes,Raw,4,Shakro Mikaelyan,Amateur Juniors 20-23,1993,Russia,88.5,,,,,132.5,-142.5,-142.5,132.5,,,,,132.5,90,M,Шакро Микаелян,B,,
Yes,Raw,5,Anatoliy Lovinyukov,Amateur Juniors 20-23,1991,Russia,88,,,,,-125,125,-132.5,125,,,,,125,90,M,Анатолий Ловинюков,B,,
Yes,Raw,6,Pavel Fateev,Amateur Juniors 20-23,1990,Russia,86.8,,,,,120,-130,,120,,,,,120,90,M,Павел Фатеев,B,,
Yes,Raw,DQ,Daniil Gromov,Amateur Juniors 20-23,1990,Russia,86.9,,,,,-132.5,-132.5,-132.5,,,,,,,90,M,Даниил Громов,B,,
Yes,Raw,DD,Kirill Kalinin,Amateur Juniors 20-23,1990,Russia,88.2,,,,,-145,-152.5,152.5,152.5,,,,,,90,M,Кирилл Калинин,B,,
Yes,Raw,1,Aleksey Blintsov,Amateur Open,1980,Russia,87.7,,,,,170,177.5,-180,177.5,,,,,177.5,90,M,Алексей Блинцов,B,,
Yes,Raw,2,Aleksey Maksyagin,Amateur Open,1982,Russia,88.8,,,,,162.5,167.5,170,170,,,,,170,90,M,Алексей Максягин,B,,
Yes,Raw,3,Aleksey Shustov,Amateur Open,1985,Russia,89.3,,,,,-165,165,-170,165,,,,,165,90,M,Алексей Шустов,B,,
Yes,Raw,4,Aleksandr Andronov,Amateur Open,1977,Russia,87.8,,,,,152.5,-165,-165,152.5,,,,,152.5,90,M,Александр Андронов,B,,
Yes,Raw,5,Ivan Sergeev,Amateur Open,1986,Russia,90,,,,,152.5,-157.5,-157.5,152.5,,,,,152.5,90,M,Иван Сергеев,B,,
Yes,Raw,6,Sergey Churinov,Amateur Open,1976,Russia,87.9,,,,,142.5,147.5,-152.5,147.5,,,,,147.5,90,M,Сергей Чуринов,B,,
Yes,Raw,7,Leonid Saukov,Amateur Open,1986,Russia,88,,,,,125,132.5,140,140,,,,,140,90,M,Леонид Сауков,B,,
Yes,Raw,8,Pavel Lobzov,Amateur Open,1974,Russia,86.8,,,,,100,-135,135,135,,,,,135,90,M,Павел Лобзов,B,,
Yes,Raw,9,Anton Likhodedov,Amateur Open,1977,Russia,88.9,,,,,-135,-135,135,135,,,,,135,90,M,Антон Лиходедов,B,,
Yes,Raw,10,Nikolay Demin,Amateur Open,1975,Russia,85.9,,,,,122.5,132.5,-140,132.5,,,,,132.5,90,M,Николай Демин,B,,
Yes,Raw,11,Andrey Medvedev,Amateur Open,1978,Russia,85.9,,,,,-132.5,-132.5,132.5,132.5,,,,,132.5,90,M,Андрей Медведев,B,,
Yes,Raw,12,Evgeniy Starev,Amateur Open,1974,Russia,86.2,,,,,-130,132.5,-140,132.5,,,,,132.5,90,M,Евгений Старев,B,,
Yes,Raw,13,Andrey Egorov,Amateur Open,1989,Belarus,87,,,,,125,132.5,-142.5,132.5,,,,,132.5,90,M,,B,,
Yes,Raw,14,Evgeniy Boldyrev,Amateur Open,1985,Russia,88.5,,,,,-125,-132.5,132.5,132.5,,,,,132.5,90,M,Евгений Болдырев,B,,
Yes,Raw,15,Aleksandr Kozlov,Amateur Open,1982,Russia,89.8,,,,,-130,132.5,-140,132.5,,,,,132.5,90,M,Александр Козлов,B,,
Yes,Raw,16,Aleksandr Uchkin,Amateur Open,1990,Russia,89,,,,,125,-132.5,-132.5,125,,,,,125,90,M,Александр Учкин,B,,
Yes,Raw,DQ,Kirill Belkin,Amateur Open,1988,Russia,88,,,,,-125,-132.5,-132.5,,,,,,,90,M,Кирилл Белкин,B,,
Yes,Raw,1,Evgeniy Smirnov,Amateur Masters 40-44,1973,Russia,88,,,,,152.5,155,-160,155,,,,,155,90,M,Евгений Смирнов,B,,
Yes,Raw,2,Igor Zakharov,Amateur Masters 40-44,1969,Russia,87.9,,,,,150,-155,-155,150,,,,,150,90,M,Игорь Захаров,B,,
Yes,Raw,3,Yuriy Lyubach,Amateur Masters 40-44,1968,Russia,89.9,,,,,135,140,-142.5,140,,,,,140,90,M,Юрий Любач,B,,
Yes,Raw,1,Igor Polunin,Amateur Masters 45-49,1966,Russia,87.4,,,,,132.5,137.5,140,140,,,,,140,90,M,Игорь Полунин,B,,
Yes,Raw,1,Eduard Tarasov,Amateur Masters 50-54,1962,Russia,89.9,,,,,100,107.5,-110,107.5,,,,,107.5,90,M,Эдуард Тарасов,B,,
Yes,Raw,1,Gennadiy Obmelyukhin,Amateur Masters 65-69,1948,Russia,87.6,,,,,102.5,110,-115,110,,,,,110,90,M,Геннадий Обмелюхин,B,,
Yes,Raw,1,Nikolay Novikov,Amateur Masters 75-79,1938,Russia,88.2,,,,,100,110,-115,110,,,,,110,90,M,Николай Новиков,B,,
Yes,Raw,1,Leonid Busov,Amateur Teen 13-15,1998,Russia,91.2,,,,,102.5,107.5,112.5,112.5,,,,,112.5,100,M,Леонид Бусов,B,,
Yes,Raw,1,Evgeniy Petrov,Amateur Teen 16-17,1996,Russia,96.2,,,,,122.5,130,-135,130,,,,,130,100,M,Евгений Петров,B,,
Yes,Raw,2,Aleksey Dmitriev,Amateur Teen 16-17,1996,Russia,97.7,,,,,-100,105,-112.5,105,,,,,105,100,M,Алексей Дмитриев,B,,
Yes,Raw,1,Dmitriy Sviridov,Amateur Juniors 20-23,1992,Russia,99.5,,,,,130,140,-147.5,140,,,,,140,100,M,Дмитрий Свиридов,B,,
Yes,Raw,1,Maksim Shirshov,Amateur Open,1994,Russia,98,,,,,170,180,-190,180,,,,,180,100,M,Максим Ширшов,B,,
Yes,Raw,2,Semen Borkin,Amateur Open,1981,Russia,98,,,,,155,-165,165,165,,,,,165,100,M,Семен Борькин,B,,
Yes,Raw,3,Maksim Volkov,Amateur Open,1989,Russia,92.8,,,,,155,-162.5,162.5,162.5,,,,,162.5,100,M,Максим Волков,B,,
Yes,Raw,4,Andrey Galeev,Amateur Open,1983,Russia,95.9,,,,,-162.5,162.5,,162.5,,,,,162.5,100,M,Андрей Галеев,B,,
Yes,Raw,5,Ivan Chaschin,Amateur Open,1987,Russia,97.1,,,,,145,155,162.5,162.5,,,,,162.5,100,M,Иван Чащин,B,,
Yes,Raw,6,Aleksey Maychenkov,Amateur Open,1977,Russia,99.9,,,,,-150,162.5,-165,162.5,,,,,162.5,100,M,Алексей Майченков,B,,
Yes,Raw,7,Yan Zhurkin,Amateur Open,1985,Russia,98.9,,,,,155,-162.5,-162.5,155,,,,,155,100,M,Ян Журкин,B,,
Yes,Raw,8,Vadim Vasilenko,Amateur Open,1981,Russia,93.3,,,,,150,-162.5,-162.5,150,,,,,150,100,M,Вадим Василенко,B,,
Yes,Raw,9,Aleksandr Timofeev,Amateur Open,1988,Russia,94.4,,,,,140,150,-162.5,150,,,,,150,100,M,Александр Тимофеев,B,,
Yes,Raw,10,Anton Tarasov,Amateur Open,1986,Russia,96.5,,,,,140,142.5,145,145,,,,,145,100,M,Антон Тарасов,B,,
Yes,Raw,11,Aleksandr Grishanov,Amateur Open,1979,Russia,96.9,,,,,125,140,-142.5,140,,,,,140,100,M,Александр Гришанов,B,,
Yes,Raw,12,Vladimir Nechitaylov,Amateur Open,1985,Russia,97.8,,,,,130,140,-150,140,,,,,140,100,M,Владимир Нечитайлов,B,,
Yes,Raw,13,Aleksandr Dorofeev,Amateur Open,1981,Russia,99,,,,,135,140,-145,140,,,,,140,100,M,Александр Дорофеев,B,,
Yes,Raw,14,Artur Markarov,Amateur Open,1984,Russia,93.3,,,,,120,125,130,130,,,,,130,100,M,Артур Маркаров,B,,
Yes,Raw,15,Kirill Ivashenkov,Amateur Open,1987,Russia,97.9,,,,,130,-140,-140,130,,,,,130,100,M,Кирилл Ивашенков,B,,
Yes,Raw,16,Andrey Naumov,Amateur Open,1981,Russia,96.1,,,,,-125,125,-140,125,,,,,125,100,M,Андрей Наумов,B,,
Yes,Raw,1,Sergey Matveev,Amateur Masters 40-44,1973,Russia,98,,,,,170,175,-182.5,175,,,,,175,100,M,Сергей Матвеев,B,,
Yes,Raw,2,Aleksey Strulev,Amateur Masters 40-44,1971,Russia,92.4,,,,,125,132.5,135,135,,,,,135,100,M,Алексей Струлев,B,,
Yes,Raw,3,Aleksey Figol,Amateur Masters 40-44,1973,Russia,95,,,,,125,132.5,-140,132.5,,,,,132.5,100,M,Алексей Фиголь,B,,
Yes,Raw,1,Dmitriy Kalinovskiy,Amateur Masters 45-49,1967,Russia,97.9,,,,,115,120,122.5,122.5,,,,,122.5,100,M,Дмитрий Калиновский,B,,
Yes,Raw,2,Aleksandr Khasin,Amateur Masters 45-49,1966,Russia,95.9,,,,,120,-130,-130,120,,,,,120,100,M,Александр Хасин,B,,
Yes,Raw,1,Leonid Skvortsov,Amateur Masters 50-54,1962,Russia,95.8,,,,,-175,-175,175,175,,,,,175,100,M,Леонид Скворцов,B,,
Yes,Raw,2,Sergey Filinovich,Amateur Masters 50-54,1962,Russia,96.9,,,,,155,162.5,-165,162.5,,,,,162.5,100,M,Сергей Филинович,B,,
Yes,Raw,1,Viktor Novikov,Amateur Teen 16-17,1996,Russia,101.9,,,,,92.5,97.5,100,100,,,,,100,110,M,Виктор Новиков,B,,
Yes,Raw,DD,Oleg Podkopaev,Amateur Teen 18-19,1994,Russia,100.7,,,,,140,-145,145,145,,,,,,110,M,Олег Подкопаев,B,,
Yes,Raw,1,Evgeniy Miroshkin,Amateur Juniors 20-23,1993,Russia,102.7,,,,,147.5,150,-155,150,,,,,150,110,M,Евгений Мирошкин,B,,
Yes,Raw,1,Pavel Milovanov,Amateur Open,1977,Russia,104.2,,,,,200,205,210,210,,,,,210,110,M,Павел Милованов,B,,
Yes,Raw,2,Aleksandr Kuznetsov #1,Amateur Open,1979,Russia,108.7,,,,,195,-205,-205,195,,,,,195,110,M,Александр Кузнецов,B,,
Yes,Raw,3,Maksim Uteshev,Amateur Open,1974,Russia,108.7,,,,,170,-175,175,175,,,,,175,110,M,Максим Утешев,B,,
Yes,Raw,4,Dmitriy Makunin,Amateur Open,1978,Russia,101,,,,,170,-180,-180,170,,,,,170,110,M,Дмитрий Макунин,B,,
Yes,Raw,5,Roman Zharskiy,Amateur Open,1982,Russia,102.8,,,,,170,-180,-180,170,,,,,170,110,M,Роман Жарский,B,,
Yes,Raw,6,Dmitriy Mikhaylin,Amateur Open,1977,Russia,105.4,,,,,165,170,-175,170,,,,,170,110,M,Дмитрий Михайлин,B,,
Yes,Raw,7,Maksim Lisyutin,Amateur Open,1985,Russia,106,,,,,162.5,167.5,-177.5,167.5,,,,,167.5,110,M,Максим Лисютин,B,,
Yes,Raw,8,Mikhail Sidelnikov,Amateur Open,1984,Russia,104.5,,,,,157.5,162.5,-165,162.5,,,,,162.5,110,M,Михаил Сидельников,B,,
Yes,Raw,9,Aleksey Belash,Amateur Open,1982,Russia,103.7,,,,,160,-170,-170,160,,,,,160,110,M,Алексей Белаш,B,,
Yes,Raw,10,Sergey Gershtanskiy,Amateur Open,1974,Russia,106.5,,,,,140,-145,-145,140,,,,,140,110,M,Сергей Герштанский,B,,
Yes,Raw,11,Maksim Mantorov,Amateur Open,1984,Russia,107.1,,,,,140,-147.5,-147.5,140,,,,,140,110,M,Максим Манторов,B,,
Yes,Raw,1,Vladimir Kosmachev,Amateur Masters 40-44,1973,Russia,109.9,,,,,-175,175,-180,175,,,,,175,110,M,Владимир Космачев,B,,
Yes,Raw,2,Mikhail Azhnin,Amateur Masters 40-44,1971,Russia,107,,,,,165,167.5,172.5,172.5,,,,,172.5,110,M,Михаил Ажнин,B,,
Yes,Raw,3,Ivan Burlov,Amateur Masters 40-44,1970,Russia,107.8,,,,,157.5,-165,165,165,,,,,165,110,M,Иван Бурлов,B,,
Yes,Raw,4,Kirill Kharabadze,Amateur Masters 40-44,1972,Russia,105.35,,,,,147.5,-155,-155,147.5,,,,,147.5,110,M,Кирилл Харабадзе,B,,
Yes,Raw,5,Vladimir Kotov,Amateur Masters 40-44,1973,Russia,110,,,,,137.5,-147.5,147.5,147.5,,,,,147.5,110,M,Владимир Котов,B,,
Yes,Raw,1,Andrey Skorobogatko,Amateur Masters 50-54,1963,Russia,107.6,,,,,135,142.5,147.5,147.5,,,,,147.5,110,M,Андрей Скоробогатько,B,,
Yes,Raw,2,Leonid Baryagin,Amateur Masters 50-54,1961,Russia,109.8,,,,,142.5,147.5,-150,147.5,,,,,147.5,110,M,Леонид Барягин,B,,
Yes,Raw,1,Andrey Vasilyev,Amateur Teen 13-15,1997,Russia,114,,,,,130,-140,140,140,,,,,140,125,M,Андрей Васильев,B,,
Yes,Raw,1,Petr Zezin,Amateur Juniors 20-23,1989,Russia,123.8,,,,,180,185,190,190,,,,,190,125,M,Петр Зезин,B,,
Yes,Raw,1,Aleksandr Andreev,Amateur Open,1977,Russia,117.35,,,,,200,210,-222.5,210,,,,,210,125,M,Александр Андреев,B,,
Yes,Raw,2,Anton Vildanov,Amateur Open,1980,Russia,116.9,,,,,195,200,-205,200,,,,,200,125,M,Антон Вильданов,B,,
Yes,Raw,3,Vladimir Rybakov,Amateur Open,1976,Russia,118,,,,,180,190,-200,190,,,,,190,125,M,Владимир Рыбаков,B,,
Yes,Raw,4,Igor Golovanov,Amateur Open,1983,Russia,123,,,,,190,-200,-200,190,,,,,190,125,M,Игорь Голованов,B,,
Yes,Raw,5,Armen Atoyan,Amateur Open,1983,Russia,114,,,,,170,180,-190,180,,,,,180,125,M,Армен Атоян,B,,
Yes,Raw,6,Dmitriy Zubarev,Amateur Open,1987,Russia,119.5,,,,,-155,155,160,160,,,,,160,125,M,Дмитрий Зубарев,B,,
Yes,Raw,7,Kirill Rachkov,Amateur Open,1977,Belarus,121,,,,,-152.5,152.5,160,160,,,,,160,125,M,,B,,
Yes,Raw,1,Viktor Nikiforov,Amateur Masters 45-49,1967,Russia,112,,,,,120,127.5,130,130,,,,,130,125,M,Виктор Никифоров,B,,
Yes,Raw,1,Yuriy Gordyakov,Amateur Open,1976,Russia,125.2,,,,,210,215,-220,215,,,,,215,140,M,Юрий Гордяков,B,,
Yes,Raw,1,Sergey Kozlovskiy,Amateur Masters 45-49,1963,Russia,130.3,,,,,-185,185,-190,185,,,,,185,140,M,Сергей Козловский,B,,
Yes,Raw,1,Roman Mishurenkov,Amateur Open,1982,Russia,145.3,,,,,205,213,217.5,217.5,,,,,217.5,140+,M,Роман Мишуренков,B,220,
Yes,Single-ply,1,Nadezhda Komarova,Amateur Open,1980,Russia,54.3,,,,,67.5,72.5,77.5,77.5,,,,,77.5,56,F,Надежда Комарова,B,,
Yes,Single-ply,1,Marina Sinotova,Amateur Open,1988,Russia,67,,,,,-75,82.5,-85,82.5,,,,,82.5,67.5,F,Марина Синотова,B,,
Yes,Single-ply,1,Andrey Dezhin,Amateur Juniors 20-23,1992,Russia,67,,,,,130,140,-145,140,,,,,140,67.5,M,Андрей Дежин,B,,
Yes,Single-ply,1,Ilya Fokin,Amateur Open,1982,Russia,74.7,,,,,135,147.5,-155,147.5,,,,,147.5,75,M,Илья Фокин,B,,
Yes,Single-ply,1,Denis Kopyttsev,Amateur Juniors 20-23,1990,Russia,80.7,,,,,-150,150,-157.5,150,,,,,150,82.5,M,Денис Копытцев,B,,
Yes,Single-ply,1,Denis Dobryanskiy,Amateur Open,1977,Russia,82.5,,,,,182.5,-195,-195,182.5,,,,,182.5,82.5,M,Денис Добрянский,B,,
Yes,Single-ply,2,Dmitriy Korneev,Amateur Open,1987,Russia,82.1,,,,,162.5,170,175,175,,,,,175,82.5,M,Дмитрий Корнеев,B,,
Yes,Single-ply,3,Vladislav Shaparenko,Amateur Open,1987,Russia,78.6,,,,,-125,130,140,140,,,,,140,82.5,M,Владислав Шапаренко,B,,
Yes,Single-ply,DQ,Ilya Filin,Amateur Open,1988,Russia,80.5,,,,,-200,-200,-200,,,,,,,82.5,M,Илья Филин,B,,
Yes,Single-ply,1,Denis Piklyaev,Amateur Open,1980,Russia,88.6,,,,,215,222.5,227.5,227.5,,,,,227.5,90,M,Денис Пикляев,B,230,
Yes,Single-ply,2,Maksim Yakovlev,Amateur Open,1987,Russia,88.3,,,,,-150,-155,155,155,,,,,155,90,M,Максим Яковлев,B,,
Yes,Single-ply,DQ,Aleksey Ivanov,Amateur Open,1975,Russia,87.7,,,,,-150,-150,-150,,,,,,,90,M,Алексей Иванов,B,,
Yes,Single-ply,DQ,Nikolay Novikov,Amateur Masters 75-79,1938,Russia,88.2,,,,,-100,,,,,,,,,90,M,Николай Новиков,B,,
Yes,Single-ply,1,Sergey Kalinin,Amateur Open,1982,Russia,97.1,,,,,220,230,235,235,,,,,235,100,M,Сергей Калинин,B,,
Yes,Single-ply,1,Konstantin Kryzhanovskiy,Amateur Open,1975,Russia,105,,,,,200,215,-222.5,215,,,,,215,110,M,Константин Крыжановский,B,,
Yes,Single-ply,2,Aleksandr Tarakin,Amateur Open,1986,Russia,109.9,,,,,-185,190,-197.5,190,,,,,190,110,M,Александр Таракин,B,,
Yes,Single-ply,1,Aleksandr Andreev,Amateur Open,1977,Russia,117,,,,,250,-260,260,260,,,,,260,125,M,Александр Андреев,B,,
Yes,Multi-ply,1,Artem Larionov,Amateur Open,1978,Russia,73,,,,,195,202.5,-205,202.5,,,,,202.5,75,M,Артем Ларионов,B,,
Yes,Multi-ply,DQ,Denis Dobryanskiy,Amateur Open,1977,Russia,82.5,,,,,-202.5,-212.5,-212.5,,,,,,,82.5,M,Денис Добрянский,B,,
Yes,Multi-ply,DQ,Yuri Solovyev,Amateur Open,1974,Russia,100,,,,,-245,-245,,,,,,,,100,M,Юрий Соловьев,B,,
Yes,Multi-ply,1,Ruslan Kulebyakin,Amateur Juniors 20-23,1991,Russia,106.5,,,,,215,225,235,235,,,,,235,110,M,Руслан Кулебякин,B,,
Yes,Multi-ply,1,Denis Demkin,Amateur Open,1979,Russia,108.8,,,,,-160,160,-172.5,160,,,,,160,110,M,Денис Демкин,B,,
Yes,Multi-ply,1,Aleksey Voronkov,Amateur Open,1989,Russia,117.4,,,,,-230,230,,230,,,,,230,125,M,Алексей Воронков,B,,
Yes,Raw,1,Oksana Martinovich,Amateur Juniors 20-23,1992,Russia,47.4,,,,,,,,,95,100,-105,100,100,48,F,Оксана Мартинович,D,,
Yes,Raw,1,Anna Yusupova,Amateur Open,1988,Russia,46.7,,,,,,,,,90,97.5,107.5,107.5,107.5,48,F,Анна Юсупова,D,,
Yes,Raw,1,Kristina Chudnova,Amateur Teen 18-19,1994,Russia,53.7,,,,,,,,,95,105,115,115,115,56,F,Кристина Чуднова,D,,
Yes,Raw,1,Anna Goremykina,Amateur Juniors 20-23,1991,Russia,56,,,,,,,,,107.5,115,-122.5,115,115,56,F,Анна Горемыкина,D,,
Yes,Raw,1,Natalya Rebrova,Amateur Open,1976,Russia,55.4,,,,,,,,,107.5,115,122.5,122.5,122.5,56,F,Наталья Реброва,D,,
Yes,Raw,2,Aleksandra Kotova,Amateur Open,1979,Russia,54.3,,,,,,,,,92.5,100,105,105,105,56,F,Александра Котова,D,,
Yes,Raw,1,Irina Smirnova,Amateur Open,1988,Russia,57.5,,,,,,,,,100,110,117.5,117.5,117.5,60,F,Ирина Смирнова,D,,
Yes,Raw,1,Galina Kalinina,Amateur Open,1981,Russia,67,,,,,,,,,150,-155,-155,150,150,67.5,F,Галина Калинина,D,,
Yes,Raw,2,Ekaterina Korotkova,Amateur Open,1988,Russia,65.4,,,,,,,,,90,100,-117.5,100,100,67.5,F,Екатерина Короткова,D,,
Yes,Raw,DD,Alla Kalinichenko,Amateur Masters 40-44,1968,Russia,65,,,,,,,,,147.5,160,167.5,167.5,,67.5,F,Алла Калиниченко,D,,
Yes,Raw,1,Yuliya Metelitsa,Amateur Open,1990,Russia,75,,,,,,,,,110,125,130,130,130,75,F,Юлия Метелица,D,,
Yes,Raw,1,Elena Ovsyannikova,Amateur Masters 55-59,1953,Russia,69.4,,,,,,,,,75,85,90,90,90,75,F,Елена Овсянникова,D,,92.5
Yes,Raw,1,Maksim Makarov,Amateur Teen 16-17,1996,Russia,66.1,,,,,,,,,125,-140,-145,125,125,67.5,M,Максим Макаров,D,,
Yes,Raw,DQ,Evgeniy Veselov,Amateur Juniors 20-23,1992,Russia,66.3,,,,,,,,,-135,-150,-150,,,67.5,M,Евгений Веселов,D,,
Yes,Raw,1,Timur Abasov,Amateur Open,1988,Russia,67,,,,,,,,,200,217.5,-225,217.5,217.5,67.5,M,Тимур Абасов,D,,
Yes,Raw,2,Aleksandr Rek,Amateur Open,1987,Russia,65.5,,,,,,,,,185,-200,-200,185,185,67.5,M,Александр Рек,D,,
Yes,Raw,3,Mikhail Myzenkov,Amateur Open,1985,Russia,67.4,,,,,,,,,-155,-155,155,155,155,67.5,M,Михаил Мызенков,D,,
Yes,Raw,4,Anton Salin,Amateur Open,1987,Russia,63.3,,,,,,,,,-145,-145,145,145,145,67.5,M,Антон Салин,D,,
Yes,Raw,1,Vladimir Pechenkov,Amateur Teen 18-19,1994,Russia,72.8,,,,,,,,,-180,185,-187.5,185,185,75,M,Владимир Печенков,D,,
Yes,Raw,2,Andrey Trusikhin,Amateur Teen 18-19,1994,Russia,70.4,,,,,,,,,180,-190,-190,180,180,75,M,Андрей Трусихин,D,,
Yes,Raw,1,Viktor Yulusov,Amateur Juniors 20-23,1991,Russia,73.8,,,,,,,,,185,-195,202.5,202.5,202.5,75,M,Виктор Юлусов,D,,
Yes,Raw,2,Aleksandr Vorona,Amateur Juniors 20-23,1992,Russia,72.5,,,,,,,,,175,185,195,195,195,75,M,Александр Ворона,D,,
Yes,Raw,3,Anton Perepletchikov,Amateur Juniors 20-23,1990,Russia,73.4,,,,,,,,,170,190,-202.5,190,190,75,M,Антон Переплетчиков,D,,
Yes,Raw,4,Vladislav Chechetin,Amateur Juniors 20-23,1991,Russia,72.8,,,,,,,,,170,180,185,185,185,75,M,Владислав Чечетин,D,,
Yes,Raw,5,Aleksey Stepanets,Amateur Juniors 20-23,1991,Russia,73.2,,,,,,,,,180,-202.5,-202.5,180,180,75,M,Алексей Степанец,D,,
Yes,Raw,DQ,Aleksey Kryuchkov,Amateur Juniors 20-23,1990,Russia,73.7,,,,,,,,,-170,-170,-170,,,75,M,Алексей Крючков,D,,
Yes,Raw,DQ,Aleksandr Panteleev,Amateur Juniors 20-23,1991,Russia,74,,,,,,,,,-177.5,-202.5,-202.5,,,75,M,Александр Пантелеев,D,,
Yes,Raw,1,Mikhail Charov,Amateur Open,1989,Russia,73.9,,,,,,,,,215,225,-230,225,225,75,M,Михаил Чаров,D,,
Yes,Raw,2,Vladimir Bakaysa,Amateur Open,1985,Russia,74,,,,,,,,,200,210,215,215,215,75,M,Владимир Бакайса,D,,
Yes,Raw,3,Mikhail Sokolov,Amateur Open,1984,Russia,74.1,,,,,,,,,190,205,215,215,215,75,M,Михаил Соколов,D,,
Yes,Raw,4,Dmitriy Belov,Amateur Open,1974,Russia,74.9,,,,,,,,,175,202.5,210,210,210,75,M,Дмитрий Белов,D,,
Yes,Raw,5,Igor Kosaurov,Amateur Open,1981,Russia,73.2,,,,,,,,,177.5,192.5,202.5,202.5,202.5,75,M,Игорь Косауров,D,,
Yes,Raw,6,Ilkin Mekhtiev,Amateur Open,1986,Russia,73.2,,,,,,,,,180,-195,,180,180,75,M,Илькин Мехтиев,D,,
Yes,Raw,1,Viktor Popov #3,Amateur Masters 60-64,1952,Russia,74.6,,,,,,,,,195,-202.5,-202.5,195,195,75,M,Виктор Попов,D,,
Yes,Raw,1,Pavel Barkanov,Amateur Juniors 20-23,1993,Russia,77.2,,,,,,,,,190,-205,-205,190,190,82.5,M,Павел Барканов,D,,
Yes,Raw,2,Oleg Lepakhin,Amateur Juniors 20-23,1990,Russia,78.4,,,,,,,,,170,185,,185,185,82.5,M,Олег Лепахин,D,,
Yes,Raw,3,Vladimir Evsikov,Amateur Juniors 20-23,1991,Belarus,80.3,,,,,,,,,185,-200,,185,185,82.5,M,,D,,
Yes,Raw,DQ,Maksim Fomin,Amateur Juniors 20-23,1993,Russia,79.3,,,,,,,,,-165,-165,,,,82.5,M,Максим Фомин,D,,
Yes,Raw,1,Timur Tkhamokov,Amateur Open,1982,Russia,80.9,,,,,,,,,250,260,-270,260,260,82.5,M,Тимур Тхамоков,D,,
Yes,Raw,2,Aleksandr Mozzhukhin,Amateur Open,1984,Russia,82,,,,,,,,,215,222.5,-227.5,222.5,222.5,82.5,M,Александр Мозжухин,D,,
Yes,Raw,3,Sergey Ilyukhin,Amateur Open,1981,Russia,81.6,,,,,,,,,200,210,220,220,220,82.5,M,Сергей Илюхин,D,,
Yes,Raw,4,Vladislav Girko,Amateur Open,1987,Russia,81,,,,,,,,,215,-225,-225,215,215,82.5,M,Владислав Гирко,D,,
Yes,Raw,5,Ivan Mikryukov,Amateur Open,1987,Russia,79.9,,,,,,,,,200,-215,-215,200,200,82.5,M,Иван Микрюков,D,,
Yes,Raw,6,Kirill Taratinskiy,Amateur Open,1989,Russia,79.1,,,,,,,,,185,-190,190,190,190,82.5,M,Кирилл Таратинский,D,,
Yes,Raw,7,Maksim Baenkov,Amateur Open,1984,Russia,80.2,,,,,,,,,170,180,187.5,187.5,187.5,82.5,M,Максим Баенков,D,,
Yes,Raw,8,Vladimir Bobkin,Amateur Open,1987,Russia,81.6,,,,,,,,,170,185,187.5,187.5,187.5,82.5,M,Владимир Бобкин,D,,
Yes,Raw,9,Aleksandr Astakhov,Amateur Open,1985,Russia,76,,,,,,,,,-165,170,-182.5,170,170,82.5,M,Александр Астахов,D,,
Yes,Raw,DQ,Yuriy Kuznetsov,Amateur Open,1987,Russia,80.6,,,,,,,,,-200,-200,-215,,,82.5,M,Юрий Кузнецов,D,,
Yes,Raw,DQ,Vitaliy Petrenko,Amateur Open,1986,Russia,81.6,,,,,,,,,-200,,,,,82.5,M,Виталий Петренко,D,,
Yes,Raw,DQ,Konstantin Sapunkov,Amateur Open,1981,Russia,82.5,,,,,,,,,-220,,,,,82.5,M,Константин Сапунков,D,,
Yes,Raw,1,Vladimir Ermokhin,Amateur Masters 50-54,1961,Russia,75.5,,,,,,,,,160,170,175,175,175,82.5,M,Владимир Ермохин,D,,
Yes,Raw,1,Egor Shepelev,Amateur Teen 16-17,1996,Russia,85,,,,,,,,,132.5,155,170,170,170,90,M,Егор Шепелев,D,,
Yes,Raw,1,Aleksey Moshkov,Amateur Teen 18-19,1993,Russia,90,,,,,,,,,160,180,-195,180,180,90,M,Алексей Мошков,D,,
Yes,Raw,1,Dmitriy Mostovoy,Amateur Juniors 20-23,1991,Russia,88.4,,,,,,,,,-190,195,205,205,205,90,M,Дмитрий Мостовой,D,,
Yes,Raw,2,Vladimir Shik,Amateur Juniors 20-23,1990,Russia,89.3,,,,,,,,,170,180,-195,180,180,90,M,Владимир Шик,D,,
Yes,Raw,1,Dmitriy Dyatlov,Amateur Open,1973,Russia,90,,,,,,,,,240,250,255,255,255,90,M,Дмитрий Дятлов,D,,
Yes,Raw,3,Aleksey Kholkovskiy,Amateur Open,1974,Russia,88.7,,,,,,,,,205,215,-222.5,215,215,90,M,Алексей Холковский,D,,
Yes,Raw,4,Yuriy Kubyshkin,Amateur Open,1984,Russia,85.1,,,,,,,,,205,212.5,-222.5,212.5,212.5,90,M,Юрий Кубышкин,D,,
Yes,Raw,5,Andrey Kadilenko,Amateur Open,1985,Russia,84.9,,,,,,,,,195,210,-222.5,210,210,90,M,Андрей Кадиленко,D,,
Yes,Raw,6,Ivan Slavinskiy,Amateur Open,1983,Russia,88.3,,,,,,,,,200,210,-222.5,210,210,90,M,Иван Славинский,D,,
Yes,Raw,7,Anton Likhodedov,Amateur Open,1977,Russia,89.4,,,,,,,,,200,210,-215,210,210,90,M,Антон Лиходедов,D,,
Yes,Raw,8,Anton Goloschapov,Amateur Open,1989,Russia,87.8,,,,,,,,,195,207.5,-220,207.5,207.5,90,M,Антон Голощапов,D,,
Yes,Raw,9,Pavel Lobzov,Amateur Open,1974,Russia,86.8,,,,,,,,,100,150,200,200,200,90,M,Павел Лобзов,D,,
Yes,Raw,10,Vladimir Alekseev,Amateur Open,1987,Russia,88.7,,,,,,,,,195,-205,,195,195,90,M,Владимир Алексеев,D,,
Yes,Raw,DD,Ivan Kondrashin,Amateur Open,1987,Russia,85.4,,,,,,,,,222.5,-227.5,-227.5,222.5,,90,M,Иван Кондрашин,D,,
Yes,Raw,1,Sergey Sorokin,Amateur Masters 40-44,1973,Russia,88,,,,,,,,,185,195,205,205,205,90,M,Сергей Сорокин,D,,
Yes,Raw,2,Igor Zakharov,Amateur Masters 40-44,1969,Russia,89.1,,,,,,,,,170,180,-185,180,180,90,M,Игорь Захаров,D,,
Yes,Raw,1,Vladimir Fokin,Amateur Masters 45-49,1965,Russia,85,,,,,,,,,210,222.5,-230,222.5,222.5,90,M,Владимир Фокин,D,,
Yes,Raw,1,Nikolay Novikov,Amateur Masters 75-79,1938,Russia,89.6,,,,,,,,,-140,140,150,150,150,90,M,Николай Новиков,D,,
Yes,Raw,1,Evgeniy Petrov,Amateur Teen 16-17,1996,Russia,96.2,,,,,,,,,165,177.5,185,185,185,100,M,Евгений Петров,D,,
Yes,Raw,2,Nikita Golovan,Amateur Teen 16-17,1996,Russia,96.6,,,,,,,,,150,180,-202.5,180,180,100,M,Никита Головань,D,,
Yes,Raw,1,Aleksandr Shabrov,Amateur Juniors 20-23,1991,Russia,92.8,,,,,,,,,-260,267.5,275,275,275,100,M,Александр Шабров,D,,-280
Yes,Raw,2,Bogdan Shevchenko,Amateur Juniors 20-23,1991,Russia,98.7,,,,,,,,,-170,180,-202.5,180,180,100,M,Богдан Шевченко,D,,
Yes,Raw,1,Dmitriy Kurinov,Amateur Open,1974,Russia,95,,,,,,,,,250,257.5,-260,257.5,257.5,100,M,Дмитрий Куринов,D,,
Yes,Raw,2,Andrey Galeev,Amateur Open,1983,Russia,95.9,,,,,,,,,240,250,-260,250,250,100,M,Андрей Галеев,D,,
Yes,Raw,3,Sergey Shukelovich,Amateur Open,1984,Russia,94.7,,,,,,,,,220,232.5,-240,232.5,232.5,100,M,Сергей Шукелович,D,,
Yes,Raw,4,Sergey Kovalchuk,Amateur Open,1986,Russia,97.7,,,,,,,,,232.5,-245,-245,232.5,232.5,100,M,Сергей Ковальчук,D,,
Yes,Raw,5,Aleksandr Smirnov,Amateur Open,1974,Russia,99,,,,,,,,,200,-207.5,-207.5,200,200,100,M,Александр Смирнов,D,,
Yes,Raw,1,Aleksey Popov #12,Amateur Masters 40-44,1968,,99,,,,,,,,,200,220,-240,220,220,100,M,,D,,
Yes,Raw,1,Vladimir Kalinin,Amateur Masters 50-54,1960,Russia,93.4,,,,,,,,,160,177.5,185,185,185,100,M,Владимир Калинин,D,,
Yes,Raw,2,Eduard Tarasov,Amateur Masters 50-54,1962,Russia,91.6,,,,,,,,,165,177.5,-185,177.5,177.5,100,M,Эдуард Тарасов,D,,
Yes,Raw,1,Vilgem Nakhatakyan,Amateur Juniors 20-23,1992,Russia,108.6,,,,,,,,,230,240,257.5,257.5,257.5,110,M,Вильгем Нахатакян,D,,
Yes,Raw,2,Ruslan Kulebyakin,Amateur Juniors 20-23,1991,Russia,106.5,,,,,,,,,230,245,255,255,255,110,M,Руслан Кулебякин,D,,
Yes,Raw,3,Roman Kalinin,Amateur Juniors 20-23,1990,Russia,103.6,,,,,,,,,220,240,-245,240,240,110,M,Роман Калинин,D,,
Yes,Raw,1,Aleksandr Tarakin,Amateur Open,1986,Russia,109.9,,,,,,,,,240,-250,-250,240,240,110,M,Александр Таракин,D,,
Yes,Raw,2,Roman Yakovlev,Amateur Open,1988,Russia,107.4,,,,,,,,,200,207.5,210,210,210,110,M,Роман Яковлев,D,,
Yes,Raw,DD,Aleksandr Mityaev,Amateur Open,1981,Russia,106,,,,,,,,,-220,220,240,240,,110,M,Александр Митяев,D,,
Yes,Raw,DD,Artem Artyukhov,Amateur Open,1987,Russia,108.3,,,,,,,,,230,240,,240,,110,M,Артем Артюхов,D,,
Yes,Raw,1,Andrey Shishkin,Amateur Masters 50-54,1962,Russia,109.8,,,,,,,,,185,225,245,245,245,110,M,Андрей Шишкин,D,,
Yes,Raw,1,Sergey Eliseev,Amateur Open,1979,Russia,119,,,,,,,,,247.5,260,277.5,277.5,277.5,125,M,Сергей Елисеев,D,,
Yes,Raw,2,Sergey Povstanyuk,Amateur Open,1985,Russia,110.4,,,,,,,,,225,230,235,235,235,125,M,Сергей Повстанюк,D,,
Yes,Raw,3,Dmitriy Zubarev,Amateur Open,1987,Russia,120.8,,,,,,,,,215,-220,-220,215,215,125,M,Дмитрий Зубарев,D,,
Yes,Raw,1,Aleksandr Zorikhin,Amateur Teen 13-15,1997,Russia,129,,,,,,,,,137.5,145,147.5,147.5,147.5,140,M,Александр Зорихин,D,,
Yes,Raw,1,Aleksey Galygin,Amateur Open,1977,Russia,142.6,,,,,,,,,260,280,290,290,290,140+,M,Алексей Галыгин,D,,
Yes,Multi-ply,DQ,Nikolay Medved,Amateur Open,1989,Russia,74.7,,,,,,,,,,,,,,75,M,Николай Медведь,D,,
Yes,Multi-ply,DQ,Aleksey Petrov,Amateur Open,1978,Russia,74.7,,,,,,,,,,,,,,75,M,Алексей Петров,D,,
Yes,Multi-ply,DQ,Aleksey Selischev,Amateur Open,1978,Russia,81.6,,,,,,,,,,,,,,82.5,M,Алексей Селищев,D,,
Yes,Multi-ply,DQ,Mikhail Kozachuk,Amateur Masters 45-49,1963,Russia,89.3,,,,,,,,,,,,,,90,M,Михаил Козачук,D,,
Yes,Multi-ply,DQ,Petr Samko,Amateur Open,1987,Russia,90.8,,,,,,,,,,,,,,100,M,Петр Самко,D,,
No,Raw,1,Tatyana Kononova,Pro Open,1988,Russia,42.8,,,,,45,50,-55,50,,,,,50,44,F,Татьяна Кононова,B,,
No,Raw,1,Elena Geyko,Pro Teen 13-15,1997,Russia,51.8,,,,,37.5,42.5,-47.5,42.5,,,,,42.5,52,F,Елена Гейко,B,,
No,Raw,1,Elena Zabelina,Pro Open,1983,Russia,51.5,,,,,65,72.5,-80,72.5,,,,,72.5,52,F,Елена Забелина,B,,
No,Raw,1,Alina Fadeeva,Pro Open,1988,Russia,66.5,,,,,95,-100,,95,,,,,95,67.5,F,Алина Фадеева,B,,
No,Raw,1,Nikita Vasilyev,Pro Teen 13-15,1998,Russia,73.6,,,,,70,-75,-75,70,,,,,70,75,M,Никита Васильев,B,,
No,Raw,1,Ilya Katigaridi,Pro Teen 16-17,1997,Russia,73.8,,,,,75,82.5,85,85,,,,,85,75,M,Илья Катигариди,B,,
No,Raw,1,Nikolay Petrakovich,Pro Open,1979,Russia,75,,,,,130,135,-140,135,,,,,135,75,M,Николай Петракович,B,,
No,Raw,2,Valeriy Kovalev,Pro Open,1981,Russia,74.2,,,,,105,110,-115,110,,,,,110,75,M,Валерий Ковалев,B,,
No,Raw,3,Vadim Arendaruk,Pro Open,1982,Russia,73,,,,,90,-100,100,100,,,,,100,75,M,Вадим Арендарук,B,,
No,Raw,1,Nikolay Ionov,Pro Masters 60-64,1949,Russia,74,,,,,100,105,111,111,,,,,111,75,M,Николай Ионов,B,,
No,Raw,2,Yuriy Ermolin,Pro Masters 60-64,1952,Russia,72.9,,,,,100,100.5,-110.5,100.5,,,,,100.5,75,M,Юрий Ермолин,B,,
No,Raw,1,Maksim Kurchaev,Pro Teen 13-15,1998,Russia,79.3,,,,,-75,75,-82.5,75,,,,,75,82.5,M,Максим Курчаев,B,,
No,Raw,1,Anton Rogozhin,Pro Teen 18-19,1994,Russia,81.8,,,,,55,75,-80,75,,,,,75,82.5,M,Антон Рогожин,B,,
No,Raw,1,Dmitriy Kazakov,Pro Juniors 20-23,1990,Russia,80,,,,,155,-162.5,-162.5,155,,,,,155,82.5,M,Дмитрий Казаков,B,,
No,Raw,2,Rinat Khusainov,Pro Juniors 20-23,1993,Russia,79,,,,,120,135,-147.5,135,,,,,135,82.5,M,Ринат Хусаинов,B,,
No,Raw,3,Vladislav Dolgopolov,Pro Juniors 20-23,1991,Russia,80.9,,,,,122.5,130,132.5,132.5,,,,,132.5,82.5,M,Владислав Долгополов,B,,
No,Raw,1,Denis Nikitin,Pro Open,1988,Russia,80.6,,,,,170,182.5,192.5,192.5,,,,,192.5,82.5,M,Денис Никитин,B,,
No,Raw,2,Pavel Silushin,Pro Open,1989,Russia,82.2,,,,,165,172.5,177.5,177.5,,,,,177.5,82.5,M,Павел Силушин,B,,
No,Raw,3,Dmitriy Kazakov,Pro Open,1990,Russia,80,,,,,155,,,155,,,,,155,82.5,M,Дмитрий Казаков,B,,
No,Raw,4,Viktor Volodin,Pro Open,1987,Russia,82.1,,,,,130,-147.5,-147.5,130,,,,,130,82.5,M,Виктор Володин,B,,
No,Raw,1,Vladimir Fateev,Pro Masters 45-49,1964,Russia,78.9,,,,,125,127.5,-130,127.5,,,,,127.5,82.5,M,Владимир Фатеев,B,,
No,Raw,1,Aleksey Molochkov,Pro Masters 50-54,1962,Russia,82.3,,,,,140,145,-155,145,,,,,145,82.5,M,Алексей Молочков,B,,
No,Raw,1,Amir Khusnutdinov,Pro Masters 65-69,1948,Russia,81.2,,,,,110,120,125,125,,,,,125,82.5,M,Амир Хуснутдинов,B,,
No,Raw,1,Ruslan Nevyarovskiy,Pro Teen 13-15,1998,Russia,87.7,,,,,90,97.5,-102.5,97.5,,,,,97.5,90,M,Руслан Невяровский,B,,
No,Raw,1,Aleksey Morkva,Pro Juniors 20-23,1991,Russia,88.4,,,,,130,135,140,140,,,,,140,90,M,Алексей Морква,B,,
No,Raw,1,Dmitriy Shumilov,Pro Open,1981,Russia,87.4,,,,,175,180,185,185,,,,,185,90,M,Дмитрий Шумилов,B,,
No,Raw,2,Ruslan Savostyanov,Pro Open,1985,Russia,88.1,,,,,180,-185,-185,180,,,,,180,90,M,Руслан Савостьянов,B,,
No,Raw,3,Andrey Latyshev,Pro Open,1973,Russia,89,,,,,180,-187.5,-187.5,180,,,,,180,90,M,Андрей Латышев,B,,
No,Raw,4,Ivan Kashubo,Pro Open,1983,Russia,87.2,,,,,160,-180,-180,160,,,,,160,90,M,Иван Кашубо,B,,
No,Raw,5,Aleksandr Garnagin,Pro Open,1975,Russia,86.6,,,,,-140,140,,140,,,,,140,90,M,Александр Гарнагин,B,,
No,Raw,6,Evgeniy Smirnov,Pro Open,1983,Russia,86,,,,,130,137.5,-142.5,137.5,,,,,137.5,90,M,Евгений Смирнов,B,,
No,Raw,DQ,Maksim Tsukanov,Pro Open,1988,Russia,86.7,,,,,-120,-130,-130,,,,,,,90,M,Максим Цуканов,B,,
No,Raw,DQ,Sergey Timchenko,Pro Open,1979,Russia,90,,,,,-180,-180,,,,,,,,90,M,Сергей Тимченко,B,,
No,Raw,DQ,Aleksandr Fedorov,Pro Open,1976,Russia,90,,,,,-172.5,,,,,,,,,90,M,Александр Федоров,B,,
No,Raw,1,Andrey Latyshev,Pro Masters 40-44,1973,Russia,89,,,,,180,,,180,,,,,180,90,M,Андрей Латышев,B,,
No,Raw,2,Konstantin Pasechnik,Pro Masters 40-44,1972,Russia,88.8,,,,,150,160,170,170,,,,,170,90,M,Константин Пасечник,B,,
No,Raw,DQ,Mikhail Solomatin,Pro Masters 40-44,1970,Russia,87.5,,,,,-175,-175,-175,,,,,,,90,M,Михаил Соломатин,B,,
No,Raw,1,Aleksandr Fedorov,Pro Masters 45-49,1968,Russia,90,,,,,172.5,180,-185,180,,,,,180,90,M,Александр Федоров,B,,
No,Raw,1,Nikolay Kostev,Pro Masters 50-54,1959,Russia,88.4,,,,,145,155,165,165,,,,,165,90,M,Николай Костев,B,,
No,Raw,1,Aleksandr Vdovushkin,Pro Masters 55-59,1956,Russia,87.8,,,,,135,-145,-145,135,,,,,135,90,M,Александр Вдовушкин,B,,
No,Raw,1,Vitaliy Chudaykin,Pro Juniors 20-23,1991,Russia,97.5,,,,,150,160,-165,160,,,,,160,100,M,Виталий Чудайкин,B,,
No,Raw,1,Ibragim Hamhoev,Pro Open,1985,Russia,97.8,,,,,190,195,202.5,202.5,,,,,202.5,100,M,Ибрагим Хамхоев,B,-220.5,
No,Raw,2,Aleksey Esakov,Pro Open,1977,Russia,98.8,,,,,190,195,-200,195,,,,,195,100,M,Алексей Есаков,B,,
No,Raw,3,Artem Golovin,Pro Open,1977,Russia,98.4,,,,,180,190,-192.5,190,,,,,190,100,M,Артем Головин,B,,
No,Raw,4,Mikhail Konoplev,Pro Open,1988,Russia,96,,,,,165,175,180,180,,,,,180,100,M,Михаил Коноплев,B,,
No,Raw,5,Aleksandr Tyschenko,Pro Open,1986,Russia,97.6,,,,,170,180,-190,180,,,,,180,100,M,Александр Тыщенко,B,,
No,Raw,6,Aleksey Sautin,Pro Open,1976,Russia,98.1,,,,,160,165,-170,165,,,,,165,100,M,Алексей Саутин,B,,
No,Raw,7,Denis Zaytsev,Pro Open,1983,Russia,91,,,,,150,160,-165,160,,,,,160,100,M,Денис Зайцев,B,,
No,Raw,DQ,Pavel Papenkov,Pro Open,1980,Russia,99.6,,,,,-170,-175,-175,,,,,,,100,M,Павел Папенков,B,,
No,Raw,1,Vyacheslav Nechpal,Pro Masters 40-44,1973,Russia,93,,,,,165,170,180,180,,,,,180,100,M,Вячеслав Нечпал,B,,
No,Raw,2,Arkadiy Simakov,Pro Masters 40-44,1973,Russia,100,,,,,170,-180,-182.5,170,,,,,170,100,M,Аркадий Симаков,B,,
No,Raw,1,Aleksandr Dmitriev,Pro Masters 45-49,1964,Russia,99.4,,,,,150,160,165,165,,,,,165,100,M,Александр Дмитриев,B,,
No,Raw,2,Aleksey Yagunov,Pro Masters 45-49,1968,Russia,94.5,,,,,140,150,-160,150,,,,,150,100,M,Алексей Ягунов,B,,
No,Raw,1,Sergey Stepanov,Pro Masters 50-54,1962,Russia,98.3,,,,,70,80,-82.5,80,,,,,80,100,M,Сергей Степанов,B,,
No,Raw,1,Nizami Tagiev,Pro Juniors 20-23,1991,Russia,109.3,,,,,190,200,-207.5,200,,,,,200,110,M,Низами Тагиев,B,,
No,Raw,2,Ilya Panchenko,Pro Juniors 20-23,1992,Russia,105.3,,,,,180,190,,190,,,,,190,110,M,Илья Панченко,B,,
No,Raw,1,Vladimir Svinarchuk,Pro Open,1983,Russia,106.8,,,,,220,227.5,232.5,232.5,,,,,232.5,110,M,Владимир Свинарчук,B,,
No,Raw,2,Sergey Smigunov,Pro Open,1984,Russia,103.9,,,,,190,202.5,220,220,,,,,220,110,M,Сергей Смигунов,B,,
No,Raw,3,Aleksandr Kislitsyn,Pro Open,1977,Russia,107.8,,,,,197.5,205,-215,205,,,,,205,110,M,Александр Кислицын,B,,
No,Raw,4,Ilya Karamnov,Pro Open,1987,Russia,104.2,,,,,185,197.5,202.5,202.5,,,,,202.5,110,M,Илья Карамнов,B,,
No,Raw,5,Yuriy Molodtsov,Pro Open,1975,Russia,105.9,,,,,180,-190,-190,180,,,,,180,110,M,Юрий Молодцов,B,,
No,Raw,6,Aleksandr Savitskiy,Pro Open,1986,Russia,103.5,,,,,-150,160,-162.5,160,,,,,160,110,M,Александр Савицкий,B,,
No,Raw,1,Andrey Mishin,Pro Masters 40-44,1973,Russia,103.1,,,,,140,150,155,155,,,,,155,110,M,Андрей Мишин,B,,
No,Raw,1,Igor Lipachev,Pro Masters 45-49,1968,Russia,104.5,,,,,,-220,220,220,,,,,220,110,M,Игорь Липачев,B,-225,
No,Raw,2,Nikolay Dubina,Pro Masters 45-49,1966,Russia,108.5,,,,,175,185,-195,185,,,,,185,110,M,Николай Дубина,B,,
No,Raw,1,Anatoliy Serbin,Pro Juniors 20-23,1990,Russia,117.9,,,,,225,240,250,250,,,,,250,125,M,Анатолий Сербин,B,,
No,Raw,1,Mikhail Nikolaev,Pro Open,1961,Russia,123.8,,,,,227.5,,,227.5,,,,,227.5,125,M,Михаил Николаев,B,,
No,Raw,2,Boris Vaskov,Pro Open,1988,Russia,120.1,,,,,200,210,-220,210,,,,,210,125,M,Борис Васьков,B,,
No,Raw,3,Nikita Anisimov,Pro Open,1988,Russia,117.5,,,,,205,-210,-210,205,,,,,205,125,M,Никита Анисимов,B,,
No,Raw,4,Ilya Sinyakov,Pro Open,1977,Russia,111.4,,,,,190,195,200,200,,,,,200,125,M,Илья Синяков,B,,
No,Raw,5,Viktor Krylov,Pro Open,1985,Russia,122.4,,,,,190,200,-207.5,200,,,,,200,125,M,Виктор Крылов,B,,
No,Raw,DQ,Rafael Avakov,Pro Open,1986,Russia,118.6,,,,,-180,-180,-180,,,,,,,125,M,Рафаэль Аваков,B,,
No,Raw,1,Sergey Zimin,Pro Masters 40-44,1972,Russia,123.4,,,,,215,225,232.5,232.5,,,,,232.5,125,M,Сергей Зимин,B,,
No,Raw,1,Mikhail Nikolaev,Pro Masters 50-54,1961,Russia,123.8,,,,,220,225,227.5,227.5,,,,,227.5,125,M,Михаил Николаев,B,,
No,Raw,1,Anatoliy Pauyesov,Pro Masters 60-64,1953,Russia,118.7,,,,,157.5,162.5,,162.5,,,,,162.5,125,M,Анатолий Пауесов,B,,
No,Single-ply,DQ,Valentin Polivyanov,Pro Open,1988,Russia,73.9,,,,,-145,-145,-145,,,,,,,75,M,Валентин Поливянов,B,,
No,Single-ply,1,Valeriy Kozlovskiy,Pro Open,1982,Russia,90,,,,,-230,230,235,235,,,,,235,90,M,Валерий Козловский,B,,
No,Single-ply,2,Sergey Komkov,Pro Open,1987,Russia,88.8,,,,,165,-170,170,170,,,,,170,90,M,Сергей Комков,B,,
No,Single-ply,1,Sergey Mokhov,Pro Juniors 20-23,1990,Russia,96.2,,,,,210,220,230,230,,,,,230,100,M,Сергей Мохов,B,,
No,Single-ply,1,Evgeniy Gornostaev,Pro Open,1979,Russia,99.4,,,,,225,232.5,-237.5,232.5,,,,,232.5,100,M,Евгений Горностаев,B,,
No,Single-ply,2,Kirill Yurshin,Pro Open,1988,Russia,90.7,,,,,-230,230,-240,230,,,,,230,100,M,Кирилл Юршин,B,,
No,Single-ply,3,Sergey Mokhov,Pro Open,1990,Russia,96,,,,,210,220,230,230,,,,,230,100,M,Сергей Мохов,B,,
No,Single-ply,4,Aleksey Shuvalov,Pro Open,1989,Russia,99.9,,,,,-170,170,-192.5,170,,,,,170,100,M,Алексей Шувалов,B,,
No,Single-ply,DQ,Sergey Rukavishnikov,Pro Open,1988,Russia,102.5,,,,,-280,-280,,,,,,,,110,M,Сергей Рукавишников,B,,
No,Single-ply,1,Roman Zalutskiy,Pro Open,1979,Russia,120.2,,,,,290,300,305,305,,,,,305,125,M,Роман Залуцкий,B,,
No,Multi-ply,1,Aleksey Schipanov,Pro Open,1980,Russia,70.1,,,,,130,135,-140,135,,,,,135,75,M,Алексей Щипанов,B,,
No,Multi-ply,2,Roman Korshunov,Pro Open,1980,Russia,73,,,,,130,-142.5,-142.5,130,,,,,130,75,M,Роман Коршунов,B,,
No,Multi-ply,1,Alexander Petrov,Pro Masters 50-54,1960,Russia,89.7,,,,,240,250,260,260,,,,,260,90,M,Александр Петров,B,,
No,Multi-ply,1,Mikhail Royanov,Pro Open,1977,Russia,98.9,,,,,225,-240,-242.5,225,,,,,225,100,M,Михаил Роянов,B,,
No,Multi-ply,2,Roman Terekhov,Pro Open,1981,Russia,97,,,,,185,-205,,185,,,,,185,100,M,Роман Терехов,B,,
No,Multi-ply,DQ,Roman Brekhov,Pro Juniors 20-23,1990,Russia,108.3,,,,,-240,-260,-265,,,,,,,110,M,Роман Брехов,B,,
No,Multi-ply,1,Dmitriy Permyakov,Pro Open,1975,Russia,129.7,,,,,320,330,,330,,,,,330,140,M,Дмитрий Пермяков,B,,
No,Raw,1,Viktoriya Reshetnikova,Pro Juniors 20-23,1990,Russia,52,,,,,,,,,80,90,-92.5,90,90,52,F,Виктория Решетникова,D,,
No,Raw,1,Nina Alekseevskaya,Pro Open,1983,Russia,51,,,,,,,,,85,95,102.5,102.5,102.5,52,F,Нина Алексеевская,D,,
No,Raw,1,Valeriya Rogozhina,Pro Juniors 20-23,1989,Russia,54.5,,,,,,,,,-95,95,105,105,105,56,F,Валерия Рогожина,D,,
No,Raw,1,Anastasiya Pererva,Pro Open,1987,Russia,58.1,,,,,,,,,90,97.5,-102.5,97.5,97.5,60,F,Анастасия Перерва,D,,
No,Raw,1,Alina Fadeeva,Pro Open,1988,Russia,67.4,,,,,,,,,150,-160,,150,150,67.5,F,Алина Фадеева,D,,
No,Raw,1,Viktoriya Parfenova,Pro Open,1989,Russia,102.5,,,,,,,,,115,125,-135,125,125,90+,F,Виктория Парфенова,D,,
No,Raw,1,Viktor Shubin,Pro Teen 13-15,1997,Russia,64.2,,,,,,,,,105,115,125,125,125,67.5,M,Виктор Шубин,D,,
No,Raw,1,Rinat Fayzullin,Pro Juniors 20-23,1990,Russia,63.7,,,,,,,,,135,145,152.5,152.5,152.5,67.5,M,Ринат Файзуллин,D,,
No,Raw,2,Dmitriy Barkov,Pro Juniors 20-23,1992,Russia,65.7,,,,,,,,,120,135,-140,135,135,67.5,M,Дмитрий Барков,D,,
No,Raw,1,Roman Nasibullin,Pro Open,1989,Russia,63.6,,,,,,,,,105,115,125,125,125,67.5,M,Роман Насибуллин,D,,
No,Raw,1,Ilya Katigaridi,Pro Teen 16-17,1997,Russia,73.8,,,,,,,,,135,145,155,155,155,75,M,Илья Катигариди,D,,
No,Raw,1,Aleksandr Malevskiy,Pro Teen 18-19,1995,Russia,73.1,,,,,,,,,140,150,-160,150,150,75,M,Александр Малевский,D,,
No,Raw,1,Vadim Demyanenko,Pro Juniors 20-23,1990,Russia,70.6,,,,,,,,,160,175,185,185,185,75,M,Вадим Демьяненко,D,,
No,Raw,DQ,Vladislav Ivaschenko,Pro Open,1988,Russia,74.2,,,,,,,,,-170,-171,-172,,,75,M,Владислав Иващенко,D,,
No,Raw,1,Maksim Kurchaev,Pro Teen 13-15,1998,Russia,79.3,,,,,,,,,145,155,-162.5,155,155,82.5,M,Максим Курчаев,D,,
No,Raw,1,Aleksey Chekashkin,Pro Teen 18-19,1993,Russia,79.6,,,,,,,,,150,160,170,170,170,82.5,M,Алексей Чекашкин,D,,
No,Raw,2,Anton Rogozhin,Pro Teen 18-19,1994,Russia,81.8,,,,,,,,,130,150,160,160,160,82.5,M,Антон Рогожин,D,,
No,Raw,1,Andrey Sivaev,Pro Juniors 20-23,1992,Russia,75.5,,,,,,,,,222.5,-232.5,,222.5,222.5,82.5,M,Андрей Сиваев,D,,
No,Raw,2,Kirill Matveev,Pro Juniors 20-23,1991,Russia,80.8,,,,,,,,,140,150,-160,150,150,82.5,M,Кирилл Матвеев,D,,
No,Raw,1,Ruslan Nevyarovskiy,Pro Teen 13-15,1998,Russia,87.7,,,,,,,,,145,-155,-155,145,145,90,M,Руслан Невяровский,D,,
No,Raw,1,Artem Kayumov,Pro Teen 18-19,1994,Russia,88.1,,,,,,,,,-210,217.5,-230,217.5,217.5,90,M,Артем Каюмов,D,,
No,Raw,1,Nikolay Maksimovskiy,Pro Juniors 20-23,1990,Russia,84.8,,,,,,,,,180,200,215,215,215,90,M,Николай Максимовский,D,,
No,Raw,2,Tarik Rayan,Pro Juniors 20-23,1991,Russia,89.4,,,,,,,,,190,201,212.5,212.5,212.5,90,M,Тарик Райан,D,,
No,Raw,1,Ivan Kashubo,Pro Open,1983,Russia,87.2,,,,,,,,,240,265,275,275,275,90,M,Иван Кашубо,D,,
No,Raw,2,Oleg Khromov,Pro Open,1978,Russia,89.1,,,,,,,,,190,200,-210,200,200,90,M,Олег Хромов,D,,
No,Raw,DQ,Sergey Goryunov,Pro Open,1987,Russia,84.9,,,,,,,,,-230,-230,-230,,,90,M,Сергей Горюнов,D,,
No,Raw,1,Georgiy Lazaridi,Pro Masters 80-84,1933,Russia,85.4,,,,,,,,,160,,,160,160,90,M,Георгий Лазариди,D,,
No,Raw,1,Mikhail Bochkov,Pro Open,1988,Russia,99.3,,,,,,,,,280,300,310,310,310,100,M,Михаил Бочков,D,,
No,Raw,2,Aleksey Smirnov,Pro Open,1977,Russia,99.1,,,,,,,,,270,280,-290,280,280,100,M,Алексей Смирнов,D,,
No,Raw,3,Vladimir Amosov,Pro Open,1982,Russia,94.5,,,,,,,,,240,255,-265,255,255,100,M,Владимир Амосов,D,,
No,Raw,1,Aleksey Yagunov,Pro Masters 45-49,1968,Russia,96.2,,,,,,,,,195,205,215,215,215,100,M,Алексей Ягунов,D,,
No,Raw,1,Vadim Zaytsev,Pro Masters 50-54,1960,Russia,92.9,,,,,,,,,240,260,,260,260,100,M,Вадим Зайцев,D,,
No,Raw,1,Aleksey Baryshev,Pro Open,1989,Russia,104.8,,,,,,,,,325,337.5,,337.5,337.5,110,M,Алексей Барышев,D,,
No,Raw,2,Dmitriy Semenin,Pro Open,1983,Russia,108.9,,,,,,,,,300,-315,-315,300,300,110,M,Дмитрий Семенин,D,,
No,Raw,1,Andrey Aksenov #1,Pro Juniors 20-23,1992,Russia,123.4,,,,,,,,,270,280,-295,280,280,125,M,Андрей Аксенов,D,,
No,Raw,2,Stepan Ivaschenko,Pro Juniors 20-23,1992,Russia,120,,,,,,,,,240,257.5,-270,257.5,257.5,125,M,Степан Иващенко,D,,
No,Raw,1,Aleksey Bareyshin,Pro Open,1981,Russia,111.8,,,,,,,,,300,315,,315,315,125,M,Алексей Барейшин,D,,
No,Raw,DQ,Oleg Livshits,Pro Open,1973,Russia,139.7,,,,,,,,,-300,,,,,140,M,Олег Лившиц,D,,
No,Multi-ply,1,Roman Korshunov,Pro Open,1980,Russia,73,,,,,,,,,175,190,-205,190,190,75,M,Роман Коршунов,D,,
No,Multi-ply,2,Vadim Arendaruk,Pro Open,1982,Russia,73,,,,,,,,,170,180,-185,180,180,75,M,Вадим Арендарук,D,,
No,Multi-ply,3,Vladislav Ivaschenko,Pro Open,1988,Russia,74.5,,,,,,,,,140,-160,,140,140,75,M,Владислав Иващенко,D,,
No,Multi-ply,DQ,Aleksey Koshuba,Pro Open,1980,Russia,82,,,,,,,,,-250,-260,-260,,,82.5,M,Алексей Кошуба,D,,
No,Multi-ply,1,Aleksey Nikolaev,Pro Open,1984,Russia,87.3,,,,,,,,,250,260,-270,260,260,90,M,Алексей Николаев,D,,
No,Multi-ply,1,Yuriy Sergeev,Pro Juniors 20-23,1993,Russia,103,,,,,,,,,230,255,-260,255,255,110,M,Юрий Сергеев,D,,
No,Multi-ply,1,Timur Andreev,Pro Open,1983,Russia,109.7,,,,,,,,,-350,350,-360,350,350,110,M,Тимур Андреев,D,,
No,Multi-ply,2,Aleksandr Kondratyev #3,Pro Open,1977,Russia,104.3,,,,,,,,,255,-270,-280,255,255,110,M,Александр Кондратьев,D,,
No,Multi-ply,3,Denis Gurov,Pro Open,1988,Russia,106.2,,,,,,,,,190,-205,205,205,205,110,M,Денис Гуров,D,,
No,Multi-ply,1,Oleg Livshits,Pro Masters 40-44,1973,Russia,139.7,,,,,,,,,320,-350,,320,320,140,M,Олег Лившиц,D,,
