Division,WeightClassKg,Place,Name,Team,BodyweightKg,Best3SquatKg,Best3BenchKg,Best3DeadliftKg,TotalKg,Equipment,Event,Sex
Boys,51.71,1,Eric Hernandez,New London West Rusk,50.71,120.2,79.38,138.35,337.93,Single-ply,SBD,M
Boys,51.71,2,Landon Warren,Bullard,48.53,92.99,52.16,106.59,251.74,Single-ply,SBD,M
Boys,55.79,1,Eric Reaper,Tyler Chapel Hill,55.38,181.44,106.59,156.49,444.52,Single-ply,SBD,M
Boys,55.79,2,Angel Barroso,Tyler Chapel Hill,54.43,136.08,99.79,151.95,387.82,Single-ply,SBD,M
Boys,55.79,3,Carter Winegeart,Tyler Lee,55.79,138.35,77.11,145.15,360.61,Single-ply,SBD,M
Boys,55.79,4,Jaidon Garrick,Lindale,53.25,131.54,65.77,145.15,342.46,Single-ply,SBD,M
Boys,55.79,5,Eddie Hernandez,New London West Rusk,54.43,117.93,81.65,136.08,335.66,Single-ply,SBD,M
Boys,55.79,6,Aaron Blake,Tyler Chapel Hill,55.75,115.67,52.16,136.08,303.91,Single-ply,SBD,M
Boys,59.87,1,Jaden Taylor,Lindale,58.79,154.22,72.57,154.22,381.02,Single-ply,SBD,M
Boys,59.87,2,JJ Beckfield,Frankston,59.87,156.49,72.57,147.42,376.48,Single-ply,SBD,M
Boys,59.87,3,Caleb Smith,Troup,59.69,142.88,88.45,142.88,374.21,Single-ply,SBD,M
Boys,59.87,4,Noble Giles,Frankston,58.33,120.2,74.84,151.95,347,Single-ply,SBD,M
Boys,59.87,5,Rigo Herrera,Van,58.51,117.93,68.04,133.81,319.78,Single-ply,SBD,M
Boys,67.13,1,Bryce Stephens,Brownsboro,65.41,188.24,115.67,174.63,478.54,Single-ply,SBD,M
Boys,67.13,2,Damion Brown,Bullard,66.13,197.31,120.2,161.03,478.54,Single-ply,SBD,M
Boys,67.13,3,Quinn Johnson,Winona,66.13,204.12,77.11,176.9,458.13,Single-ply,SBD,M
Boys,67.13,4,Tristan Larsen,Tyler Chapel Hill,62.23,165.56,92.99,181.44,439.98,Single-ply,SBD,M
Boys,67.13,5,Josh Williams,Troup,66.86,158.76,79.38,199.58,437.72,Single-ply,SBD,M
Boys,67.13,6,Kevin Chavez,New London West Rusk,62.05,154.22,102.06,167.83,424.11,Single-ply,SBD,M
Boys,67.13,7,Gilbert Garcia,Longview Spring Hill,62.96,158.76,97.52,163.29,419.57,Single-ply,SBD,M
Boys,67.13,8,Gustavo Hilario,Tyler Lee,66.04,156.49,79.38,170.1,405.97,Single-ply,SBD,M
Boys,67.13,9,Josh Mascola,Bullard,66.13,145.15,95.25,158.76,399.16,Single-ply,SBD,M
Boys,67.13,10,David Lindsey,Winona,65.5,140.61,68.04,149.69,358.34,Single-ply,SBD,M
Boys,67.13,11,Clayton Carnes,Frankston,65.23,124.74,77.11,147.42,349.27,Single-ply,SBD,M
Boys,67.13,12,Beau Hanna,Brownsboro,62.32,129.27,61.23,142.88,333.39,Single-ply,SBD,M
Boys,67.13,13,Ben Workman,Frankston,63.32,117.93,65.77,142.88,326.59,Single-ply,SBD,M
Boys,67.13,14,Dylan Castillo,Brownsboro,63.68,102.06,68.04,147.42,317.51,Single-ply,SBD,M
Boys,67.13,15,Truett Freeman,Longview Spring Hill,66.13,113.4,58.97,127.01,299.37,Single-ply,SBD,M
Boys,67.13,16,Dakota Simmons,Bullard,66.13,108.86,63.5,113.4,285.76,Single-ply,SBD,M
Boys,74.84,1,Steven Hibbard,Bullard,74.66,181.44,102.06,174.63,458.13,Single-ply,SBD,M
Boys,74.84,2,Michael Zuniga,Troup,71.76,165.56,115.67,174.63,455.86,Single-ply,SBD,M
Boys,74.84,3,LaDarron Jones,New London West Rusk,71.21,170.1,92.99,181.44,444.52,Single-ply,SBD,M
Boys,74.84,4,Chase Welvert,Lindale,74.3,170.1,97.52,158.76,426.38,Single-ply,SBD,M
Boys,74.84,5,Skylar Hutchins,New London West Rusk,74.84,151.95,97.52,158.76,408.23,Single-ply,SBD,M
Boys,74.84,6,Cade Hollingsworth,Bullard,74.21,131.54,79.38,149.69,360.61,Single-ply,SBD,M
Boys,74.84,7,Garrett Sims,Lindale,73.94,163.29,49.9,140.61,353.8,Single-ply,SBD,M
Boys,74.84,8,Hunter McNutt,Winona,71.76,122.47,79.38,149.69,351.53,Single-ply,SBD,M
Boys,74.84,9,Brian Harris,Winona,68.49,136.08,61.23,151.95,349.27,Single-ply,SBD,M
Boys,74.84,10,Colby McKeehan,Lindale,71.94,117.93,65.77,161.03,344.73,Single-ply,SBD,M
Boys,74.84,11,Wyatt Mauldin,Lindale,74.75,115.67,70.31,140.61,326.59,Single-ply,SBD,M
Boys,74.84,12,Mike Molina,Brownsboro,73.84,111.13,70.31,142.88,324.32,Single-ply,SBD,M
Boys,74.84,13,Caleb Freeman,Longview Spring Hill,73.3,113.4,49.9,138.35,301.64,Single-ply,SBD,M
Boys,82.1,1,Ramiro Martinez,Troup,79.11,215.46,142.88,242.67,601.01,Single-ply,SBD,M
Boys,82.1,2,Cameron Watson #1,Tyler Lee,77.84,206.38,106.59,206.38,519.36,Single-ply,SBD,M
Boys,82.1,3,Tristan Clark,Troup,80.38,176.9,120.2,208.65,505.76,Single-ply,SBD,M
Boys,82.1,4,Reece Ricketts,Bullard,79.74,188.24,129.27,183.7,501.22,Single-ply,SBD,M
Boys,82.1,5,Dernell Reid,Tyler Lee,81.28,188.24,99.79,190.51,478.54,Single-ply,SBD,M
Boys,82.1,6,Bobby Posey,Brownsboro,78.11,172.37,108.86,188.24,469.47,Single-ply,SBD,M
Boys,82.1,7,Keelan Felts,Brownsboro,79.38,181.44,104.33,183.7,469.47,Single-ply,SBD,M
Boys,82.1,8,Grant Sims,Lindale,80.01,172.37,90.72,181.44,444.52,Single-ply,SBD,M
Boys,82.1,9,Oscar Gallegos,Longview Spring Hill,75.75,158.76,102.06,174.63,435.45,Single-ply,SBD,M
Boys,82.1,10,Nico Flores,Lindale,75.93,172.37,83.91,179.17,435.45,Single-ply,SBD,M
Boys,82.1,11,Taye McCurley,Bullard,82.1,165.56,102.06,156.49,424.11,Single-ply,SBD,M
Boys,82.1,12,David Simmons,Bullard,81.92,142.88,97.52,181.44,421.84,Single-ply,SBD,M
Boys,82.1,13,Cole Catlin,Van,78.2,163.29,83.91,170.1,417.3,Single-ply,SBD,M
Boys,82.1,14,Justin Ortiz,Frankston,82.1,142.88,97.52,161.03,401.43,Single-ply,SBD,M
Boys,82.1,15,Drake Walker,Van,75.48,147.42,72.57,176.9,396.89,Single-ply,SBD,M
Boys,82.1,16,Kaden Loebig,Frankston,76.66,142.88,86.18,156.49,385.55,Single-ply,SBD,M
Boys,82.1,17,Jonathon Werner,Van,76.84,145.15,86.18,149.69,381.02,Single-ply,SBD,M
Boys,82.1,18,Bryan Fritz,Longview Spring Hill,76.29,147.42,83.91,142.88,374.21,Single-ply,SBD,M
Boys,82.1,19,Ryan Rainey,Van,80.06,115.67,68.04,111.13,294.84,Single-ply,SBD,M
Boys,82.1,DQ,Grayson Sims,Lindale,79.38,154.22,,,,Single-ply,SBD,M
Boys,89.81,1,DeCorian Horton,Tyler Chapel Hill,87.63,256.28,151.95,249.48,657.71,Single-ply,SBD,M
Boys,89.81,2,Marquis Massenburge,Tyler Chapel Hill,89.63,238.14,138.35,235.87,612.35,Single-ply,SBD,M
Boys,89.81,3,David Bledsoe,Lindale,88.36,226.8,140.61,217.72,585.13,Single-ply,SBD,M
Boys,89.81,4,Parker Musselwhite,Tyler Lee,89.54,233.6,108.86,226.8,569.26,Single-ply,SBD,M
Boys,89.81,5,Christian Lemus,Van,85.82,208.65,147.42,192.78,548.85,Single-ply,SBD,M
Boys,89.81,6,David Allen,Troup,89.63,213.19,124.74,197.31,535.24,Single-ply,SBD,M
Boys,89.81,7,Jake Kellam,Van,87.36,190.51,136.08,172.37,498.95,Single-ply,SBD,M
Boys,89.81,8,Mac Weaver,Troup,89.45,195.04,124.74,172.37,492.15,Single-ply,SBD,M
Boys,89.81,9,Jose Cerda,New London West Rusk,84.55,165.56,108.86,185.97,460.4,Single-ply,SBD,M
Boys,89.81,10,Robert Humphries,Lindale,82.83,154.22,92.99,190.51,437.72,Single-ply,SBD,M
Boys,89.81,11,Diego Molina,New London West Rusk,85.64,163.29,102.06,172.37,437.72,Single-ply,SBD,M
Boys,89.81,12,Ritchie Matkin,Longview Spring Hill,83.1,142.88,106.59,151.95,401.43,Single-ply,SBD,M
Boys,89.81,13,Brady Shackleford,Van,89.81,151.95,83.91,161.03,396.89,Single-ply,SBD,M
Boys,89.81,14,Reese Gardner,Van,86.18,149.69,92.99,149.69,392.36,Single-ply,SBD,M
Boys,89.81,15,Cameron Bridges,Bullard,88.36,147.42,95.25,124.74,367.41,Single-ply,SBD,M
Boys,89.81,DQ,Nicholas Gregory,Lindale,85.55,,,,,Single-ply,SBD,M
Boys,99.79,1,Reece Clark,Troup,99.79,265.35,154.22,235.87,655.44,Single-ply,SBD,M
Boys,99.79,2,Khristion Little,Tyler Chapel Hill,91.26,244.94,131.54,233.6,610.08,Single-ply,SBD,M
Boys,99.79,3,Thomas Brooks,Bullard,91.99,204.12,151.95,210.92,566.99,Single-ply,SBD,M
Boys,99.79,4,Donaven Dotson,Tyler Chapel Hill,93.35,215.46,124.74,204.12,544.31,Single-ply,SBD,M
Boys,99.79,5,James Perales,Tyler Lee,98.16,197.31,129.27,217.72,544.31,Single-ply,SBD,M
Boys,99.79,6,Coltin Paskey,Tyler Chapel Hill,98.47,215.46,142.88,181.44,539.77,Single-ply,SBD,M
Boys,99.79,7,Dq Armstrong,Longview Spring Hill,99.25,192.78,113.4,215.46,521.63,Single-ply,SBD,M
Boys,99.79,8,Jackson Willis,Van,99.79,204.12,106.59,185.97,496.68,Single-ply,SBD,M
Boys,99.79,9,Jose Oliveras,Bullard,96.98,183.7,124.74,183.7,492.15,Single-ply,SBD,M
Boys,99.79,10,Lawson Barker,Bullard,97.61,174.63,138.35,156.49,469.47,Single-ply,SBD,M
Boys,99.79,11,Blake Belobraydic,Tyler Lee,96.3,183.7,90.72,156.49,430.91,Single-ply,SBD,M
Boys,99.79,12,Johna Florez,Lindale,94.62,163.29,97.52,165.56,426.38,Single-ply,SBD,M
Boys,99.79,13,Parker Mizzell,New London West Rusk,92.9,142.88,102.06,174.63,419.57,Single-ply,SBD,M
Boys,99.79,14,Melito Sanchez,Van,97.07,165.56,72.57,170.1,408.23,Single-ply,SBD,M
Boys,99.79,15,Chase Sheridan,Van,98.88,158.76,77.11,161.03,396.89,Single-ply,SBD,M
Boys,99.79,16,Zach Moore,Winona,91.44,127.01,79.38,133.81,340.19,Single-ply,SBD,M
Boys,99.79,17,Noe Yepez,Winona,90.72,115.67,70.31,142.88,328.85,Single-ply,SBD,M
Boys,99.79,DQ,Trent Allen,Troup,95.35,240.4,161.03,,,Single-ply,SBD,M
Boys,109.77,1,Matthew Davison,New London West Rusk,108.86,235.87,136.08,222.26,594.21,Single-ply,SBD,M
Boys,109.77,2,Hunter Tucker,Tyler Chapel Hill,107.09,247.21,115.67,226.8,589.67,Single-ply,SBD,M
Boys,109.77,3,Santiago Castillo,Lindale,106.05,208.65,117.93,217.72,544.31,Single-ply,SBD,M
Boys,109.77,4,Beaux Limmer,Tyler Lee,107.5,190.51,124.74,199.58,514.83,Single-ply,SBD,M
Boys,109.77,5,Nathan Niedrauer,Tyler Lee,100.7,204.12,122.47,181.44,508.02,Single-ply,SBD,M
Boys,109.77,6,Carson Manasse,Longview Spring Hill,105.96,161.03,92.99,181.44,435.45,Single-ply,SBD,M
Boys,109.77,7,Colton Mills,New London West Rusk,101.7,151.95,90.72,154.22,396.89,Single-ply,SBD,M
Boys,109.77,8,Travis Huffman,Bullard,109.41,158.76,88.45,142.88,390.09,Single-ply,SBD,M
Boys,109.77,DQ,Jesse Owen,Frankston,102.97,,,,,Single-ply,SBD,M
Boys,124.74,1,Josh Porter,Frankston,116.3,283.5,156.49,254.01,694,Single-ply,SBD,M
Boys,124.74,2,Jose Arreguin,Tyler Chapel Hill,120.56,238.14,147.42,197.31,582.87,Single-ply,SBD,M
Boys,124.74,3,Tanner Cornell,Longview Spring Hill,116.66,226.8,145.15,195.04,566.99,Single-ply,SBD,M
Boys,124.74,4,Matt Edwards,Lindale,122.65,219.99,127.01,217.72,564.72,Single-ply,SBD,M
Boys,124.74,5,Jacob Roland,Tyler Lee,115.48,222.26,95.25,217.72,535.24,Single-ply,SBD,M
Boys,124.74,6,Jacob Butz,Lindale,116.75,210.92,115.67,192.78,519.36,Single-ply,SBD,M
Boys,124.74,7,Cason Cheney,Lindale,119.39,208.65,113.4,190.51,512.56,Single-ply,SBD,M
Boys,124.74,8,Jace Phillips #1,Lindale,110.86,204.12,104.33,158.76,467.2,Single-ply,SBD,M
Boys,124.74,9,Cason McCoy,Van,115.39,154.22,104.33,163.29,421.84,Single-ply,SBD,M
Boys,124.74+,1,Malik Gilliam,Troup,155.49,294.84,158.76,215.46,669.05,Single-ply,SBD,M
Boys,124.74+,2,John Campbell,Bullard,140.7,290.3,170.1,192.78,653.17,Single-ply,SBD,M
Boys,124.74+,3,Richard Gallegos,Longview Spring Hill,131.36,249.48,129.27,226.8,605.55,Single-ply,SBD,M
Boys,124.74+,4,Colton Chandler,Longview Spring Hill,125.46,192.78,131.54,185.97,510.29,Single-ply,SBD,M
Boys,124.74+,5,Jordan Young,Van,136.62,226.8,102.06,167.83,496.68,Single-ply,SBD,M
Boys,124.74+,6,Devin Lewis,Bullard,148.78,183.7,124.74,181.44,489.88,Single-ply,SBD,M
Boys,124.74+,7,Levi Laymance,Brownsboro,135.71,158.76,106.59,149.69,415.04,Single-ply,SBD,M
Boys,124.74+,8,Diego Luna,New London West Rusk,131.72,154.22,99.79,145.15,399.16,Single-ply,SBD,M
