// Jest Snapshot v1, https://goo.gl/fbAQLP

exports[`<Map /> matches snapshot 1`] = `
<Map>
  <Header
    locations={Array []}
    onDragEnd={[Function]}
    setInputRef={[Function]}
  >
    <div
      className="places-info"
    >
      <DragDropContext
        onDragEnd={[Function]}
      >
        <input
          className="place-input"
          type="text"
        />
        <Connect(Droppable)
          direction="vertical"
          droppableId="adresses-1"
          ignoreContainerClipping={false}
          isDropDisabled={false}
          type="ADDRESSES"
        >
          <Droppable
            direction="vertical"
            dispatch={[Function]}
            draggingOverWith={null}
            droppableId="adresses-1"
            ignoreContainerClipping={false}
            isDraggingOver={false}
            isDropDisabled={false}
            placeholder={null}
            type="ADDRESSES"
          >
            <DroppableDimensionPublisher
              direction="vertical"
              droppableId="adresses-1"
              getDroppableRef={[Function]}
              ignoreContainerClipping={false}
              isDropDisabled={false}
              type="ADDRESSES"
            >
              <div
                className="selected-locations"
                data-react-beautiful-dnd-droppable="2"
              />
            </DroppableDimensionPublisher>
          </Droppable>
        </Connect(Droppable)>
      </DragDropContext>
    </div>
  </Header>
  <div
    className="map-wrapper"
  >
    <div
      id="map"
    />
  </div>
</Map>
`;
