"ID","LastUpdate","BHWID","BLname","BFname","BMname","BBdate","Bsex","Bbloodtype","Bregcode","Bprovcode","Bcitycode","Bbrgycode","Ethnic_Code","bappellation","BPhilHealth","Bprofit","BContractno","educ_attain_code","Bperson","Brelation","Bpcontact","statflag","DateActive","DateInactive"
"154104","2017/01/26","","DUPLA","APPLE JOY","ALTARAS","1995/10/25","Female","","11","1123","112317","112317031","","","No","","","","","","","Active","01/26/2017","00/00/0000"
"154109","2017/01/26","","GALAN","CHERIE","DEL MUNDO","1983/01/31","Female","","11","1123","112317","112317031","","","No","","","","","","","Active","01/26/2017","00/00/0000"
"154486","2017/01/26","","BATUCAN","JENALYN","ZAMORAS","1976/07/28","Female","","11","1123","112317","112317031","","","No","","","","","","","Active","01/26/2017","00/00/0000"
"154491","2017/01/26","","MORALES","LEONILO JR.","RUELO","1972/09/17","Male","","11","1123","112317","112317031","","","No","","","","","","","Active","01/26/2017","00/00/0000"
"157517","2017/01/27","","COMTIOSO","NIMFA","ACOSTO","1951/01/29","Female","","11","1123","112317","112317031","","","No","","","","","","","Active","01/27/2017","00/00/0000"
"157521","2017/01/27","","AHIT","PRESCILLA","AROCAN","1964/01/16","Female","","11","1123","112317","112317031","","","No","","","","","","","Active","01/27/2017","00/00/0000"
"157522","2017/01/27","","ABILES","SHAROM","PAJO","1980/10/28","Female","","11","1123","112317","112317031","","","No","","","","","","","Active","01/27/2017","00/00/0000"
"157525","2017/01/27","","RUELO","MESHIEL","CALISAGAN","1982/07/12","Female","","11","1123","112317","112317031","","","No","","","","","","","Active","01/27/2017","00/00/0000"
"157531","2017/01/27","","MORALES","LEONILO JR.","RUELO","1972/09/17","Female","","11","1123","112317","112317031","","","No","","","","","","","Active","01/27/2017","00/00/0000"
