"ID","LastUpdate","BHWID","BLname","BFname","BMname","BBdate","Bsex","Bbloodtype","Bregcode","Bprovcode","Bcitycode","Bbrgycode","Ethnic_Code","bappellation","BPhilHealth","Bprofit","BContractno","educ_attain_code","Bperson","Brelation","Bpcontact","statflag","DateActive","DateInactive"
"144957","2017/01/18","RXI-DDN-ASU0072","ABIAO","NIÑA","LIBREA","1986/09/15","Female","","11","1123","112301","112301009","","","Yes","1500.00","","High School Graduate","","","","Active","01/18/2017","00/00/0000"
"144960","2017/01/18","RXI-DDN-ASU0073","AOY","VERGINIA","AMORA","1966/09/21","Female","","11","1123","112301","112301009","","","Yes","1500.00","","Elementary Level","","","","Active","01/18/2017","00/00/0000"
"144962","2017/01/18","RXI-DDN-ASU0074","BALONG","SOLIDAD","GALLERA","1962/05/11","Female","","11","1123","112301","112301009","","","Yes","1000.00","","Elementary Level","","","","Active","01/18/2017","00/00/0000"
"144964","2017/01/18","RXI-DDN-ASU0075","CORNITA","EMELDA","COSTEN","1969/09/21","Female","","11","1123","112301","112301009","","","Yes","1000.00","","High School Graduate","","","","Active","01/18/2017","00/00/0000"
"144969","2017/01/18","RXI-DDN-ASU0076","PAYAGAN","JUNILA","AET","1968/01/22","Female","","11","1123","112301","112301009","","","Yes","1500.00","","Elementary Level","","","","Active","01/18/2017","00/00/0000"
"144973","2017/01/18","RXI-DDN-ASU0077","RAMIREZ","JUVITA","TABURA","1957/02/15","Female","","11","1123","112301","112301009","","","Yes","2000.00","","High School Level","","","","Active","01/18/2017","00/00/0000"
"144975","2017/01/18","RXI-DDN-ASU0078","RAMIREZ","SUSAN","SANDIG","1966/02/25","Female","","11","1123","112301","112301009","","","Yes","2000.00","","High School Graduate","","","","Active","01/18/2017","00/00/0000"
"144977","2017/01/18","RXI-DDN-ASU0079","RAPEZA","ANALYSA","INAYCON","1985/02/02","Female","","11","1123","112301","112301009","","","Yes","2500.00","","High School Level","","Others
","","Active","01/18/2017","00/00/0000"
"144979","2017/01/18","RXI-DDN-ASU0080","TEVES","LEFRAN JOY","LINTAPAN","1958/01/01","Female","","11","1123","112301","112301009","","","No","1000.00","","Elementary Graduate","","","","Active","01/18/2017","00/00/0000"
"144981","2017/01/18","RXI-DDN-ASU0081","ZAPATOSE","RIENA","ABIAO","1968/05/09","Female","","11","1123","112301","112301009","","","Yes","1500.00","","Elementary Level","","","","Active","01/18/2017","00/00/0000"
