{
  "resourceType": "ValueSet",
  "id": "mii-vs-prozedur-prozeduren-snomedct-v2025.0.x",
  "extension": [
    {
      "url": "https://www.medizininformatik-initiative.de/fhir/modul-meta/StructureDefinition/mii-ex-meta-license-codeable",
      "valueCodeableConcept": {
        "coding": [
          {
            "system": "http://hl7.org/fhir/spdx-license",
            "code": "CC-BY-4.0",
            "display": "Creative Commons Attribution 4.0 International"
          }
        ]
      }
    },
    {
      "url": "http://hl7.org/fhir/StructureDefinition/cqf-scope",
      "valueString": "@mii-termserv/de.medizininformatikinitiative.kerndatensatz.terminology.prozedur"
    }
  ],
  "url": "https://www.medizininformatik-initiative.de/fhir/core/modul-prozedur/ValueSet/procedures-sct",
  "version": "2025.0.0",
  "name": "MII_VS_Prozedur_Prozeduren_SNOMEDCT",
  "title": "MII VS Prozedur Prozeduren [SNOMED CT]",
  "status": "active",
  "experimental": false,
  "date": "2024-12-09",
  "publisher": "Medizininformatik Initiative",
  "contact": [
    {
      "telecom": [
        {
          "system": "url",
          "value": "https://www.medizininformatik-initiative.de"
        }
      ]
    }
  ],
  "description": "Enthaelt alle SNOMED CT Procedure Codes",
  "copyright": "This material includes SNOMED Clinical Terms® (SNOMED CT®) which is used by permission of SNOMED International. All rights reserved. SNOMED CT®, was originally created by The College of American Pathologists. SNOMED and SNOMED CT are registered trademarks of SNOMED International. Implementers of these artefacts must have the appropriate SNOMED CT Affiliate license.",
  "compose": {
    "include": [
      {
        "system": "http://snomed.info/sct",
        "version": "http://snomed.info/sct/900000000000207008/version/20240701",
        "filter": [
          {
            "property": "concept",
            "op": "descendent-of",
            "value": "71388002"
          }
        ]
      }
    ]
  },
  "meta": {
    "tag": [
      {
        "system": "https://mii-termserv.de/fhir/su-termserv/CodeSystem/mii-cs-suts-resource-tags-project",
        "code": "cds",
        "display": "Core Dataset of the MII"
      },
      {
        "system": "https://mii-termserv.de/fhir/su-termserv/CodeSystem/mii-cs-suts-resource-tags-dataset",
        "code": "cds-prozedur",
        "display": "CDS Module 'Prozedur'"
      },
      {
        "system": "https://mii-termserv.de/fhir/su-termserv/CodeSystem/mii-cs-suts-resource-tags-license",
        "code": "https://mii-termserv.de/licenses#mii-cds",
        "display": "MII CDS license"
      }
    ]
  },
  "text": {
    "status": "generated",
    "div": "<div xmlns=\"http://www.w3.org/1999/xhtml\"><h2>MII VS Prozedur Prozeduren [SNOMED CT]</h2><tt>https://www.medizininformatik-initiative.de/fhir/core/modul-prozedur/ValueSet/procedures-sct</tt><p>Enthaelt alle SNOMED CT Procedure Codes</p><div><p><b>SU-TermServ Metadata</b></p><table><tbody><tr><td><b>Project</b></td><td>Core Dataset of the MII</td></tr><tr><td><b>Dataset</b></td><td>CDS Module &#x27;Prozedur&#x27;</td></tr><tr><td><b>License</b></td><td><a href=\"https://mii-termserv.de/licenses#mii-cds\">MII CDS license</a></td></tr><tr><td><b>Package Scope</b></td><td><a href=\"https://gitlab.com/groups/mii-termserv/fhir-resources/-/packages/?ForderBy%3Dversion%26sort%3Ddesc%26search%5B%5D%3D@mii-termserv/de.medizininformatikinitiative.kerndatensatz.terminology.prozedur\"><code>@mii-termserv/de.medizininformatikinitiative.kerndatensatz.terminology.prozedur</code></a></td></tr></tbody></table></div></div>"
  }
}
