{
  "resourceType": "ValueSet",
  "id": "vs-mii-icu-devicemetric-extrakorporale-verfahren-snomed-v100",
  "url": "https://www.medizininformatik-initiative.de/fhir/ext/modul-icu/ValueSet/MII-DeviceMetric-Extrakorporale-Verfahren",
  "version": "1.0.0",
  "name": "VS_MII_ICU_Category_Procedure_Beatmung_SNOMED",
  "title": "VS MII ICU Category Procedure Beatmung [SNOMED]",
  "status": "active",
  "experimental": false,
  "date": "2021-02-02",
  "publisher": "https://www.medizininformatik-initiative.de",
  "compose": {
    "include": [
      {
        "system": "http://snomed.info/sct",
        "concept": [
          {
            "code": "182744004",
            "display": "Extracorporeal circulation procedure (procedure)"
          }
        ]
      }
    ]
  },
  "meta": {
    "tag": [
      {
        "system": "https://mii-termserv.de/fhir/su-termserv/CodeSystem/mii-cs-suts-resource-tags-project",
        "code": "cds",
        "display": "Core Dataset of the MII"
      },
      {
        "system": "https://mii-termserv.de/fhir/su-termserv/CodeSystem/mii-cs-suts-resource-tags-dataset",
        "code": "cds-icu",
        "display": "CDS Module 'Intensivmedizin'"
      },
      {
        "system": "https://mii-termserv.de/fhir/su-termserv/CodeSystem/mii-cs-suts-resource-tags-license",
        "code": "https://mii-termserv.de/licenses#mii-cds",
        "display": "MII CDS license"
      }
    ]
  },
  "extension": [
    {
      "url": "http://hl7.org/fhir/StructureDefinition/cqf-scope",
      "valueString": "@mii-termserv/de.medizininformatikinitiative.kerndatensatz.terminology.icu"
    }
  ],
  "text": {
    "status": "generated",
    "div": "<div xmlns=\"http://www.w3.org/1999/xhtml\"><h2>VS MII ICU Category Procedure Beatmung [SNOMED]</h2><tt>https://www.medizininformatik-initiative.de/fhir/ext/modul-icu/ValueSet/MII-DeviceMetric-Extrakorporale-Verfahren</tt><div><p><b>SU-TermServ Metadata</b></p><table><tbody><tr><td><b>Project</b></td><td>Core Dataset of the MII</td></tr><tr><td><b>Dataset</b></td><td>CDS Module 'Intensivmedizin'</td></tr><tr><td><b>License</b></td><td><a href=\"https://mii-termserv.de/licenses#mii-cds\">MII CDS license</a></td></tr><tr><td><b>Package Scope</b></td><td><a href=\"https://gitlab.com/groups/mii-termserv/fhir-resources/-/packages/?ForderBy%3Dversion%26sort%3Ddesc%26search%5B%5D%3D@mii-termserv/de.medizininformatikinitiative.kerndatensatz.terminology.icu\"><code>@mii-termserv/de.medizininformatikinitiative.kerndatensatz.terminology.icu</code></a></td></tr></tbody></table></div></div>"
  }
}