{
  "resourceType": "ConceptMap",
  "id": "ips-severity-snomedct-uv-ips",
  "text": {
    "status": "generated",
    "div": "<div xmlns=\"http://www.w3.org/1999/xhtml\"><h2>Severity Value Set Mappings - SNOMED CT to FHIR</h2><tt>http://hl7.org/fhir/uv/ips/ConceptMap/severity-snomedct-uv-ips</tt><p>Severity Value Set Mappings - SNOMED CT to FHIR</p><div><p><b>SU-TermServ Metadata</b></p><table><tbody><tr><td><b>Project</b></td><td>HL7 Universal Realm</td></tr><tr><td><b>Dataset</b></td><td>HL7 Universal Realm IGs</td></tr><tr><td><b>License</b></td><td><a href=\"https://mii-termserv.de/licenses#cc0-1.0\">CC0-1.0 Universal</a></td></tr><tr><td><b>Package Scope</b></td><td><a href=\"https://gitlab.com/groups/mii-termserv/fhir-resources/-/packages/?ForderBy%3Dversion%26sort%3Ddesc%26search%5B%5D%3D@mii-termserv/hl7.uv.ips.terminology\"><code>@mii-termserv/hl7.uv.ips.terminology</code></a></td></tr></tbody></table></div></div>"
  },
  "extension": [
    {
      "url": "http://hl7.org/fhir/StructureDefinition/structuredefinition-fmm",
      "valueInteger": 2,
      "_valueInteger": {
        "extension": [
          {
            "url": "http://hl7.org/fhir/StructureDefinition/structuredefinition-conformance-derivedFrom",
            "valueCanonical": "http://hl7.org/fhir/uv/ips/ImplementationGuide/ig-uv-ips"
          }
        ]
      }
    },
    {
      "url": "http://hl7.org/fhir/StructureDefinition/structuredefinition-standards-status",
      "valueCode": "trial-use",
      "_valueCode": {
        "extension": [
          {
            "url": "http://hl7.org/fhir/StructureDefinition/structuredefinition-conformance-derivedFrom",
            "valueCanonical": "http://hl7.org/fhir/uv/ips/ImplementationGuide/ig-uv-ips"
          }
        ]
      }
    },
    {
      "url": "http://hl7.org/fhir/StructureDefinition/cqf-scope",
      "valueString": "@mii-termserv/hl7.uv.ips.terminology"
    }
  ],
  "url": "http://hl7.org/fhir/uv/ips/ConceptMap/severity-snomedct-uv-ips",
  "version": "1.1.0",
  "name": "SeverityValueSetMappingsSnomedCtToFhir",
  "title": "Severity Value Set Mappings - SNOMED CT to FHIR",
  "status": "active",
  "experimental": false,
  "date": "2022-11-22T03:24:39+00:00",
  "publisher": "Health Level Seven International - Patient Care Work Group",
  "contact": [
    {
      "telecom": [
        {
          "system": "url",
          "value": "http://www.hl7.org/Special/committees/patientcare"
        }
      ]
    }
  ],
  "description": "Severity Value Set Mappings - SNOMED CT to FHIR",
  "jurisdiction": [
    {
      "coding": [
        {
          "system": "http://unstats.un.org/unsd/methods/m49/m49.htm",
          "code": "001"
        }
      ]
    }
  ],
  "sourceUri": "http://hl7.org/fhir/ValueSet/condition-severity",
  "targetUri": "http://hl7.org/fhir/ValueSet/reaction-event-severity",
  "group": [
    {
      "source": "http://snomed.info/sct",
      "target": "http://hl7.org/fhir/reaction-event-severity",
      "element": [
        {
          "code": "255604002",
          "display": "Mild",
          "target": [
            {
              "code": "mild",
              "display": "Mild",
              "equivalence": "specializes"
            }
          ]
        },
        {
          "code": "6736007",
          "display": "Moderate",
          "target": [
            {
              "code": "moderate",
              "display": "Moderate",
              "equivalence": "specializes"
            }
          ]
        },
        {
          "code": "24484000",
          "display": "Severe",
          "target": [
            {
              "code": "severe",
              "display": "Severe",
              "equivalence": "specializes"
            }
          ]
        }
      ]
    }
  ],
  "meta": {
    "tag": [
      {
        "system": "https://mii-termserv.de/fhir/su-termserv/CodeSystem/mii-cs-suts-resource-tags-project",
        "code": "hl7-uv",
        "display": "HL7 Universal Realm"
      },
      {
        "system": "https://mii-termserv.de/fhir/su-termserv/CodeSystem/mii-cs-suts-resource-tags-dataset",
        "code": "ips",
        "display": "International Patient Summary"
      },
      {
        "system": "https://mii-termserv.de/fhir/su-termserv/CodeSystem/mii-cs-suts-resource-tags-license",
        "code": "https://mii-termserv.de/licenses#cc0-1.0",
        "display": "CC0-1.0 Universal"
      },
      {
        "system": "https://mii-termserv.de/fhir/su-termserv/CodeSystem/mii-cs-suts-resource-tags-dataset",
        "code": "hl7-uv-ig",
        "display": "HL7 Universal Realm IGs"
      }
    ]
  }
}