{
  "resourceType": "ValueSet",
  "id": "ips-current-smoking-status-uv-ips",
  "meta": {
    "profile": [
      "http://hl7.org/fhir/StructureDefinition/shareablevalueset"
    ],
    "tag": [
      {
        "system": "https://mii-termserv.de/fhir/su-termserv/CodeSystem/mii-cs-suts-resource-tags-project",
        "code": "hl7-uv",
        "display": "HL7 Universal Realm"
      },
      {
        "system": "https://mii-termserv.de/fhir/su-termserv/CodeSystem/mii-cs-suts-resource-tags-dataset",
        "code": "ips",
        "display": "International Patient Summary"
      },
      {
        "system": "https://mii-termserv.de/fhir/su-termserv/CodeSystem/mii-cs-suts-resource-tags-license",
        "code": "https://mii-termserv.de/licenses#cc0-1.0",
        "display": "CC0-1.0 Universal"
      },
      {
        "system": "https://mii-termserv.de/fhir/su-termserv/CodeSystem/mii-cs-suts-resource-tags-dataset",
        "code": "hl7-uv-ig",
        "display": "HL7 Universal Realm IGs"
      }
    ]
  },
  "text": {
    "status": "generated",
    "div": "<div xmlns=\"http://www.w3.org/1999/xhtml\"><h2>Current Smoking Status - IPS</h2><tt>http://hl7.org/fhir/uv/ips/ValueSet/current-smoking-status-uv-ips</tt><p>HL7 LOINC value set for smoking status.  Based on the HL7 Vocab and Structured Doc WG (formerly TC) consensus - per US CDC submission 7/12/2012 for smoking status terms.</p><div><p><b>SU-TermServ Metadata</b></p><table><tbody><tr><td><b>Project</b></td><td>HL7 Universal Realm</td></tr><tr><td><b>Dataset</b></td><td>HL7 Universal Realm IGs</td></tr><tr><td><b>License</b></td><td><a href=\"https://mii-termserv.de/licenses#cc0-1.0\">CC0-1.0 Universal</a></td></tr><tr><td><b>Package Scope</b></td><td><a href=\"https://gitlab.com/groups/mii-termserv/fhir-resources/-/packages/?ForderBy%3Dversion%26sort%3Ddesc%26search%5B%5D%3D@mii-termserv/hl7.uv.ips.terminology\"><code>@mii-termserv/hl7.uv.ips.terminology</code></a></td></tr></tbody></table></div></div>"
  },
  "extension": [
    {
      "url": "http://hl7.org/fhir/StructureDefinition/structuredefinition-fmm",
      "valueInteger": 2,
      "_valueInteger": {
        "extension": [
          {
            "url": "http://hl7.org/fhir/StructureDefinition/structuredefinition-conformance-derivedFrom",
            "valueCanonical": "http://hl7.org/fhir/uv/ips/ImplementationGuide/ig-uv-ips"
          }
        ]
      }
    },
    {
      "url": "http://hl7.org/fhir/StructureDefinition/structuredefinition-standards-status",
      "valueCode": "trial-use",
      "_valueCode": {
        "extension": [
          {
            "url": "http://hl7.org/fhir/StructureDefinition/structuredefinition-conformance-derivedFrom",
            "valueCanonical": "http://hl7.org/fhir/uv/ips/ImplementationGuide/ig-uv-ips"
          }
        ]
      }
    },
    {
      "url": "http://hl7.org/fhir/StructureDefinition/cqf-scope",
      "valueString": "@mii-termserv/hl7.uv.ips.terminology"
    }
  ],
  "url": "http://hl7.org/fhir/uv/ips/ValueSet/current-smoking-status-uv-ips",
  "identifier": [
    {
      "use": "official",
      "system": "http://art-decor.org/ns/oids/vs",
      "value": "2.16.840.1.113883.11.22.59"
    }
  ],
  "version": "1.1.0",
  "name": "CurrentSmokingStatusUvIps",
  "title": "Current Smoking Status - IPS",
  "status": "active",
  "experimental": false,
  "date": "2022-11-22T03:24:39+00:00",
  "publisher": "Health Level Seven International - Patient Care Work Group",
  "contact": [
    {
      "telecom": [
        {
          "system": "url",
          "value": "http://www.hl7.org/Special/committees/patientcare"
        }
      ]
    }
  ],
  "description": "HL7 LOINC value set for smoking status.  Based on the HL7 Vocab and Structured Doc WG (formerly TC) consensus - per US CDC submission 7/12/2012 for smoking status terms.",
  "jurisdiction": [
    {
      "coding": [
        {
          "system": "http://unstats.un.org/unsd/methods/m49/m49.htm",
          "code": "001"
        }
      ]
    }
  ],
  "immutable": false,
  "copyright": "This material contains content from LOINC (http://loinc.org). LOINC is copyright © 1995-2020, Regenstrief Institute, Inc. and the Logical Observation Identifiers Names and Codes (LOINC) Committee and is available at no cost under the license at http://loinc.org/license. LOINC® is a registered United States trademark of Regenstrief Institute, Inc",
  "compose": {
    "include": [
      {
        "system": "http://loinc.org",
        "concept": [
          {
            "extension": [
              {
                "url": "http://hl7.org/fhir/StructureDefinition/ordinalValue",
                "valueDecimal": 1
              }
            ],
            "code": "LA18976-3",
            "display": "Current every day smoker"
          },
          {
            "extension": [
              {
                "url": "http://hl7.org/fhir/StructureDefinition/ordinalValue",
                "valueDecimal": 2
              }
            ],
            "code": "LA18977-1",
            "display": "Current some day smoker"
          },
          {
            "extension": [
              {
                "url": "http://hl7.org/fhir/StructureDefinition/ordinalValue",
                "valueDecimal": 3
              }
            ],
            "code": "LA15920-4",
            "display": "Former smoker"
          },
          {
            "extension": [
              {
                "url": "http://hl7.org/fhir/StructureDefinition/ordinalValue",
                "valueDecimal": 4
              }
            ],
            "code": "LA18978-9",
            "display": "Never smoker"
          },
          {
            "extension": [
              {
                "url": "http://hl7.org/fhir/StructureDefinition/ordinalValue",
                "valueDecimal": 5
              }
            ],
            "code": "LA18979-7",
            "display": "Smoker, current status unknown"
          },
          {
            "extension": [
              {
                "url": "http://hl7.org/fhir/StructureDefinition/ordinalValue",
                "valueDecimal": 6
              }
            ],
            "code": "LA18980-5",
            "display": "Unknown if ever smoked"
          },
          {
            "extension": [
              {
                "url": "http://hl7.org/fhir/StructureDefinition/ordinalValue",
                "valueDecimal": 7
              }
            ],
            "code": "LA18981-3",
            "display": "Heavy tobacco smoker"
          },
          {
            "extension": [
              {
                "url": "http://hl7.org/fhir/StructureDefinition/ordinalValue",
                "valueDecimal": 8
              }
            ],
            "code": "LA18982-1",
            "display": "Light tobacco smoker"
          }
        ]
      }
    ]
  }
}