{
  "resourceType": "ValueSet",
  "id": "ips-target-diseases-snomed-ct-ips-free-set",
  "meta": {
    "profile": [
      "http://hl7.org/fhir/StructureDefinition/shareablevalueset"
    ],
    "tag": [
      {
        "system": "https://mii-termserv.de/fhir/su-termserv/CodeSystem/mii-cs-suts-resource-tags-project",
        "code": "hl7-uv",
        "display": "HL7 Universal Realm"
      },
      {
        "system": "https://mii-termserv.de/fhir/su-termserv/CodeSystem/mii-cs-suts-resource-tags-dataset",
        "code": "ips",
        "display": "International Patient Summary"
      },
      {
        "system": "https://mii-termserv.de/fhir/su-termserv/CodeSystem/mii-cs-suts-resource-tags-license",
        "code": "https://mii-termserv.de/licenses#cc0-1.0",
        "display": "CC0-1.0 Universal"
      },
      {
        "system": "https://mii-termserv.de/fhir/su-termserv/CodeSystem/mii-cs-suts-resource-tags-dataset",
        "code": "hl7-uv-ig",
        "display": "HL7 Universal Realm IGs"
      }
    ]
  },
  "text": {
    "status": "generated",
    "div": "<div xmlns=\"http://www.w3.org/1999/xhtml\"><h2>Vaccine Target Diseases - SNOMED CT IPS Free Set</h2><tt>http://hl7.org/fhir/uv/ips/ValueSet/target-diseases-snomed-ct-ips-free-set</tt><p>This value set includes the codes from the SNOMED International Patient Set (IPS) subset of SNOMED CT (IPS Free Set) describing Vaccine Target Diseases.</p><div><p><b>SU-TermServ Metadata</b></p><table><tbody><tr><td><b>Project</b></td><td>HL7 Universal Realm</td></tr><tr><td><b>Dataset</b></td><td>HL7 Universal Realm IGs</td></tr><tr><td><b>License</b></td><td><a href=\"https://mii-termserv.de/licenses#cc0-1.0\">CC0-1.0 Universal</a></td></tr><tr><td><b>Package Scope</b></td><td><a href=\"https://gitlab.com/groups/mii-termserv/fhir-resources/-/packages/?ForderBy%3Dversion%26sort%3Ddesc%26search%5B%5D%3D@mii-termserv/hl7.uv.ips.terminology\"><code>@mii-termserv/hl7.uv.ips.terminology</code></a></td></tr></tbody></table></div></div>"
  },
  "extension": [
    {
      "url": "http://hl7.org/fhir/StructureDefinition/structuredefinition-fmm",
      "valueInteger": 2,
      "_valueInteger": {
        "extension": [
          {
            "url": "http://hl7.org/fhir/StructureDefinition/structuredefinition-conformance-derivedFrom",
            "valueCanonical": "http://hl7.org/fhir/uv/ips/ImplementationGuide/ig-uv-ips"
          }
        ]
      }
    },
    {
      "url": "http://hl7.org/fhir/StructureDefinition/structuredefinition-standards-status",
      "valueCode": "trial-use",
      "_valueCode": {
        "extension": [
          {
            "url": "http://hl7.org/fhir/StructureDefinition/structuredefinition-conformance-derivedFrom",
            "valueCanonical": "http://hl7.org/fhir/uv/ips/ImplementationGuide/ig-uv-ips"
          }
        ]
      }
    },
    {
      "url": "http://hl7.org/fhir/StructureDefinition/cqf-scope",
      "valueString": "@mii-termserv/hl7.uv.ips.terminology"
    }
  ],
  "url": "http://hl7.org/fhir/uv/ips/ValueSet/target-diseases-snomed-ct-ips-free-set",
  "version": "1.1.0",
  "name": "VaccineTargetDiseasesSnomedCtIpsFreeSet",
  "title": "Vaccine Target Diseases - SNOMED CT IPS Free Set",
  "status": "active",
  "experimental": false,
  "date": "2022-08-02T19:48:09-05:00",
  "publisher": "Health Level Seven International - Patient Care Work Group",
  "contact": [
    {
      "telecom": [
        {
          "system": "url",
          "value": "http://www.hl7.org/Special/committees/patientcare"
        }
      ]
    }
  ],
  "description": "This value set includes the codes from the SNOMED International Patient Set (IPS) subset of SNOMED CT (IPS Free Set) describing Vaccine Target Diseases.",
  "jurisdiction": [
    {
      "coding": [
        {
          "system": "http://unstats.un.org/unsd/methods/m49/m49.htm",
          "code": "001"
        }
      ]
    }
  ],
  "immutable": false,
  "copyright": "The SNOMED International IPS Terminology is distributed by International Health Terminology Standards Development Organisation, trading as SNOMED International, and is subject the terms of the [Creative Commons Attribution 4.0 International Public License](https://creativecommons.org/licenses/by/4.0/). For more information, see [SNOMED IPS Terminology](https://www.snomed.org/snomed-ct/Other-SNOMED-products/international-patient-summary-terminology)",
  "compose": {
    "include": [
      {
        "system": "http://snomed.info/sct",
        "version": "http://snomed.info/sct/900000000000207008",
        "filter": [
          {
            "property": "constraint",
            "op": "=",
            "value": "(4834000 |Typhoid fever (disorder)| or 6142004 |Influenza (disorder)| or 6541001 |Yellow fever (disorder)| or 14189004 |Measles (disorder)| or 14168008 |Rabies (disorder)| or 18624000 |Disease caused by Rotavirus (disorder)| or 23502006 |Lyme disease (disorder)| or 23511006 |Meningococcal infectious disease (disorder)| or 24662006 |Influenza caused by Influenza B virus (disorder)| or 25225006 |Disease caused by Adenovirus (disorder)| or 27836007 |Pertussis (disorder)| or 32398004 |Bronchitis (disorder)| or 36653000 |Rubella (disorder)| or 36989005 |Mumps (disorder)| or 37246009 |Disease caused by rickettsiae (disorder)| or 38907003 |Varicella (disorder)| or 40468003 |Viral hepatitis type A (disorder)| or 50711007 |Viral hepatitis type C (disorder)| or 52947006 |Japanese encephalitis virus disease (disorder)| or 56717001 |Tuberculosis (disorder)| or 58750007 |Plague (disorder)| or 63650001 |Cholera (disorder)| or 66071002 |Viral hepatitis type B (disorder)| or 67924001 |Smallpox (disorder)| or 70036007 |Haemophilus influenzae pneumonia (disorder)| or 75702008 |Brucellosis (disorder)| or 76902006 |Tetanus (disorder)| or 85904008 |Paratyphoid fever (disorder)| or 111852003 |Vaccinia (disorder)| or 186150001 |Enteritis caused by rotavirus (disorder)| or 186772009 |Rocky Mountain spotted fever (disorder)| or 186788009 |Q fever (disorder)| or 240532009 |Human papillomavirus infection (disorder)| or 240613006 |Typhus group rickettsial disease (disorder)| or 372244006 |Malignant melanoma (disorder)| or 397430003 |Diphtheria caused by Corynebacterium diphtheriae (disorder)| or 398102009 |Acute poliomyelitis (disorder)| or 398565003 |Infection caused by Clostridium botulinum (disorder)| or 409498004 |Anthrax (disorder)| or 417093003 |Disease caused by West Nile virus (disorder)| or 442438000 |Influenza caused by Influenza A virus (disorder)| or 442696006 |Influenza caused by Influenza A virus subtype H1N1 (disorder)| or 450715004 |Influenza caused by Influenza A virus subtype H7 (disorder)| or 707448003 |Influenza caused by Influenza A virus subtype H7N9 (disorder)| or 709410003 |Haemophilus influenzae type b infection (disorder)| or 712986001 |Encephalitis caused by tick-borne encephalitis virus (disorder)| or 713083002 |Influenza caused by Influenza A virus subtype H5 (disorder)| or 772810003 |Influenza caused by Influenza A virus subtype H3N2 (disorder)| or 772828001 |Influenza caused by Influenza A virus subtype H5N1 (disorder)| or 840539006 |Disease caused by severe acute respiratory syndrome coronavirus 2 (disorder)|) and ^ 816080008 |International Patient Summary (foundation metadata concept)|"
          }
        ]
      }
    ]
  },
  "expansion": {
    "timestamp": "2022-08-03T03:49:02.324+00:00",
    "total": 22,
    "offset": 0,
    "parameter": [
      {
        "name": "version",
        "valueUri": "http://snomed.info/sct|http://snomed.info/sct/900000000000207008/version/20220731"
      }
    ],
    "contains": [
      {
        "system": "http://snomed.info/sct",
        "code": "4834000",
        "display": "Typhoid fever"
      },
      {
        "system": "http://snomed.info/sct",
        "code": "6142004",
        "display": "Influenza"
      },
      {
        "system": "http://snomed.info/sct",
        "code": "14189004",
        "display": "Measles"
      },
      {
        "system": "http://snomed.info/sct",
        "code": "23502006",
        "display": "Lyme disease"
      },
      {
        "system": "http://snomed.info/sct",
        "code": "24662006",
        "display": "Influenza due to Influenza B virus"
      },
      {
        "system": "http://snomed.info/sct",
        "code": "25225006",
        "display": "Disease due to Adenovirus"
      },
      {
        "system": "http://snomed.info/sct",
        "code": "27836007",
        "display": "Pertussis"
      },
      {
        "system": "http://snomed.info/sct",
        "code": "32398004",
        "display": "Bronchitis"
      },
      {
        "system": "http://snomed.info/sct",
        "code": "36989005",
        "display": "Mumps"
      },
      {
        "system": "http://snomed.info/sct",
        "code": "38907003",
        "display": "Varicella"
      },
      {
        "system": "http://snomed.info/sct",
        "code": "40468003",
        "display": "Viral hepatitis, type A"
      },
      {
        "system": "http://snomed.info/sct",
        "code": "50711007",
        "display": "Viral hepatitis C"
      },
      {
        "system": "http://snomed.info/sct",
        "code": "56717001",
        "display": "Tuberculosis"
      },
      {
        "system": "http://snomed.info/sct",
        "code": "66071002",
        "display": "Type B viral hepatitis"
      },
      {
        "system": "http://snomed.info/sct",
        "code": "70036007",
        "display": "Haemophilus influenzae pneumonia"
      },
      {
        "system": "http://snomed.info/sct",
        "code": "76902006",
        "display": "Tetanus"
      },
      {
        "system": "http://snomed.info/sct",
        "code": "186150001",
        "display": "Enteritis due to rotavirus"
      },
      {
        "system": "http://snomed.info/sct",
        "code": "240532009",
        "display": "Human papilloma virus infection"
      },
      {
        "system": "http://snomed.info/sct",
        "code": "372244006",
        "display": "Malignant melanoma"
      },
      {
        "system": "http://snomed.info/sct",
        "code": "398102009",
        "display": "Acute poliomyelitis"
      },
      {
        "system": "http://snomed.info/sct",
        "code": "442438000",
        "display": "Influenza due to Influenza A virus"
      },
      {
        "system": "http://snomed.info/sct",
        "code": "840539006",
        "display": "COVID-19"
      }
    ]
  }
}