{
  "resourceType": "ValueSet",
  "id": "ips-problem-type-uv-ips",
  "meta": {
    "profile": [
      "http://hl7.org/fhir/StructureDefinition/shareablevalueset"
    ],
    "tag": [
      {
        "system": "https://mii-termserv.de/fhir/su-termserv/CodeSystem/mii-cs-suts-resource-tags-project",
        "code": "hl7-uv",
        "display": "HL7 Universal Realm"
      },
      {
        "system": "https://mii-termserv.de/fhir/su-termserv/CodeSystem/mii-cs-suts-resource-tags-dataset",
        "code": "ips",
        "display": "International Patient Summary"
      },
      {
        "system": "https://mii-termserv.de/fhir/su-termserv/CodeSystem/mii-cs-suts-resource-tags-license",
        "code": "https://mii-termserv.de/licenses#cc0-1.0",
        "display": "CC0-1.0 Universal"
      },
      {
        "system": "https://mii-termserv.de/fhir/su-termserv/CodeSystem/mii-cs-suts-resource-tags-dataset",
        "code": "hl7-uv-ig",
        "display": "HL7 Universal Realm IGs"
      }
    ]
  },
  "text": {
    "status": "generated",
    "div": "<div xmlns=\"http://www.w3.org/1999/xhtml\"><h2>Problem Type - IPS</h2><tt>http://hl7.org/fhir/uv/ips/ValueSet/problem-type-uv-ips</tt><p>This value set provides a category for the condition as a clinical problem for inclusion in the patient summary.</p><div><p><b>SU-TermServ Metadata</b></p><table><tbody><tr><td><b>Project</b></td><td>HL7 Universal Realm</td></tr><tr><td><b>Dataset</b></td><td>HL7 Universal Realm IGs</td></tr><tr><td><b>License</b></td><td><a href=\"https://mii-termserv.de/licenses#cc0-1.0\">CC0-1.0 Universal</a></td></tr><tr><td><b>Package Scope</b></td><td><a href=\"https://gitlab.com/groups/mii-termserv/fhir-resources/-/packages/?ForderBy%3Dversion%26sort%3Ddesc%26search%5B%5D%3D@mii-termserv/hl7.uv.ips.terminology\"><code>@mii-termserv/hl7.uv.ips.terminology</code></a></td></tr></tbody></table></div></div>"
  },
  "extension": [
    {
      "url": "http://hl7.org/fhir/StructureDefinition/structuredefinition-fmm",
      "valueInteger": 2,
      "_valueInteger": {
        "extension": [
          {
            "url": "http://hl7.org/fhir/StructureDefinition/structuredefinition-conformance-derivedFrom",
            "valueCanonical": "http://hl7.org/fhir/uv/ips/ImplementationGuide/ig-uv-ips"
          }
        ]
      }
    },
    {
      "url": "http://hl7.org/fhir/StructureDefinition/structuredefinition-standards-status",
      "valueCode": "trial-use",
      "_valueCode": {
        "extension": [
          {
            "url": "http://hl7.org/fhir/StructureDefinition/structuredefinition-conformance-derivedFrom",
            "valueCanonical": "http://hl7.org/fhir/uv/ips/ImplementationGuide/ig-uv-ips"
          }
        ]
      }
    },
    {
      "url": "http://hl7.org/fhir/StructureDefinition/cqf-scope",
      "valueString": "@mii-termserv/hl7.uv.ips.terminology"
    }
  ],
  "url": "http://hl7.org/fhir/uv/ips/ValueSet/problem-type-uv-ips",
  "version": "1.1.0",
  "name": "ProblemTypeUvIps",
  "title": "Problem Type - IPS",
  "status": "active",
  "experimental": false,
  "date": "2022-11-22T03:24:39+00:00",
  "publisher": "Health Level Seven International - Patient Care Work Group",
  "contact": [
    {
      "telecom": [
        {
          "system": "url",
          "value": "http://www.hl7.org/Special/committees/patientcare"
        }
      ]
    }
  ],
  "description": "This value set provides a category for the condition as a clinical problem for inclusion in the patient summary.",
  "jurisdiction": [
    {
      "coding": [
        {
          "system": "http://unstats.un.org/unsd/methods/m49/m49.htm",
          "code": "001"
        }
      ]
    }
  ],
  "immutable": false,
  "compose": {
    "include": [
      {
        "system": "http://terminology.hl7.org/CodeSystem/condition-category",
        "concept": [
          {
            "code": "problem-list-item",
            "display": "Problem List Item"
          }
        ]
      }
    ]
  }
}