{
  "resourceType": "ValueSet",
  "id": "ips-personal-relationship-uv-ips",
  "meta": {
    "profile": [
      "http://hl7.org/fhir/StructureDefinition/shareablevalueset"
    ],
    "tag": [
      {
        "system": "https://mii-termserv.de/fhir/su-termserv/CodeSystem/mii-cs-suts-resource-tags-project",
        "code": "hl7-uv",
        "display": "HL7 Universal Realm"
      },
      {
        "system": "https://mii-termserv.de/fhir/su-termserv/CodeSystem/mii-cs-suts-resource-tags-dataset",
        "code": "ips",
        "display": "International Patient Summary"
      },
      {
        "system": "https://mii-termserv.de/fhir/su-termserv/CodeSystem/mii-cs-suts-resource-tags-license",
        "code": "https://mii-termserv.de/licenses#cc0-1.0",
        "display": "CC0-1.0 Universal"
      },
      {
        "system": "https://mii-termserv.de/fhir/su-termserv/CodeSystem/mii-cs-suts-resource-tags-dataset",
        "code": "hl7-uv-ig",
        "display": "HL7 Universal Realm IGs"
      }
    ]
  },
  "text": {
    "status": "generated",
    "div": "<div xmlns=\"http://www.w3.org/1999/xhtml\"><h2>Personal Relationship - IPS [Deprecated]</h2><tt>http://hl7.org/fhir/uv/ips/ValueSet/personal-relationship-uv-ips</tt><p>The Value Set is used (optionally) to code the type of contact relationship between a person and the patient. This value set has been deprecated and will be removed in a future release.  It has been replaced with [PersonalRelationshipRoleType](https://terminology.hl7.org/3.1.0/ValueSet-v3-PersonalRelationshipRoleType.html)</p><div><p><b>SU-TermServ Metadata</b></p><table><tbody><tr><td><b>Project</b></td><td>HL7 Universal Realm</td></tr><tr><td><b>Dataset</b></td><td>HL7 Universal Realm IGs</td></tr><tr><td><b>License</b></td><td><a href=\"https://mii-termserv.de/licenses#cc0-1.0\">CC0-1.0 Universal</a></td></tr><tr><td><b>Package Scope</b></td><td><a href=\"https://gitlab.com/groups/mii-termserv/fhir-resources/-/packages/?ForderBy%3Dversion%26sort%3Ddesc%26search%5B%5D%3D@mii-termserv/hl7.uv.ips.terminology\"><code>@mii-termserv/hl7.uv.ips.terminology</code></a></td></tr></tbody></table></div></div>"
  },
  "extension": [
    {
      "url": "http://hl7.org/fhir/StructureDefinition/structuredefinition-fmm",
      "valueInteger": 2,
      "_valueInteger": {
        "extension": [
          {
            "url": "http://hl7.org/fhir/StructureDefinition/structuredefinition-conformance-derivedFrom",
            "valueCanonical": "http://hl7.org/fhir/uv/ips/ImplementationGuide/ig-uv-ips"
          }
        ]
      }
    },
    {
      "url": "http://hl7.org/fhir/StructureDefinition/structuredefinition-standards-status",
      "valueCode": "trial-use",
      "_valueCode": {
        "extension": [
          {
            "url": "http://hl7.org/fhir/StructureDefinition/structuredefinition-conformance-derivedFrom",
            "valueCanonical": "http://hl7.org/fhir/uv/ips/ImplementationGuide/ig-uv-ips"
          }
        ]
      }
    },
    {
      "url": "http://hl7.org/fhir/StructureDefinition/cqf-scope",
      "valueString": "@mii-termserv/hl7.uv.ips.terminology"
    }
  ],
  "url": "http://hl7.org/fhir/uv/ips/ValueSet/personal-relationship-uv-ips",
  "identifier": [
    {
      "use": "official",
      "system": "http://art-decor.org/ns/oids/vs",
      "value": "2.16.840.1.113883.11.22.54"
    }
  ],
  "version": "1.1.0",
  "name": "PersonalRelationshipUvIps",
  "title": "Personal Relationship - IPS [Deprecated]",
  "status": "active",
  "experimental": false,
  "date": "2022-11-22T03:24:39+00:00",
  "publisher": "Health Level Seven International - Patient Care Work Group",
  "contact": [
    {
      "telecom": [
        {
          "system": "url",
          "value": "http://www.hl7.org/Special/committees/patientcare"
        }
      ]
    }
  ],
  "description": "The Value Set is used (optionally) to code the type of contact relationship between a person and the patient. This value set has been deprecated and will be removed in a future release.  It has been replaced with [PersonalRelationshipRoleType](https://terminology.hl7.org/3.1.0/ValueSet-v3-PersonalRelationshipRoleType.html)",
  "jurisdiction": [
    {
      "coding": [
        {
          "system": "http://unstats.un.org/unsd/methods/m49/m49.htm",
          "code": "001"
        }
      ]
    }
  ],
  "immutable": false,
  "copyright": "Produced by HL7 under the terms of HL7® Governance and Operations Manual relating to Intellectual Property (Section 16), specifically its copyright, trademark and patent provisions.",
  "compose": {
    "include": [
      {
        "system": "http://terminology.hl7.org/CodeSystem/v3-RoleCode",
        "concept": [
          {
            "code": "AUNT",
            "display": "aunt"
          },
          {
            "code": "CHILD",
            "display": "child"
          },
          {
            "code": "CHLDADOPT",
            "display": "adopted child"
          },
          {
            "code": "CHLDFOST",
            "display": "foster child"
          },
          {
            "code": "CHLDINLAW",
            "display": "child in-law"
          },
          {
            "code": "COUSN",
            "display": "cousin"
          },
          {
            "code": "DAU",
            "display": "natural daughter"
          },
          {
            "code": "DAUADOPT",
            "display": "adopted daughter"
          },
          {
            "code": "DAUC",
            "display": "daughter"
          },
          {
            "code": "DAUFOST",
            "display": "foster daughter"
          },
          {
            "code": "DAUINLAW",
            "display": "daughter in-law"
          },
          {
            "code": "DOMPART",
            "display": "domestic partner"
          },
          {
            "code": "FAMMEMB",
            "display": "family member"
          },
          {
            "code": "FRND",
            "display": "unrelated friend"
          },
          {
            "code": "FTH",
            "display": "father"
          },
          {
            "code": "FTHINLAW",
            "display": "father-in-law"
          },
          {
            "code": "GGRPRN",
            "display": "great grandparent"
          },
          {
            "code": "GRNDCHILD",
            "display": "grandchild"
          },
          {
            "code": "GRPRN",
            "display": "grandparent"
          },
          {
            "code": "MTH",
            "display": "mother"
          },
          {
            "code": "MTHINLAW",
            "display": "mother-in-law"
          },
          {
            "code": "NBOR",
            "display": "neighbor"
          },
          {
            "code": "NCHILD",
            "display": "natural child"
          },
          {
            "code": "NIENEPH",
            "display": "niece/nephew"
          },
          {
            "code": "PRN",
            "display": "parent"
          },
          {
            "code": "PRNINLAW",
            "display": "parent in-law"
          },
          {
            "code": "ROOM",
            "display": "roomate"
          },
          {
            "code": "SIB",
            "display": "sibling"
          },
          {
            "code": "SIGOTHR",
            "display": "significant other"
          },
          {
            "code": "SON",
            "display": "natural son"
          },
          {
            "code": "SONADOPT",
            "display": "adopted son"
          },
          {
            "code": "SONC",
            "display": "son"
          },
          {
            "code": "SONFOST",
            "display": "foster son"
          },
          {
            "code": "SONINLAW",
            "display": "son in-law"
          },
          {
            "code": "SPS",
            "display": "spouse"
          },
          {
            "code": "STPCHLD",
            "display": "step child"
          },
          {
            "code": "STPDAU",
            "display": "stepdaughter"
          },
          {
            "code": "STPSON",
            "display": "stepson"
          },
          {
            "code": "UNCLE",
            "display": "uncle"
          }
        ]
      }
    ]
  }
}