{
  "resourceType": "CodeSystem",
  "id": "hl7.term-v2-0105",
  "text": {
    "status": "generated",
    "div": "<div xmlns=\"http://www.w3.org/1999/xhtml\"><h2>sourceOfComment</h2><tt>http://terminology.hl7.org/CodeSystem/v2-0105</tt><p>HL7-defined code system of concepts which are used to specify the source of a comment.  Used in HL7 Version 2.x messaging in the NTE segment.</p><div><p><b>SU-TermServ Metadata</b></p><table><tbody><tr><td><b>Project</b></td><td>HL7 International</td></tr><tr><td><b>Dataset</b></td><td>HL7 International</td></tr><tr><td><b>License</b></td><td><a href=\"https://mii-termserv.de/licenses#tho\">THO license</a></td></tr><tr><td><b>Package Scope</b></td><td><a href=\"https://gitlab.com/groups/mii-termserv/fhir-resources/-/packages/?ForderBy%3Dversion%26sort%3Ddesc%26search%5B%5D%3D@mii-termserv/hl7.terminology\"><code>@mii-termserv/hl7.terminology</code></a></td></tr></tbody></table></div></div>"
  },
  "extension": [
    {
      "url": "http://hl7.org/fhir/StructureDefinition/structuredefinition-wg",
      "valueCode": "inm"
    },
    {
      "url": "http://hl7.org/fhir/StructureDefinition/cqf-scope",
      "valueString": "@mii-termserv/hl7.terminology"
    }
  ],
  "url": "http://terminology.hl7.org/CodeSystem/v2-0105",
  "identifier": [
    {
      "system": "urn:ietf:rfc:3986",
      "value": "urn:oid:2.16.840.1.113883.18.42"
    }
  ],
  "version": "2.0.0",
  "name": "SourceOfComment",
  "title": "sourceOfComment",
  "status": "active",
  "experimental": false,
  "date": "2019-12-01",
  "publisher": "Health Level Seven International",
  "contact": [
    {
      "telecom": [
        {
          "system": "url",
          "value": "http://hl7.org"
        },
        {
          "system": "email",
          "value": "hq@HL7.org"
        }
      ]
    }
  ],
  "description": "HL7-defined code system of concepts which are used to specify the source of a comment.  Used in HL7 Version 2.x messaging in the NTE segment.",
  "purpose": "Underlying Master Code System for V2 table 0105 (Source of Comment)",
  "copyright": "This material derives from the HL7 Terminology (THO). THO is copyright ©1989+ Health Level Seven International and is made available under the CC0 designation. For more licensing information see: https://terminology.hl7.org/license",
  "caseSensitive": true,
  "valueSet": "http://terminology.hl7.org/ValueSet/v2-0105",
  "hierarchyMeaning": "is-a",
  "compositional": false,
  "versionNeeded": false,
  "content": "complete",
  "property": [
    {
      "code": "status",
      "uri": "http://terminology.hl7.org/CodeSystem/utg-concept-properties#status",
      "description": "Status of the concept",
      "type": "code"
    },
    {
      "code": "deprecated",
      "uri": "http://terminology.hl7.org/CodeSystem/utg-concept-properties#v2-table-deprecated",
      "description": "Version of HL7 in which the code was deprecated",
      "type": "code"
    }
  ],
  "concept": [
    {
      "id": "1338",
      "code": "L",
      "display": "Ancillary (filler) department is source of comment",
      "definition": "Ancillary (filler) department is source of comment",
      "designation": [
        {
          "language": "de",
          "use": {
            "system": "http://terminology.hl7.org/CodeSystem/hl7TermMaintInfra",
            "code": "preferredForLanguage"
          },
          "value": "Leistungsstelle"
        }
      ],
      "property": [
        {
          "code": "status",
          "valueCode": "A"
        }
      ]
    },
    {
      "id": "1339",
      "code": "P",
      "display": "Orderer (placer) is source of comment",
      "definition": "Orderer (placer) is source of comment",
      "designation": [
        {
          "language": "de",
          "use": {
            "system": "http://terminology.hl7.org/CodeSystem/hl7TermMaintInfra",
            "code": "preferredForLanguage"
          },
          "value": "Auftraggeber / auftraggebende Stelle"
        }
      ],
      "property": [
        {
          "code": "status",
          "valueCode": "A"
        }
      ]
    },
    {
      "id": "1340",
      "code": "O",
      "display": "Other system is source of comment",
      "definition": "Other system is source of comment",
      "designation": [
        {
          "language": "de",
          "use": {
            "system": "http://terminology.hl7.org/CodeSystem/hl7TermMaintInfra",
            "code": "preferredForLanguage"
          },
          "value": "Andere Stelle"
        }
      ],
      "property": [
        {
          "code": "status",
          "valueCode": "A"
        }
      ]
    }
  ],
  "meta": {
    "tag": [
      {
        "system": "https://mii-termserv.de/fhir/su-termserv/CodeSystem/mii-cs-suts-resource-tags-project",
        "code": "hl7",
        "display": "HL7 International"
      },
      {
        "system": "https://mii-termserv.de/fhir/su-termserv/CodeSystem/mii-cs-suts-resource-tags-dataset",
        "code": "hl7",
        "display": "HL7 International"
      },
      {
        "system": "https://mii-termserv.de/fhir/su-termserv/CodeSystem/mii-cs-suts-resource-tags-license",
        "code": "https://mii-termserv.de/licenses#tho",
        "display": "THO license"
      }
    ]
  }
}