{
  "resourceType": "ValueSet",
  "id": "hl7.term-cpt-base",
  "text": {
    "status": "generated",
    "div": "<div xmlns=\"http://www.w3.org/1999/xhtml\"><h2>AMA CPT Base Codes</h2><tt>http://terminology.hl7.org/ValueSet/cpt-base</tt><p>All codes in CPT that represent procedure codes (no modifiers allowed - e.g. for Claim.item.productOrService).</p><div><p><b>SU-TermServ Metadata</b></p><table><tbody><tr><td><b>Project</b></td><td>HL7 International</td></tr><tr><td><b>Dataset</b></td><td>HL7 International</td></tr><tr><td><b>License</b></td><td><a href=\"https://mii-termserv.de/licenses#tho\">THO license</a></td></tr><tr><td><b>Package Scope</b></td><td><a href=\"https://gitlab.com/groups/mii-termserv/fhir-resources/-/packages/?ForderBy%3Dversion%26sort%3Ddesc%26search%5B%5D%3D@mii-termserv/hl7.terminology\"><code>@mii-termserv/hl7.terminology</code></a></td></tr></tbody></table></div></div>"
  },
  "extension": [
    {
      "url": "http://hl7.org/fhir/StructureDefinition/structuredefinition-wg",
      "valueCode": "vocab"
    },
    {
      "url": "http://hl7.org/fhir/StructureDefinition/cqf-scope",
      "valueString": "@mii-termserv/hl7.terminology"
    }
  ],
  "url": "http://terminology.hl7.org/ValueSet/cpt-base",
  "version": "1.0.0",
  "name": "AmaCPTBaseCodes",
  "title": "AMA CPT Base Codes",
  "status": "active",
  "experimental": false,
  "date": "2023-08-05T16:43:13+10:00",
  "publisher": "Health Level Seven International",
  "contact": [
    {
      "telecom": [
        {
          "system": "url",
          "value": "http://hl7.org/fhir"
        },
        {
          "system": "email",
          "value": "fhir@lists.hl7.org"
        }
      ]
    }
  ],
  "description": "All codes in CPT that represent procedure codes (no modifiers allowed - e.g. for Claim.item.productOrService).",
  "immutable": true,
  "copyright": "CPT © Copyright 2023 American Medical Association. All rights reserved. AMA and CPT are registered trademarks of the American Medical Association.",
  "compose": {
    "include": [
      {
        "system": "http://www.ama-assn.org/go/cpt",
        "filter": [
          {
            "property": "modified",
            "op": "=",
            "value": "false"
          },
          {
            "property": "modifier",
            "op": "=",
            "value": "false"
          }
        ]
      }
    ]
  },
  "meta": {
    "tag": [
      {
        "system": "https://mii-termserv.de/fhir/su-termserv/CodeSystem/mii-cs-suts-resource-tags-project",
        "code": "hl7",
        "display": "HL7 International"
      },
      {
        "system": "https://mii-termserv.de/fhir/su-termserv/CodeSystem/mii-cs-suts-resource-tags-dataset",
        "code": "hl7",
        "display": "HL7 International"
      },
      {
        "system": "https://mii-termserv.de/fhir/su-termserv/CodeSystem/mii-cs-suts-resource-tags-license",
        "code": "https://mii-termserv.de/licenses#tho",
        "display": "THO license"
      }
    ]
  }
}