{
  "resourceType": "CodeSystem",
  "id": "hl7.term-medicationrequest-course-of-therapy",
  "meta": {
    "lastUpdated": "2020-04-09T21:10:28.568+00:00",
    "profile": [
      "http://hl7.org/fhir/StructureDefinition/shareablecodesystem"
    ],
    "tag": [
      {
        "system": "https://mii-termserv.de/fhir/su-termserv/CodeSystem/mii-cs-suts-resource-tags-project",
        "code": "hl7",
        "display": "HL7 International"
      },
      {
        "system": "https://mii-termserv.de/fhir/su-termserv/CodeSystem/mii-cs-suts-resource-tags-dataset",
        "code": "hl7",
        "display": "HL7 International"
      },
      {
        "system": "https://mii-termserv.de/fhir/su-termserv/CodeSystem/mii-cs-suts-resource-tags-license",
        "code": "https://mii-termserv.de/licenses#tho",
        "display": "THO license"
      }
    ]
  },
  "text": {
    "status": "generated",
    "div": "<div xmlns=\"http://www.w3.org/1999/xhtml\"><h2>MedicationRequest Course of Therapy Codes</h2><tt>http://terminology.hl7.org/CodeSystem/medicationrequest-course-of-therapy</tt><p>MedicationRequest Course of Therapy Codes</p><div><p><b>SU-TermServ Metadata</b></p><table><tbody><tr><td><b>Project</b></td><td>HL7 International</td></tr><tr><td><b>Dataset</b></td><td>HL7 International</td></tr><tr><td><b>License</b></td><td><a href=\"https://mii-termserv.de/licenses#tho\">THO license</a></td></tr><tr><td><b>Package Scope</b></td><td><a href=\"https://gitlab.com/groups/mii-termserv/fhir-resources/-/packages/?ForderBy%3Dversion%26sort%3Ddesc%26search%5B%5D%3D@mii-termserv/hl7.terminology\"><code>@mii-termserv/hl7.terminology</code></a></td></tr></tbody></table></div></div>"
  },
  "extension": [
    {
      "url": "http://hl7.org/fhir/StructureDefinition/structuredefinition-wg",
      "valueCode": "phx"
    },
    {
      "url": "http://hl7.org/fhir/StructureDefinition/structuredefinition-fmm",
      "valueInteger": 1
    },
    {
      "url": "http://hl7.org/fhir/StructureDefinition/cqf-scope",
      "valueString": "@mii-termserv/hl7.terminology"
    }
  ],
  "url": "http://terminology.hl7.org/CodeSystem/medicationrequest-course-of-therapy",
  "identifier": [
    {
      "system": "urn:ietf:rfc:3986",
      "value": "urn:oid:2.16.840.1.113883.4.642.1.1327"
    }
  ],
  "version": "1.0.0",
  "name": "MedicationRequestCourseOfTherapyCodes",
  "title": "MedicationRequest Course of Therapy Codes",
  "status": "draft",
  "experimental": false,
  "date": "2024-03-09T14:36:19-07:00",
  "publisher": "Health Level Seven International",
  "contact": [
    {
      "telecom": [
        {
          "system": "url",
          "value": "http://hl7.org"
        },
        {
          "system": "email",
          "value": "hq@HL7.org"
        }
      ]
    }
  ],
  "description": "MedicationRequest Course of Therapy Codes",
  "copyright": "This material derives from the HL7 Terminology (THO). THO is copyright ©1989+ Health Level Seven International and is made available under the CC0 designation. For more licensing information see: https://terminology.hl7.org/license",
  "caseSensitive": true,
  "valueSet": "http://terminology.hl7.org/ValueSet/medicationrequest-course-of-therapy",
  "content": "complete",
  "concept": [
    {
      "code": "continuous",
      "display": "Continuous long term therapy",
      "definition": "A medication which is expected to be continued beyond the present order and which the patient should be assumed to be taking unless explicitly stopped."
    },
    {
      "code": "acute",
      "display": "Short course (acute) therapy",
      "definition": "A medication which the patient is only expected to consume for the duration of the current order and which is not expected to be renewed."
    },
    {
      "code": "seasonal",
      "display": "Seasonal",
      "definition": "A medication which is expected to be used on a part time basis at certain times of the year"
    }
  ]
}