{
  "resourceType": "CodeSystem",
  "id": "hl7.term-communication-topic",
  "meta": {
    "lastUpdated": "2020-04-09T21:10:28.568+00:00",
    "tag": [
      {
        "system": "https://mii-termserv.de/fhir/su-termserv/CodeSystem/mii-cs-suts-resource-tags-project",
        "code": "hl7",
        "display": "HL7 International"
      },
      {
        "system": "https://mii-termserv.de/fhir/su-termserv/CodeSystem/mii-cs-suts-resource-tags-dataset",
        "code": "hl7",
        "display": "HL7 International"
      },
      {
        "system": "https://mii-termserv.de/fhir/su-termserv/CodeSystem/mii-cs-suts-resource-tags-license",
        "code": "https://mii-termserv.de/licenses#tho",
        "display": "THO license"
      }
    ]
  },
  "text": {
    "status": "generated",
    "div": "<div xmlns=\"http://www.w3.org/1999/xhtml\"><h2>CommunicationTopic</h2><tt>http://terminology.hl7.org/CodeSystem/communication-topic</tt><p>Codes describing the purpose or content of the communication.</p><div><p><b>SU-TermServ Metadata</b></p><table><tbody><tr><td><b>Project</b></td><td>HL7 International</td></tr><tr><td><b>Dataset</b></td><td>HL7 International</td></tr><tr><td><b>License</b></td><td><a href=\"https://mii-termserv.de/licenses#tho\">THO license</a></td></tr><tr><td><b>Package Scope</b></td><td><a href=\"https://gitlab.com/groups/mii-termserv/fhir-resources/-/packages/?ForderBy%3Dversion%26sort%3Ddesc%26search%5B%5D%3D@mii-termserv/hl7.terminology\"><code>@mii-termserv/hl7.terminology</code></a></td></tr></tbody></table></div></div>"
  },
  "extension": [
    {
      "url": "http://hl7.org/fhir/StructureDefinition/structuredefinition-wg",
      "valueCode": "pc"
    },
    {
      "url": "http://hl7.org/fhir/StructureDefinition/structuredefinition-fmm",
      "valueInteger": 1
    },
    {
      "url": "http://hl7.org/fhir/StructureDefinition/cqf-scope",
      "valueString": "@mii-termserv/hl7.terminology"
    }
  ],
  "url": "http://terminology.hl7.org/CodeSystem/communication-topic",
  "identifier": [
    {
      "system": "urn:ietf:rfc:3986",
      "value": "urn:oid:2.16.840.1.113883.4.642.1.1078"
    }
  ],
  "version": "1.0.0",
  "name": "CommunicationTopic",
  "title": "CommunicationTopic",
  "status": "draft",
  "experimental": false,
  "date": "2020-04-09T21:10:28+00:00",
  "publisher": "Health Level Seven International",
  "contact": [
    {
      "telecom": [
        {
          "system": "url",
          "value": "http://hl7.org"
        },
        {
          "system": "email",
          "value": "hq@HL7.org"
        }
      ]
    }
  ],
  "description": "Codes describing the purpose or content of the communication.",
  "copyright": "This material derives from the HL7 Terminology (THO). THO is copyright ©1989+ Health Level Seven International and is made available under the CC0 designation. For more licensing information see: https://terminology.hl7.org/license",
  "caseSensitive": true,
  "valueSet": "http://terminology.hl7.org/ValueSet/communication-topic",
  "content": "complete",
  "concept": [
    {
      "code": "prescription-refill-request",
      "display": "Prescription Refill Request",
      "definition": "The purpose or content of the communication is a prescription refill request."
    },
    {
      "code": "progress-update",
      "display": "Progress Update",
      "definition": "The purpose or content of the communication is a progress update."
    },
    {
      "code": "report-labs",
      "display": "Report Labs",
      "definition": "The purpose or content of the communication is to report labs."
    },
    {
      "code": "appointment-reminder",
      "display": "Appointment Reminder",
      "definition": "The purpose or content of the communication is an appointment reminder."
    },
    {
      "code": "phone-consult",
      "display": "Phone Consult",
      "definition": "The purpose or content of the communication is a phone consult."
    },
    {
      "code": "summary-report",
      "display": "Summary Report",
      "definition": "The purpose or content of the communication is a summary report."
    }
  ]
}