{
  "resourceType": "CodeSystem",
  "id": "hl7.term-v2-0085",
  "text": {
    "status": "generated",
    "div": "<div xmlns=\"http://www.w3.org/1999/xhtml\"><h2>observationResultStatusCodesInterpretation</h2><tt>http://terminology.hl7.org/CodeSystem/v2-0085</tt><p>HL7-defined code system of concepts which specify observation result status. These codes reflect the current completion status of the results for one Observation Identifier.  Used in HL7 Version 2.x messaging in the OBX segment.</p><div><p><b>SU-TermServ Metadata</b></p><table><tbody><tr><td><b>Project</b></td><td>HL7 International</td></tr><tr><td><b>Dataset</b></td><td>HL7 International</td></tr><tr><td><b>License</b></td><td><a href=\"https://mii-termserv.de/licenses#tho\">THO license</a></td></tr><tr><td><b>Package Scope</b></td><td><a href=\"https://gitlab.com/groups/mii-termserv/fhir-resources/-/packages/?ForderBy%3Dversion%26sort%3Ddesc%26search%5B%5D%3D@mii-termserv/hl7.terminology\"><code>@mii-termserv/hl7.terminology</code></a></td></tr></tbody></table></div></div>"
  },
  "extension": [
    {
      "url": "http://hl7.org/fhir/StructureDefinition/structuredefinition-wg",
      "valueCode": "oo"
    },
    {
      "url": "http://hl7.org/fhir/StructureDefinition/cqf-scope",
      "valueString": "@mii-termserv/hl7.terminology"
    }
  ],
  "url": "http://terminology.hl7.org/CodeSystem/v2-0085",
  "identifier": [
    {
      "system": "urn:ietf:rfc:3986",
      "value": "urn:oid:2.16.840.1.113883.18.34"
    }
  ],
  "version": "2.0.0",
  "name": "ObservationResultStatusCodesInterpretation",
  "title": "observationResultStatusCodesInterpretation",
  "status": "active",
  "experimental": false,
  "date": "2019-12-01",
  "publisher": "Health Level Seven International",
  "contact": [
    {
      "telecom": [
        {
          "system": "url",
          "value": "http://hl7.org"
        },
        {
          "system": "email",
          "value": "hq@HL7.org"
        }
      ]
    }
  ],
  "description": "HL7-defined code system of concepts which specify observation result status. These codes reflect the current completion status of the results for one Observation Identifier.  Used in HL7 Version 2.x messaging in the OBX segment.",
  "purpose": "Underlying Master Code System for V2 table 0085 (Observation Result Status Codes Interpretation)",
  "copyright": "This material derives from the HL7 Terminology (THO). THO is copyright ©1989+ Health Level Seven International and is made available under the CC0 designation. For more licensing information see: https://terminology.hl7.org/license",
  "caseSensitive": true,
  "valueSet": "http://terminology.hl7.org/ValueSet/v2-0085",
  "hierarchyMeaning": "is-a",
  "compositional": false,
  "versionNeeded": false,
  "content": "complete",
  "property": [
    {
      "code": "status",
      "uri": "http://terminology.hl7.org/CodeSystem/utg-concept-properties#status",
      "description": "Status of the concept",
      "type": "code"
    },
    {
      "code": "deprecated",
      "uri": "http://terminology.hl7.org/CodeSystem/utg-concept-properties#v2-table-deprecated",
      "description": "Version of HL7 in which the code was deprecated",
      "type": "code"
    },
    {
      "code": "v2-concComment",
      "uri": "http://terminology.hl7.org/CodeSystem/utg-concept-properties#v2-concComment",
      "description": "V2 Concept Comment",
      "type": "string"
    },
    {
      "code": "v2-concCommentAsPub",
      "uri": "http://terminology.hl7.org/CodeSystem/utg-concept-properties#v2-concCommentAsPub",
      "description": "V2 Concept Comment As Published",
      "type": "string"
    }
  ],
  "concept": [
    {
      "id": "1288",
      "code": "A",
      "display": "Amended based on adjustments provided by the Placer (Physician) regarding patient demographics (such as age and/or gender or other patient specific information",
      "definition": "Amended based on adjustments provided by the Placer (Physician) regarding patient demographics (such as age and/or gender or other patient specific information",
      "property": [
        {
          "code": "status",
          "valueCode": "A"
        }
      ]
    },
    {
      "id": "1289",
      "code": "B",
      "display": "Appended Report - Final results reviewed and further information provided for clarity without change to the original result values.",
      "definition": "Appended Report - Final results reviewed and further information provided for clarity without change to the original result values.",
      "property": [
        {
          "code": "status",
          "valueCode": "A"
        }
      ]
    },
    {
      "id": "1290",
      "code": "C",
      "display": "Record coming over is a correction and thus replaces a final result",
      "definition": "Record coming over is a correction and thus replaces a final result",
      "designation": [
        {
          "language": "de",
          "use": {
            "system": "http://terminology.hl7.org/CodeSystem/hl7TermMaintInfra",
            "code": "preferredForLanguage"
          },
          "value": "Korrektur bereits gemeldeter Ergebnisse"
        }
      ],
      "property": [
        {
          "code": "status",
          "valueCode": "A"
        }
      ]
    },
    {
      "id": "1291",
      "code": "D",
      "display": "Deletes the OBX record",
      "definition": "Deletes the OBX record",
      "designation": [
        {
          "language": "de",
          "use": {
            "system": "http://terminology.hl7.org/CodeSystem/hl7TermMaintInfra",
            "code": "preferredForLanguage"
          },
          "value": "Gemeldete Ergebnisse löschen"
        }
      ],
      "property": [
        {
          "code": "status",
          "valueCode": "A"
        }
      ]
    },
    {
      "id": "1292",
      "code": "F",
      "display": "Final results",
      "definition": "Final results",
      "designation": [
        {
          "language": "de",
          "use": {
            "system": "http://terminology.hl7.org/CodeSystem/hl7TermMaintInfra",
            "code": "preferredForLanguage"
          },
          "value": "Endergebnis"
        }
      ],
      "property": [
        {
          "code": "status",
          "valueCode": "A"
        }
      ]
    },
    {
      "id": "1293",
      "code": "I",
      "display": "Specimen in lab; results pending",
      "definition": "Specimen in lab; results pending",
      "designation": [
        {
          "language": "de",
          "use": {
            "system": "http://terminology.hl7.org/CodeSystem/hl7TermMaintInfra",
            "code": "preferredForLanguage"
          },
          "value": "Probe im Labor - Ergebnisse stehen an"
        }
      ],
      "property": [
        {
          "code": "status",
          "valueCode": "A"
        }
      ]
    },
    {
      "id": "1294",
      "code": "N",
      "display": "Not asked; used to affirmatively document that the observation identified in the OBX was not sought when the universal service ID in OBR-4 implies that it would be sought.",
      "definition": "Not asked; used to affirmatively document that the observation identified in the OBX was not sought when the universal service ID in OBR-4 implies that it would be sought.",
      "designation": [
        {
          "language": "de",
          "use": {
            "system": "http://terminology.hl7.org/CodeSystem/hl7TermMaintInfra",
            "code": "preferredForLanguage"
          },
          "value": "ungefragte Übertragung"
        }
      ],
      "property": [
        {
          "code": "status",
          "valueCode": "A"
        }
      ]
    },
    {
      "id": "1295",
      "code": "O",
      "display": "Order detail description only (no result)",
      "definition": "Order detail description only (no result)",
      "designation": [
        {
          "language": "de",
          "use": {
            "system": "http://terminology.hl7.org/CodeSystem/hl7TermMaintInfra",
            "code": "preferredForLanguage"
          },
          "value": "Anforderungsbeschreibung (ohne Ergebnisse)"
        }
      ],
      "property": [
        {
          "code": "status",
          "valueCode": "A"
        }
      ]
    },
    {
      "id": "1296",
      "code": "P",
      "display": "Preliminary results",
      "definition": "Preliminary results",
      "designation": [
        {
          "language": "de",
          "use": {
            "system": "http://terminology.hl7.org/CodeSystem/hl7TermMaintInfra",
            "code": "preferredForLanguage"
          },
          "value": "Vorläufige Ergebnisse"
        }
      ],
      "property": [
        {
          "code": "status",
          "valueCode": "A"
        }
      ]
    },
    {
      "id": "1297",
      "code": "R",
      "display": "Results entered -- not verified",
      "definition": "Results entered -- not verified",
      "designation": [
        {
          "language": "de",
          "use": {
            "system": "http://terminology.hl7.org/CodeSystem/hl7TermMaintInfra",
            "code": "preferredForLanguage"
          },
          "value": "Nicht validierte Ergebnisse"
        }
      ],
      "property": [
        {
          "code": "status",
          "valueCode": "A"
        }
      ]
    },
    {
      "id": "1298",
      "code": "S",
      "display": "Partial results.   Deprecated. Retained only for backward compatibility as of V2.6.",
      "definition": "Partial results.   Deprecated. Retained only for backward compatibility as of V2.6.",
      "designation": [
        {
          "language": "de",
          "use": {
            "system": "http://terminology.hl7.org/CodeSystem/hl7TermMaintInfra",
            "code": "preferredForLanguage"
          },
          "value": "Teilergebnisse"
        }
      ],
      "property": [
        {
          "code": "v2-concComment",
          "valueString": "Deprecated."
        },
        {
          "code": "v2-concCommentAsPub",
          "valueString": "Deprecated."
        },
        {
          "code": "status",
          "valueCode": "A"
        }
      ]
    },
    {
      "id": "1299",
      "code": "V",
      "display": "Verified - Final results reviewed and confirmed to be correct, no change to result value, normal range or abnormal flag",
      "definition": "Verified - Final results reviewed and confirmed to be correct, no change to result value, normal range or abnormal flag",
      "property": [
        {
          "code": "status",
          "valueCode": "A"
        }
      ]
    },
    {
      "id": "1300",
      "code": "X",
      "display": "Results cannot be obtained for this observation",
      "definition": "Results cannot be obtained for this observation",
      "designation": [
        {
          "language": "de",
          "use": {
            "system": "http://terminology.hl7.org/CodeSystem/hl7TermMaintInfra",
            "code": "preferredForLanguage"
          },
          "value": "Untersuchung führt zu keinem Ergebnis"
        }
      ],
      "property": [
        {
          "code": "status",
          "valueCode": "A"
        }
      ]
    },
    {
      "id": "1301",
      "code": "U",
      "display": "Results status change to final without retransmitting results already sent as 'preliminary.'  E.g., radiology changes status from preliminary to final",
      "definition": "Results status change to final without retransmitting results already sent as 'preliminary.'  E.g., radiology changes status from preliminary to final",
      "designation": [
        {
          "language": "de",
          "use": {
            "system": "http://terminology.hl7.org/CodeSystem/hl7TermMaintInfra",
            "code": "preferredForLanguage"
          },
          "value": "Vorläufiges Ergebnis wird Endergebnis, da keine Änderung"
        }
      ],
      "property": [
        {
          "code": "status",
          "valueCode": "A"
        }
      ]
    },
    {
      "id": "1302",
      "code": "W",
      "display": "Post original as wrong, e.g., transmitted for wrong patient",
      "definition": "Post original as wrong, e.g., transmitted for wrong patient",
      "designation": [
        {
          "language": "de",
          "use": {
            "system": "http://terminology.hl7.org/CodeSystem/hl7TermMaintInfra",
            "code": "preferredForLanguage"
          },
          "value": "fehlerhafte Übertragung"
        }
      ],
      "property": [
        {
          "code": "status",
          "valueCode": "A"
        }
      ]
    }
  ],
  "meta": {
    "tag": [
      {
        "system": "https://mii-termserv.de/fhir/su-termserv/CodeSystem/mii-cs-suts-resource-tags-project",
        "code": "hl7",
        "display": "HL7 International"
      },
      {
        "system": "https://mii-termserv.de/fhir/su-termserv/CodeSystem/mii-cs-suts-resource-tags-dataset",
        "code": "hl7",
        "display": "HL7 International"
      },
      {
        "system": "https://mii-termserv.de/fhir/su-termserv/CodeSystem/mii-cs-suts-resource-tags-license",
        "code": "https://mii-termserv.de/licenses#tho",
        "display": "THO license"
      }
    ]
  }
}