{
  "resourceType": "CodeSystem",
  "id": "hl7.term-extra-security-role-type",
  "meta": {
    "lastUpdated": "2020-04-09T21:10:28.568+00:00",
    "profile": [
      "http://hl7.org/fhir/StructureDefinition/shareablecodesystem"
    ],
    "tag": [
      {
        "system": "https://mii-termserv.de/fhir/su-termserv/CodeSystem/mii-cs-suts-resource-tags-project",
        "code": "hl7",
        "display": "HL7 International"
      },
      {
        "system": "https://mii-termserv.de/fhir/su-termserv/CodeSystem/mii-cs-suts-resource-tags-dataset",
        "code": "hl7",
        "display": "HL7 International"
      },
      {
        "system": "https://mii-termserv.de/fhir/su-termserv/CodeSystem/mii-cs-suts-resource-tags-license",
        "code": "https://mii-termserv.de/licenses#tho",
        "display": "THO license"
      }
    ]
  },
  "text": {
    "status": "generated",
    "div": "<div xmlns=\"http://www.w3.org/1999/xhtml\"><h2>Security Role Type</h2><tt>http://terminology.hl7.org/CodeSystem/extra-security-role-type</tt><p>This CodeSystem contains Additional FHIR-defined Security Role types not defined elsewhere</p><div><p><b>SU-TermServ Metadata</b></p><table><tbody><tr><td><b>Project</b></td><td>HL7 International</td></tr><tr><td><b>Dataset</b></td><td>HL7 International</td></tr><tr><td><b>License</b></td><td><a href=\"https://mii-termserv.de/licenses#tho\">THO license</a></td></tr><tr><td><b>Package Scope</b></td><td><a href=\"https://gitlab.com/groups/mii-termserv/fhir-resources/-/packages/?ForderBy%3Dversion%26sort%3Ddesc%26search%5B%5D%3D@mii-termserv/hl7.terminology\"><code>@mii-termserv/hl7.terminology</code></a></td></tr></tbody></table></div></div>"
  },
  "url": "http://terminology.hl7.org/CodeSystem/extra-security-role-type",
  "version": "1.0.0",
  "name": "SecurityRoleType",
  "title": "Security Role Type",
  "status": "draft",
  "experimental": true,
  "date": "2017-02-13",
  "publisher": "Health Level Seven International",
  "contact": [
    {
      "telecom": [
        {
          "system": "url",
          "value": "http://hl7.org"
        },
        {
          "system": "email",
          "value": "hq@HL7.org"
        }
      ]
    }
  ],
  "description": "This CodeSystem contains Additional FHIR-defined Security Role types not defined elsewhere",
  "copyright": "This material derives from the HL7 Terminology (THO). THO is copyright ©1989+ Health Level Seven International and is made available under the CC0 designation. For more licensing information see: https://terminology.hl7.org/license",
  "caseSensitive": true,
  "content": "complete",
  "concept": [
    {
      "code": "authserver",
      "display": "Authorization Server",
      "definition": "An entity providing authorization services to enable the electronic sharing of health-related information based on resource owner's preapproved permissions. For example, an UMA Authorization Server[UMA]"
    },
    {
      "code": "datacollector",
      "display": "Data Collector",
      "definition": "An entity that collects information over which the data subject may have certain rights under policy or law to control that information's management and distribution by data collectors, including the right to access, retrieve, distribute, or delete that information."
    },
    {
      "code": "dataprocessor",
      "display": "Data Processor",
      "definition": "An entity that processes collected information over which the data subject may have certain rights under policy or law to control that information's management and distribution by data processors, including the right to access, retrieve, distribute, or delete that information."
    },
    {
      "code": "datasubject",
      "display": "Data Subject",
      "definition": "A person whose personal information is collected or processed, and who may have certain rights under policy or law to control that information's management and distribution by data collectors or processors, including the right to access, retrieve, distribute, or delete that information."
    },
    {
      "code": "humanuser",
      "display": "Human User",
      "definition": "The human user that has participated."
    }
  ],
  "extension": [
    {
      "url": "http://hl7.org/fhir/StructureDefinition/cqf-scope",
      "valueString": "@mii-termserv/hl7.terminology"
    }
  ]
}