{
  "resourceType": "ValueSet",
  "id": "hl7.term-mif-conceptRelationshipTransitivity",
  "text": {
    "status": "generated",
    "div": "<div xmlns=\"http://www.w3.org/1999/xhtml\"><h2>MIF Concept Relationship Transitivity</h2><tt>http://terminology.hl7.org/ValueSet/mif-conceptRelationshipTransitivity</tt><p>Codes for use in the ext-mif-relationship-transitivity to capture V3 Model Interchange Format (MIF) SupportedConceptRelationship.transitivity values</p><div><p><b>SU-TermServ Metadata</b></p><table><tbody><tr><td><b>Project</b></td><td>HL7 International</td></tr><tr><td><b>Dataset</b></td><td>HL7 International</td></tr><tr><td><b>License</b></td><td><a href=\"https://mii-termserv.de/licenses#tho\">THO license</a></td></tr><tr><td><b>Package Scope</b></td><td><a href=\"https://gitlab.com/groups/mii-termserv/fhir-resources/-/packages/?ForderBy%3Dversion%26sort%3Ddesc%26search%5B%5D%3D@mii-termserv/hl7.terminology\"><code>@mii-termserv/hl7.terminology</code></a></td></tr></tbody></table></div></div>"
  },
  "url": "http://terminology.hl7.org/ValueSet/mif-conceptRelationshipTransitivity",
  "version": "1.0.0",
  "name": "MIFConceptRelationshipTransitivity",
  "title": "MIF Concept Relationship Transitivity",
  "status": "draft",
  "experimental": false,
  "date": "2024-03-09T14:36:19-07:00",
  "publisher": "Health Level Seven International",
  "contact": [
    {
      "telecom": [
        {
          "system": "url",
          "value": "http://hl7.org"
        },
        {
          "system": "email",
          "value": "hq@HL7.org"
        }
      ]
    }
  ],
  "description": "Codes for use in the ext-mif-relationship-transitivity to capture V3 Model Interchange Format (MIF) SupportedConceptRelationship.transitivity values",
  "copyright": "This material derives from the HL7 Terminology (THO). THO is copyright ©1989+ Health Level Seven International and is made available under the CC0 designation. For more licensing information see: https://terminology.hl7.org/license",
  "compose": {
    "include": [
      {
        "system": "http://terminology.hl7.org/CodeSystem/hl7TermMaintInfra",
        "filter": [
          {
            "property": "concept",
            "op": "is-a",
            "value": "MIF-ConceptRelationshipTransitivity"
          }
        ]
      }
    ],
    "exclude": [
      {
        "system": "http://terminology.hl7.org/CodeSystem/hl7TermMaintInfra",
        "concept": [
          {
            "code": "MIF-ConceptRelationshipTransitivity"
          }
        ]
      }
    ]
  },
  "meta": {
    "tag": [
      {
        "system": "https://mii-termserv.de/fhir/su-termserv/CodeSystem/mii-cs-suts-resource-tags-project",
        "code": "hl7",
        "display": "HL7 International"
      },
      {
        "system": "https://mii-termserv.de/fhir/su-termserv/CodeSystem/mii-cs-suts-resource-tags-dataset",
        "code": "hl7",
        "display": "HL7 International"
      },
      {
        "system": "https://mii-termserv.de/fhir/su-termserv/CodeSystem/mii-cs-suts-resource-tags-license",
        "code": "https://mii-termserv.de/licenses#tho",
        "display": "THO license"
      }
    ]
  },
  "extension": [
    {
      "url": "http://hl7.org/fhir/StructureDefinition/cqf-scope",
      "valueString": "@mii-termserv/hl7.terminology"
    }
  ]
}