{
  "resourceType": "ValueSet",
  "id": "hl7.term-v3-HL7FormatCodes",
  "text": {
    "status": "generated",
    "div": "<div xmlns=\"http://www.w3.org/1999/xhtml\"><h2>HL7 ValueSet of Format Codes for use with Document Sharing</h2><tt>http://terminology.hl7.org/ValueSet/v3-HL7FormatCodes</tt><p>The HL7-FormatCodes value set is defined to be the set of FormatCode(s) defined by implementation guides published by HL7 and other SDOs. The use of a formatCode from the FormatCodes value set specifies the technical format that a document conforms to. The formatCode is a further specialization more detailed than the mime-type. The formatCode provides sufficient information to allow any potential document content consumer to know if it can process and/or display the content of the document based on the document encoding, structure and template conformance indicated by the formatCode. The set of formatCodes is intended to be extensible. The Content Logical Description is defined intentionally to permit formatCodes defined by other Standards Development Organizations to be added by inclusion of additional formatCode Code Systems.</p><div><p><b>SU-TermServ Metadata</b></p><table><tbody><tr><td><b>Project</b></td><td>HL7 International</td></tr><tr><td><b>Dataset</b></td><td>HL7 International</td></tr><tr><td><b>License</b></td><td><a href=\"https://mii-termserv.de/licenses#tho\">THO license</a></td></tr><tr><td><b>Package Scope</b></td><td><a href=\"https://gitlab.com/groups/mii-termserv/fhir-resources/-/packages/?ForderBy%3Dversion%26sort%3Ddesc%26search%5B%5D%3D@mii-termserv/hl7.terminology\"><code>@mii-termserv/hl7.terminology</code></a></td></tr></tbody></table></div></div>"
  },
  "url": "http://terminology.hl7.org/ValueSet/v3-HL7FormatCodes",
  "identifier": [
    {
      "system": "urn:ietf:rfc:3986",
      "value": "urn:oid:2.16.840.1.113883.11.19752"
    }
  ],
  "version": "2.0.0",
  "name": "HL7FormatCodes",
  "title": "HL7 ValueSet of Format Codes for use with Document Sharing",
  "status": "active",
  "experimental": false,
  "date": "2021-10-01",
  "publisher": "Health Level Seven International",
  "contact": [
    {
      "telecom": [
        {
          "system": "url",
          "value": "http://hl7.org"
        },
        {
          "system": "email",
          "value": "hq@HL7.org"
        }
      ]
    }
  ],
  "description": "The HL7-FormatCodes value set is defined to be the set of FormatCode(s) defined by implementation guides published by HL7 and other SDOs. The use of a formatCode from the FormatCodes value set specifies the technical format that a document conforms to. The formatCode is a further specialization more detailed than the mime-type. The formatCode provides sufficient information to allow any potential document content consumer to know if it can process and/or display the content of the document based on the document encoding, structure and template conformance indicated by the formatCode. The set of formatCodes is intended to be extensible. The Content Logical Description is defined intentionally to permit formatCodes defined by other Standards Development Organizations to be added by inclusion of additional formatCode Code Systems.",
  "jurisdiction": [
    {
      "coding": [
        {
          "system": "http://unstats.un.org/unsd/methods/m49/m49.htm",
          "code": "001"
        }
      ]
    }
  ],
  "immutable": false,
  "copyright": "This material derives from the HL7 Terminology THO. THO is copyright ©1989+ Health Level Seven International and is made available under the CC0 designation. For more licensing information see: https://terminology.hl7.org/license",
  "compose": {
    "include": [
      {
        "system": "http://ihe.net/fhir/ihe.formatcode.fhir/CodeSystem/formatcode",
        "filter": [
          {
            "property": "notSelectable",
            "op": "=",
            "value": "false"
          }
        ]
      },
      {
        "system": "http://terminology.hl7.org/CodeSystem/v3-HL7DocumentFormatCodes"
      }
    ]
  },
  "meta": {
    "tag": [
      {
        "system": "https://mii-termserv.de/fhir/su-termserv/CodeSystem/mii-cs-suts-resource-tags-project",
        "code": "hl7",
        "display": "HL7 International"
      },
      {
        "system": "https://mii-termserv.de/fhir/su-termserv/CodeSystem/mii-cs-suts-resource-tags-dataset",
        "code": "hl7",
        "display": "HL7 International"
      },
      {
        "system": "https://mii-termserv.de/fhir/su-termserv/CodeSystem/mii-cs-suts-resource-tags-license",
        "code": "https://mii-termserv.de/licenses#tho",
        "display": "THO license"
      }
    ]
  },
  "extension": [
    {
      "url": "http://hl7.org/fhir/StructureDefinition/cqf-scope",
      "valueString": "@mii-termserv/hl7.terminology"
    }
  ]
}