{
  "resourceType": "CodeSystem",
  "id": "hl7.term-software-system-type-codes",
  "text": {
    "status": "generated",
    "div": "<div xmlns=\"http://www.w3.org/1999/xhtml\"><h2>Software System Type Codes</h2><tt>http://terminology.hl7.org/CodeSystem/software-system-type-codes</tt><p>Types of software systems that support knowledge artifact authoring and evaluation (authoring, testing, tooling, evaluation)</p><div><p><b>SU-TermServ Metadata</b></p><table><tbody><tr><td><b>Project</b></td><td>HL7 International</td></tr><tr><td><b>Dataset</b></td><td>HL7 International</td></tr><tr><td><b>License</b></td><td><a href=\"https://mii-termserv.de/licenses#tho\">THO license</a></td></tr><tr><td><b>Package Scope</b></td><td><a href=\"https://gitlab.com/groups/mii-termserv/fhir-resources/-/packages/?ForderBy%3Dversion%26sort%3Ddesc%26search%5B%5D%3D@mii-termserv/hl7.terminology\"><code>@mii-termserv/hl7.terminology</code></a></td></tr></tbody></table></div></div>"
  },
  "extension": [
    {
      "url": "http://hl7.org/fhir/StructureDefinition/structuredefinition-wg",
      "valueCode": "cds"
    },
    {
      "url": "http://hl7.org/fhir/StructureDefinition/structuredefinition-standards-status",
      "valueCode": "trial-use"
    },
    {
      "url": "http://hl7.org/fhir/StructureDefinition/structuredefinition-fmm",
      "valueInteger": 3
    },
    {
      "url": "http://hl7.org/fhir/StructureDefinition/cqf-scope",
      "valueString": "@mii-termserv/hl7.terminology"
    }
  ],
  "url": "http://terminology.hl7.org/CodeSystem/software-system-type-codes",
  "version": "1.0.0",
  "name": "SoftwareSystemTypeCodes",
  "title": "Software System Type Codes",
  "status": "active",
  "experimental": false,
  "date": "2024-02-16",
  "publisher": "Health Level Seven International",
  "contact": [
    {
      "telecom": [
        {
          "system": "url",
          "value": "http://hl7.org"
        },
        {
          "system": "email",
          "value": "hq@HL7.org"
        }
      ]
    }
  ],
  "description": "Types of software systems that support knowledge artifact authoring and evaluation (authoring, testing, tooling, evaluation)",
  "jurisdiction": [
    {
      "coding": [
        {
          "system": "http://unstats.un.org/unsd/methods/m49/m49.htm",
          "code": "001",
          "display": "World"
        }
      ]
    }
  ],
  "copyright": "This material derives from the HL7 Terminology THO. THO is copyright ©1989+ Health Level Seven International and is made available under the CC0 designation. For more licensing information see: https://terminology.hl7.org/license",
  "caseSensitive": true,
  "valueSet": "http://terminology.hl7.org/ValueSet/software-system-type",
  "content": "complete",
  "concept": [
    {
      "code": "authoring",
      "display": "Authoring",
      "definition": "A knowledge authoring environment"
    },
    {
      "code": "testing",
      "display": "Testing",
      "definition": "A testing environment"
    },
    {
      "code": "tooling",
      "display": "Tooling",
      "definition": "Tooling software"
    },
    {
      "code": "evaluation",
      "display": "Evaluation",
      "definition": "A knowledge evaluation environment"
    },
    {
      "code": "reporting",
      "display": "Reporting",
      "definition": "A quality reporting system"
    },
    {
      "code": "data-capture",
      "display": "Data Capture",
      "definition": "A system that performs data-capture as part of a reporting pipeline"
    }
  ],
  "meta": {
    "tag": [
      {
        "system": "https://mii-termserv.de/fhir/su-termserv/CodeSystem/mii-cs-suts-resource-tags-project",
        "code": "hl7",
        "display": "HL7 International"
      },
      {
        "system": "https://mii-termserv.de/fhir/su-termserv/CodeSystem/mii-cs-suts-resource-tags-dataset",
        "code": "hl7",
        "display": "HL7 International"
      },
      {
        "system": "https://mii-termserv.de/fhir/su-termserv/CodeSystem/mii-cs-suts-resource-tags-license",
        "code": "https://mii-termserv.de/licenses#tho",
        "display": "THO license"
      }
    ]
  }
}