{
  "resourceType": "CodeSystem",
  "id": "hl7.term-special-values",
  "meta": {
    "lastUpdated": "2020-04-09T21:10:28.568+00:00",
    "tag": [
      {
        "system": "https://mii-termserv.de/fhir/su-termserv/CodeSystem/mii-cs-suts-resource-tags-project",
        "code": "hl7",
        "display": "HL7 International"
      },
      {
        "system": "https://mii-termserv.de/fhir/su-termserv/CodeSystem/mii-cs-suts-resource-tags-dataset",
        "code": "hl7",
        "display": "HL7 International"
      },
      {
        "system": "https://mii-termserv.de/fhir/su-termserv/CodeSystem/mii-cs-suts-resource-tags-license",
        "code": "https://mii-termserv.de/licenses#tho",
        "display": "THO license"
      }
    ]
  },
  "text": {
    "status": "generated",
    "div": "<div xmlns=\"http://www.w3.org/1999/xhtml\"><h2>SpecialValues</h2><tt>http://terminology.hl7.org/CodeSystem/special-values</tt><p>A set of generally useful codes defined so they can be included in value sets.</p><div><p><b>SU-TermServ Metadata</b></p><table><tbody><tr><td><b>Project</b></td><td>HL7 International</td></tr><tr><td><b>Dataset</b></td><td>HL7 International</td></tr><tr><td><b>License</b></td><td><a href=\"https://mii-termserv.de/licenses#tho\">THO license</a></td></tr><tr><td><b>Package Scope</b></td><td><a href=\"https://gitlab.com/groups/mii-termserv/fhir-resources/-/packages/?ForderBy%3Dversion%26sort%3Ddesc%26search%5B%5D%3D@mii-termserv/hl7.terminology\"><code>@mii-termserv/hl7.terminology</code></a></td></tr></tbody></table></div></div>"
  },
  "extension": [
    {
      "url": "http://hl7.org/fhir/StructureDefinition/structuredefinition-wg",
      "valueCode": "fhir"
    },
    {
      "url": "http://hl7.org/fhir/StructureDefinition/cqf-scope",
      "valueString": "@mii-termserv/hl7.terminology"
    }
  ],
  "url": "http://terminology.hl7.org/CodeSystem/special-values",
  "identifier": [
    {
      "system": "urn:ietf:rfc:3986",
      "value": "urn:oid:2.16.840.1.113883.4.642.1.1049"
    }
  ],
  "version": "1.0.0",
  "name": "SpecialValues",
  "title": "SpecialValues",
  "status": "draft",
  "experimental": false,
  "date": "2020-04-09T21:10:28+00:00",
  "publisher": "Health Level Seven International",
  "contact": [
    {
      "telecom": [
        {
          "system": "url",
          "value": "http://hl7.org"
        },
        {
          "system": "email",
          "value": "hq@HL7.org"
        }
      ]
    }
  ],
  "description": "A set of generally useful codes defined so they can be included in value sets.",
  "copyright": "This material derives from the HL7 Terminology (THO). THO is copyright ©1989+ Health Level Seven International and is made available under the CC0 designation. For more licensing information see: https://terminology.hl7.org/license",
  "caseSensitive": true,
  "valueSet": "http://terminology.hl7.org/ValueSet/special-values",
  "content": "complete",
  "concept": [
    {
      "code": "true",
      "display": "true",
      "definition": "Boolean true."
    },
    {
      "code": "false",
      "display": "false",
      "definition": "Boolean false."
    },
    {
      "code": "trace",
      "display": "Trace Amount Detected",
      "definition": "The content is greater than zero, but too small to be quantified."
    },
    {
      "extension": [
        {
          "url": "http://hl7.org/fhir/StructureDefinition/codesystem-concept-comments",
          "valueString": "used in formulations (e.g. 'Add 10mg of ingredient X, 50mg of ingredient Y, and sufficient quantity of water to 100mL.' This code would be used to express the quantity of water. )"
        }
      ],
      "code": "sufficient",
      "display": "Sufficient Quantity",
      "definition": "The specific quantity is not known, but is known to be non-zero and is not specified because it makes up the bulk of the material."
    },
    {
      "code": "withdrawn",
      "display": "Value Withdrawn",
      "definition": "The value is no longer available."
    },
    {
      "extension": [
        {
          "url": "http://hl7.org/fhir/StructureDefinition/codesystem-concept-comments",
          "valueString": "The existence of this subject to review"
        }
      ],
      "code": "nil-known",
      "display": "Nil Known",
      "definition": "The are no known applicable values in this context."
    }
  ]
}