{
  "resourceType": "CodeSystem",
  "id": "hl7.term-list-example-use-codes",
  "meta": {
    "lastUpdated": "2020-04-09T21:10:28.568+00:00",
    "profile": [
      "http://hl7.org/fhir/StructureDefinition/shareablecodesystem"
    ],
    "tag": [
      {
        "system": "https://mii-termserv.de/fhir/su-termserv/CodeSystem/mii-cs-suts-resource-tags-project",
        "code": "hl7",
        "display": "HL7 International"
      },
      {
        "system": "https://mii-termserv.de/fhir/su-termserv/CodeSystem/mii-cs-suts-resource-tags-dataset",
        "code": "hl7",
        "display": "HL7 International"
      },
      {
        "system": "https://mii-termserv.de/fhir/su-termserv/CodeSystem/mii-cs-suts-resource-tags-license",
        "code": "https://mii-termserv.de/licenses#tho",
        "display": "THO license"
      }
    ]
  },
  "text": {
    "status": "generated",
    "div": "<div xmlns=\"http://www.w3.org/1999/xhtml\"><h2>Example Use Codes for List</h2><tt>http://terminology.hl7.org/CodeSystem/list-example-use-codes</tt><p>Example use codes for the List resource - typical kinds of use.</p><div><p><b>SU-TermServ Metadata</b></p><table><tbody><tr><td><b>Project</b></td><td>HL7 International</td></tr><tr><td><b>Dataset</b></td><td>HL7 International</td></tr><tr><td><b>License</b></td><td><a href=\"https://mii-termserv.de/licenses#tho\">THO license</a></td></tr><tr><td><b>Package Scope</b></td><td><a href=\"https://gitlab.com/groups/mii-termserv/fhir-resources/-/packages/?ForderBy%3Dversion%26sort%3Ddesc%26search%5B%5D%3D@mii-termserv/hl7.terminology\"><code>@mii-termserv/hl7.terminology</code></a></td></tr></tbody></table></div></div>"
  },
  "extension": [
    {
      "url": "http://hl7.org/fhir/StructureDefinition/structuredefinition-wg",
      "valueCode": "fhir"
    },
    {
      "url": "http://hl7.org/fhir/StructureDefinition/structuredefinition-fmm",
      "valueInteger": 1
    },
    {
      "url": "http://hl7.org/fhir/StructureDefinition/cqf-scope",
      "valueString": "@mii-termserv/hl7.terminology"
    }
  ],
  "url": "http://terminology.hl7.org/CodeSystem/list-example-use-codes",
  "identifier": [
    {
      "system": "urn:ietf:rfc:3986",
      "value": "urn:oid:2.16.840.1.113883.4.642.1.1105"
    }
  ],
  "version": "1.0.0",
  "name": "ExampleUseCodesForList",
  "title": "Example Use Codes for List",
  "status": "draft",
  "experimental": false,
  "date": "2024-03-09T14:36:19-07:00",
  "publisher": "Health Level Seven International",
  "contact": [
    {
      "telecom": [
        {
          "system": "url",
          "value": "http://hl7.org"
        },
        {
          "system": "email",
          "value": "hq@HL7.org"
        }
      ]
    }
  ],
  "description": "Example use codes for the List resource - typical kinds of use.",
  "copyright": "This material derives from the HL7 Terminology (THO). THO is copyright ©1989+ Health Level Seven International and is made available under the CC0 designation. For more licensing information see: https://terminology.hl7.org/license",
  "caseSensitive": true,
  "valueSet": "http://terminology.hl7.org/ValueSet/list-example-codes",
  "content": "complete",
  "concept": [
    {
      "code": "alerts",
      "display": "Alerts",
      "definition": "A list of alerts for the patient."
    },
    {
      "code": "adverserxns",
      "display": "Adverse Reactions",
      "definition": "A list of part adverse reactions."
    },
    {
      "code": "allergies",
      "display": "Allergies",
      "definition": "A list of Allergies for the patient."
    },
    {
      "code": "medications",
      "display": "Medication List",
      "definition": "A list of medication statements for the patient."
    },
    {
      "code": "problems",
      "display": "Problem List",
      "definition": "A list of problems that the patient is known of have (or have had in the past)."
    },
    {
      "code": "worklist",
      "display": "Worklist",
      "definition": "A list of items that constitute a set of work to be performed (typically this code would be specialized for more specific uses, such as a ward round list)."
    },
    {
      "code": "waiting",
      "display": "Waiting List",
      "definition": "A list of items waiting for an event (perhaps a surgical patient waiting list)."
    },
    {
      "code": "protocols",
      "display": "Protocols",
      "definition": "A set of protocols to be followed."
    },
    {
      "code": "plans",
      "display": "Care Plans",
      "definition": "A set of care plans that apply in a particular context of care."
    }
  ]
}