{
  "resourceType": "CodeSystem",
  "id": "hl7.term-claimcareteamrole",
  "meta": {
    "lastUpdated": "2022-04-27T12:21:00.000+00:00",
    "profile": [
      "http://hl7.org/fhir/StructureDefinition/shareablecodesystem"
    ],
    "tag": [
      {
        "system": "https://mii-termserv.de/fhir/su-termserv/CodeSystem/mii-cs-suts-resource-tags-project",
        "code": "hl7",
        "display": "HL7 International"
      },
      {
        "system": "https://mii-termserv.de/fhir/su-termserv/CodeSystem/mii-cs-suts-resource-tags-dataset",
        "code": "hl7",
        "display": "HL7 International"
      },
      {
        "system": "https://mii-termserv.de/fhir/su-termserv/CodeSystem/mii-cs-suts-resource-tags-license",
        "code": "https://mii-termserv.de/licenses#tho",
        "display": "THO license"
      }
    ]
  },
  "text": {
    "status": "generated",
    "div": "<div xmlns=\"http://www.w3.org/1999/xhtml\"><h2>Claim Care Team Role Codes</h2><tt>http://terminology.hl7.org/CodeSystem/claimcareteamrole</tt><p>Claim roles of the care team members providing products and services.</p><div><p><b>SU-TermServ Metadata</b></p><table><tbody><tr><td><b>Project</b></td><td>HL7 International</td></tr><tr><td><b>Dataset</b></td><td>HL7 International</td></tr><tr><td><b>License</b></td><td><a href=\"https://mii-termserv.de/licenses#tho\">THO license</a></td></tr><tr><td><b>Package Scope</b></td><td><a href=\"https://gitlab.com/groups/mii-termserv/fhir-resources/-/packages/?ForderBy%3Dversion%26sort%3Ddesc%26search%5B%5D%3D@mii-termserv/hl7.terminology\"><code>@mii-termserv/hl7.terminology</code></a></td></tr></tbody></table></div></div>"
  },
  "extension": [
    {
      "url": "http://hl7.org/fhir/StructureDefinition/structuredefinition-wg",
      "valueCode": "fm"
    },
    {
      "url": "http://hl7.org/fhir/StructureDefinition/structuredefinition-fmm",
      "valueInteger": 1
    },
    {
      "url": "http://hl7.org/fhir/StructureDefinition/cqf-scope",
      "valueString": "@mii-termserv/hl7.terminology"
    }
  ],
  "url": "http://terminology.hl7.org/CodeSystem/claimcareteamrole",
  "identifier": [
    {
      "system": "urn:ietf:rfc:3986",
      "value": "urn:oid:2.16.840.1.113883.4.642.1.1165"
    }
  ],
  "version": "1.0.0",
  "name": "ClaimCareTeamRoleCodes",
  "title": "Claim Care Team Role Codes",
  "status": "draft",
  "experimental": false,
  "date": "2024-03-09T14:36:19-07:00",
  "publisher": "Health Level Seven International",
  "contact": [
    {
      "telecom": [
        {
          "system": "url",
          "value": "http://hl7.org"
        },
        {
          "system": "email",
          "value": "hq@HL7.org"
        }
      ]
    }
  ],
  "description": "Claim roles of the care team members providing products and services.",
  "copyright": "This material derives from the HL7 Terminology (THO). THO is copyright ©1989+ Health Level Seven International and is made available under the CC0 designation. For more licensing information see: https://terminology.hl7.org/license",
  "caseSensitive": true,
  "valueSet": "http://terminology.hl7.org/ValueSet/claim-careteamrole",
  "content": "complete",
  "concept": [
    {
      "code": "primary",
      "display": "Primary provider",
      "definition": "The primary care provider."
    },
    {
      "code": "assist",
      "display": "Assisting Provider",
      "definition": "Assisting care provider."
    },
    {
      "code": "supervisor",
      "display": "Supervising Provider",
      "definition": "Supervising care provider."
    },
    {
      "code": "attending",
      "display": "Attending",
      "definition": "The attending physician."
    },
    {
      "code": "referring",
      "display": "Referring",
      "definition": "The referring provider."
    },
    {
      "code": "operating",
      "display": "Operating",
      "definition": "The operating physician."
    },
    {
      "code": "otheroperating",
      "display": "Other Operating",
      "definition": "The other operating physician."
    },
    {
      "code": "prescribing",
      "display": "Prescribing provider",
      "definition": "The prescribing provider."
    },
    {
      "code": "purchasedservice",
      "display": "Purchased Service",
      "definition": "The provider from which a service was purchased by another provider."
    },
    {
      "code": "rendering",
      "display": "Rendering provider",
      "definition": "The rendering/performing provider."
    },
    {
      "code": "other",
      "display": "Other",
      "definition": "Other role on the care team."
    }
  ]
}