{
  "resourceType": "CodeSystem",
  "id": "hl7.term-study-type",
  "meta": {
    "lastUpdated": "2020-04-09T21:10:28.568+00:00",
    "tag": [
      {
        "system": "https://mii-termserv.de/fhir/su-termserv/CodeSystem/mii-cs-suts-resource-tags-project",
        "code": "hl7",
        "display": "HL7 International"
      },
      {
        "system": "https://mii-termserv.de/fhir/su-termserv/CodeSystem/mii-cs-suts-resource-tags-dataset",
        "code": "hl7",
        "display": "HL7 International"
      },
      {
        "system": "https://mii-termserv.de/fhir/su-termserv/CodeSystem/mii-cs-suts-resource-tags-license",
        "code": "https://mii-termserv.de/licenses#tho",
        "display": "THO license"
      }
    ]
  },
  "text": {
    "status": "generated",
    "div": "<div xmlns=\"http://www.w3.org/1999/xhtml\"><h2>StatisticStudyType</h2><tt>http://terminology.hl7.org/CodeSystem/study-type</tt><p>The type of study a statistic was derived from.</p><div><p><b>SU-TermServ Metadata</b></p><table><tbody><tr><td><b>Project</b></td><td>HL7 International</td></tr><tr><td><b>Dataset</b></td><td>HL7 International</td></tr><tr><td><b>License</b></td><td><a href=\"https://mii-termserv.de/licenses#tho\">THO license</a></td></tr><tr><td><b>Package Scope</b></td><td><a href=\"https://gitlab.com/groups/mii-termserv/fhir-resources/-/packages/?ForderBy%3Dversion%26sort%3Ddesc%26search%5B%5D%3D@mii-termserv/hl7.terminology\"><code>@mii-termserv/hl7.terminology</code></a></td></tr></tbody></table></div></div>"
  },
  "url": "http://terminology.hl7.org/CodeSystem/study-type",
  "identifier": [
    {
      "system": "urn:ietf:rfc:3986",
      "value": "urn:oid:2.16.840.1.113883.4.642.1.1350"
    }
  ],
  "version": "1.0.0",
  "name": "StatisticStudyType",
  "title": "StatisticStudyType",
  "status": "draft",
  "experimental": false,
  "date": "2020-04-09T21:10:28+00:00",
  "publisher": "Health Level Seven International",
  "contact": [
    {
      "telecom": [
        {
          "system": "url",
          "value": "http://hl7.org"
        },
        {
          "system": "email",
          "value": "hq@HL7.org"
        }
      ]
    }
  ],
  "description": "The type of study a statistic was derived from.",
  "copyright": "This material derives from the HL7 Terminology (THO). THO is copyright ©1989+ Health Level Seven International and is made available under the CC0 designation. For more licensing information see: https://terminology.hl7.org/license",
  "caseSensitive": true,
  "valueSet": "http://terminology.hl7.org/ValueSet/study-type",
  "content": "complete",
  "concept": [
    {
      "code": "RCT",
      "display": "randomized trial",
      "definition": "randomized controlled trial."
    },
    {
      "code": "CCT",
      "display": "controlled trial (non-randomized)",
      "definition": "controlled (but not randomized) trial."
    },
    {
      "code": "cohort",
      "display": "comparative cohort study",
      "definition": "observational study comparing cohorts."
    },
    {
      "code": "case-control",
      "display": "case-control study",
      "definition": "case-control study."
    },
    {
      "code": "series",
      "display": "uncontrolled case series",
      "definition": "uncontrolled case series."
    },
    {
      "code": "case-report",
      "display": "case report",
      "definition": "a single case report."
    },
    {
      "code": "RCTandCohort",
      "display": "mixed RCT and cohort",
      "definition": "a combination of 1 or more RCTs and cohorts."
    },
    {
      "code": "cross-section",
      "display": "cross sectional study",
      "definition": "uncontrolled cohort."
    }
  ],
  "extension": [
    {
      "url": "http://hl7.org/fhir/StructureDefinition/cqf-scope",
      "valueString": "@mii-termserv/hl7.terminology"
    }
  ]
}