{
  "resourceType": "CodeSystem",
  "id": "hl7.term-v3-MaritalStatus",
  "language": "en",
  "text": {
    "status": "generated",
    "div": "<div xmlns=\"http://www.w3.org/1999/xhtml\"><h2>MaritalStatus</h2><tt>http://terminology.hl7.org/CodeSystem/v3-MaritalStatus</tt><p>\\* \\* \\* No description supplied \\* \\* \\*\r\n\r\n*Open Issue:* The specific meanings of these codes can vary somewhat by jurisdiction and implementation so caution should be used when determining equivalency.\r\n\r\n*Open Issue:* fixing and completion of the hierarchy and proper good definitions of all the concepts is badly needed.</p><div><p><b>SU-TermServ Metadata</b></p><table><tbody><tr><td><b>Project</b></td><td>HL7 International</td></tr><tr><td><b>Dataset</b></td><td>HL7 International</td></tr><tr><td><b>License</b></td><td><a href=\"https://mii-termserv.de/licenses#tho\">THO license</a></td></tr><tr><td><b>Package Scope</b></td><td><a href=\"https://gitlab.com/groups/mii-termserv/fhir-resources/-/packages/?ForderBy%3Dversion%26sort%3Ddesc%26search%5B%5D%3D@mii-termserv/hl7.terminology\"><code>@mii-termserv/hl7.terminology</code></a></td></tr></tbody></table></div></div>"
  },
  "url": "http://terminology.hl7.org/CodeSystem/v3-MaritalStatus",
  "identifier": [
    {
      "system": "urn:ietf:rfc:3986",
      "value": "urn:oid:2.16.840.1.113883.5.2"
    }
  ],
  "version": "3.0.0",
  "name": "MaritalStatus",
  "title": "MaritalStatus",
  "status": "active",
  "experimental": false,
  "date": "2019-03-20",
  "publisher": "Health Level Seven International",
  "contact": [
    {
      "telecom": [
        {
          "system": "url",
          "value": "http://hl7.org"
        },
        {
          "system": "email",
          "value": "hq@HL7.org"
        }
      ]
    }
  ],
  "description": "\\* \\* \\* No description supplied \\* \\* \\*\r\n\r\n*Open Issue:* The specific meanings of these codes can vary somewhat by jurisdiction and implementation so caution should be used when determining equivalency.\r\n\r\n*Open Issue:* fixing and completion of the hierarchy and proper good definitions of all the concepts is badly needed.",
  "copyright": "This material derives from the HL7 Terminology THO. THO is copyright ©1989+ Health Level Seven International and is made available under the CC0 designation. For more licensing information see: https://terminology.hl7.org/license",
  "caseSensitive": true,
  "hierarchyMeaning": "is-a",
  "content": "complete",
  "property": [
    {
      "extension": [
        {
          "url": "http://terminology.hl7.org/StructureDefinition/ext-mif-relationship-symmetry",
          "valueCode": "antisymmetric"
        },
        {
          "url": "http://terminology.hl7.org/StructureDefinition/ext-mif-relationship-transitivity",
          "valueCode": "transitive"
        },
        {
          "url": "http://terminology.hl7.org/StructureDefinition/ext-mif-relationship-reflexivity",
          "valueCode": "irreflexive"
        },
        {
          "url": "http://terminology.hl7.org/StructureDefinition/ext-mif-relationship-isNavigable",
          "valueBoolean": true
        },
        {
          "url": "http://terminology.hl7.org/StructureDefinition/ext-mif-relationship-relationshipKind",
          "valueCode": "Specializes"
        },
        {
          "url": "http://terminology.hl7.org/StructureDefinition/ext-mif-relationship-inverseName",
          "valueString": "Generalizes"
        }
      ],
      "code": "Specializes",
      "description": "The child code is a more narrow version of the concept represented by the parent code.  I.e. Every child concept is also a valid parent concept.  Used to allow determination of subsumption.  Must be transitive, irreflexive, antisymmetric.",
      "type": "Coding"
    },
    {
      "extension": [
        {
          "url": "http://terminology.hl7.org/StructureDefinition/ext-mif-relationship-symmetry",
          "valueCode": "antisymmetric"
        },
        {
          "url": "http://terminology.hl7.org/StructureDefinition/ext-mif-relationship-transitivity",
          "valueCode": "transitive"
        },
        {
          "url": "http://terminology.hl7.org/StructureDefinition/ext-mif-relationship-reflexivity",
          "valueCode": "irreflexive"
        },
        {
          "url": "http://terminology.hl7.org/StructureDefinition/ext-mif-relationship-isNavigable",
          "valueBoolean": true
        },
        {
          "url": "http://terminology.hl7.org/StructureDefinition/ext-mif-relationship-relationshipKind",
          "valueCode": "Generalizes"
        },
        {
          "url": "http://terminology.hl7.org/StructureDefinition/ext-mif-relationship-inverseName",
          "valueString": "Specializes"
        }
      ],
      "code": "Generalizes",
      "description": "Inverse of Specializes.  Only included as a derived relationship.",
      "type": "Coding"
    },
    {
      "code": "internalId",
      "uri": "http://terminology.hl7.org/CodeSystem/utg-concept-properties#v3-internal-id",
      "description": "The internal identifier for the concept in the HL7 Access database repository.",
      "type": "code"
    },
    {
      "code": "status",
      "uri": "http://hl7.org/fhir/concept-properties#status",
      "description": "Designation of a concept's state. Normally is not populated unless the state is retired.",
      "type": "code"
    }
  ],
  "concept": [
    {
      "code": "A",
      "display": "Annulled",
      "definition": "Marriage contract has been declared null and to not have existed",
      "property": [
        {
          "code": "status",
          "valueCode": "active"
        },
        {
          "code": "internalId",
          "valueCode": "12213"
        }
      ]
    },
    {
      "code": "D",
      "display": "Divorced",
      "definition": "Marriage contract has been declared dissolved and inactive",
      "property": [
        {
          "code": "status",
          "valueCode": "active"
        },
        {
          "code": "internalId",
          "valueCode": "12214"
        }
      ]
    },
    {
      "code": "I",
      "display": "Interlocutory",
      "definition": "Subject to an Interlocutory Decree.",
      "property": [
        {
          "code": "status",
          "valueCode": "active"
        },
        {
          "code": "internalId",
          "valueCode": "12215"
        }
      ]
    },
    {
      "code": "L",
      "display": "Legally Separated",
      "property": [
        {
          "code": "status",
          "valueCode": "active"
        },
        {
          "code": "internalId",
          "valueCode": "12216"
        }
      ]
    },
    {
      "code": "M",
      "display": "Married",
      "definition": "A current marriage contract is active",
      "property": [
        {
          "code": "status",
          "valueCode": "active"
        },
        {
          "code": "internalId",
          "valueCode": "12217"
        }
      ],
      "concept": [
        {
          "code": "C",
          "display": "Common Law",
          "definition": "a marriage recognized in some jurisdictions and based on the parties' agreement to consider themselves married and can also be based on documentation of cohabitation.\r\n\r\nThis definition was based on https://www.merriam-webster.com/dictionary/common-law%20marriage.",
          "property": [
            {
              "code": "status",
              "valueCode": "active"
            },
            {
              "code": "internalId",
              "valueCode": "24122"
            }
          ]
        }
      ]
    },
    {
      "code": "P",
      "display": "Polygamous",
      "definition": "More than 1 current spouse",
      "property": [
        {
          "code": "status",
          "valueCode": "active"
        },
        {
          "code": "internalId",
          "valueCode": "12220"
        }
      ]
    },
    {
      "code": "T",
      "display": "Domestic partner",
      "definition": "Person declares that a domestic partner relationship exists.",
      "property": [
        {
          "code": "status",
          "valueCode": "active"
        },
        {
          "code": "internalId",
          "valueCode": "15981"
        }
      ]
    },
    {
      "code": "U",
      "display": "unmarried",
      "definition": "Currently not in a marriage contract.",
      "property": [
        {
          "code": "status",
          "valueCode": "active"
        },
        {
          "code": "internalId",
          "valueCode": "23624"
        }
      ],
      "concept": [
        {
          "code": "S",
          "display": "Never Married",
          "definition": "No marriage contract has ever been entered",
          "property": [
            {
              "code": "status",
              "valueCode": "active"
            },
            {
              "code": "internalId",
              "valueCode": "12218"
            }
          ]
        }
      ]
    },
    {
      "code": "W",
      "display": "Widowed",
      "definition": "The spouse has died",
      "property": [
        {
          "code": "status",
          "valueCode": "active"
        },
        {
          "code": "internalId",
          "valueCode": "12219"
        }
      ]
    }
  ],
  "meta": {
    "tag": [
      {
        "system": "https://mii-termserv.de/fhir/su-termserv/CodeSystem/mii-cs-suts-resource-tags-project",
        "code": "hl7",
        "display": "HL7 International"
      },
      {
        "system": "https://mii-termserv.de/fhir/su-termserv/CodeSystem/mii-cs-suts-resource-tags-dataset",
        "code": "hl7",
        "display": "HL7 International"
      },
      {
        "system": "https://mii-termserv.de/fhir/su-termserv/CodeSystem/mii-cs-suts-resource-tags-license",
        "code": "https://mii-termserv.de/licenses#tho",
        "display": "THO license"
      }
    ]
  },
  "extension": [
    {
      "url": "http://hl7.org/fhir/StructureDefinition/cqf-scope",
      "valueString": "@mii-termserv/hl7.terminology"
    }
  ]
}