{
  "resourceType": "ValueSet",
  "id": "hl7.term-v3-ObservationInterpretationOustsideThreshold",
  "language": "en",
  "text": {
    "status": "generated",
    "div": "<div xmlns=\"http://www.w3.org/1999/xhtml\"><h2>ObservationInterpretationOustsideThreshold</h2><tt>http://terminology.hl7.org/ValueSet/v3-ObservationInterpretationOustsideThreshold</tt><p>The observation/test result is interpreted as being outside the inclusion range for a particular protocol within which the result is being reported.\r\n\r\n**Example:** A positive result on a Hepatitis screening test.\r\n\r\n*Open Issue:* We are not deprecating this value set at this time, but instead are leaving open the consideration of deprecation in the future. \\[Note: The concepts included in this value set have also been suggested for future deprecation, and there are no associated concept subdomains or bindings. Note also that the name of the value set appears to have a typo in it from the old cycle when it was originally added.\\]</p><div><p><b>SU-TermServ Metadata</b></p><table><tbody><tr><td><b>Project</b></td><td>HL7 International</td></tr><tr><td><b>Dataset</b></td><td>HL7 International</td></tr><tr><td><b>License</b></td><td><a href=\"https://mii-termserv.de/licenses#tho\">THO license</a></td></tr><tr><td><b>Package Scope</b></td><td><a href=\"https://gitlab.com/groups/mii-termserv/fhir-resources/-/packages/?ForderBy%3Dversion%26sort%3Ddesc%26search%5B%5D%3D@mii-termserv/hl7.terminology\"><code>@mii-termserv/hl7.terminology</code></a></td></tr></tbody></table></div></div>"
  },
  "url": "http://terminology.hl7.org/ValueSet/v3-ObservationInterpretationOustsideThreshold",
  "identifier": [
    {
      "system": "urn:ietf:rfc:3986",
      "value": "urn:oid:2.16.840.1.113883.1.11.19760"
    }
  ],
  "version": "3.0.0",
  "name": "ObservationInterpretationOustsideThreshold",
  "title": "ObservationInterpretationOustsideThreshold",
  "status": "active",
  "experimental": false,
  "date": "2014-03-26",
  "publisher": "Health Level Seven International",
  "contact": [
    {
      "telecom": [
        {
          "system": "url",
          "value": "http://hl7.org"
        },
        {
          "system": "email",
          "value": "hq@HL7.org"
        }
      ]
    }
  ],
  "description": "The observation/test result is interpreted as being outside the inclusion range for a particular protocol within which the result is being reported.\r\n\r\n**Example:** A positive result on a Hepatitis screening test.\r\n\r\n*Open Issue:* We are not deprecating this value set at this time, but instead are leaving open the consideration of deprecation in the future. \\[Note: The concepts included in this value set have also been suggested for future deprecation, and there are no associated concept subdomains or bindings. Note also that the name of the value set appears to have a typo in it from the old cycle when it was originally added.\\]",
  "copyright": "This material derives from the HL7 Terminology THO. THO is copyright ©1989+ Health Level Seven International and is made available under the CC0 designation. For more licensing information see: https://terminology.hl7.org/license",
  "compose": {
    "include": [
      {
        "system": "http://terminology.hl7.org/CodeSystem/v3-ObservationInterpretation",
        "filter": [
          {
            "property": "concept",
            "op": "is-a",
            "value": "EX"
          }
        ]
      }
    ]
  },
  "meta": {
    "tag": [
      {
        "system": "https://mii-termserv.de/fhir/su-termserv/CodeSystem/mii-cs-suts-resource-tags-project",
        "code": "hl7",
        "display": "HL7 International"
      },
      {
        "system": "https://mii-termserv.de/fhir/su-termserv/CodeSystem/mii-cs-suts-resource-tags-dataset",
        "code": "hl7",
        "display": "HL7 International"
      },
      {
        "system": "https://mii-termserv.de/fhir/su-termserv/CodeSystem/mii-cs-suts-resource-tags-license",
        "code": "https://mii-termserv.de/licenses#tho",
        "display": "THO license"
      }
    ]
  },
  "extension": [
    {
      "url": "http://hl7.org/fhir/StructureDefinition/cqf-scope",
      "valueString": "@mii-termserv/hl7.terminology"
    }
  ]
}