{
  "resourceType": "CodeSystem",
  "id": "hl7.term-diet",
  "meta": {
    "lastUpdated": "2020-04-09T21:10:28.568+00:00",
    "profile": [
      "http://hl7.org/fhir/StructureDefinition/shareablecodesystem"
    ],
    "tag": [
      {
        "system": "https://mii-termserv.de/fhir/su-termserv/CodeSystem/mii-cs-suts-resource-tags-project",
        "code": "hl7",
        "display": "HL7 International"
      },
      {
        "system": "https://mii-termserv.de/fhir/su-termserv/CodeSystem/mii-cs-suts-resource-tags-dataset",
        "code": "hl7",
        "display": "HL7 International"
      },
      {
        "system": "https://mii-termserv.de/fhir/su-termserv/CodeSystem/mii-cs-suts-resource-tags-license",
        "code": "https://mii-termserv.de/licenses#tho",
        "display": "THO license"
      }
    ]
  },
  "text": {
    "status": "generated",
    "div": "<div xmlns=\"http://www.w3.org/1999/xhtml\"><h2>Diet</h2><tt>http://terminology.hl7.org/CodeSystem/diet</tt><p>This value set defines a set of codes that can be used to indicate dietary preferences or restrictions a patient may have.</p><div><p><b>SU-TermServ Metadata</b></p><table><tbody><tr><td><b>Project</b></td><td>HL7 International</td></tr><tr><td><b>Dataset</b></td><td>HL7 International</td></tr><tr><td><b>License</b></td><td><a href=\"https://mii-termserv.de/licenses#tho\">THO license</a></td></tr><tr><td><b>Package Scope</b></td><td><a href=\"https://gitlab.com/groups/mii-termserv/fhir-resources/-/packages/?ForderBy%3Dversion%26sort%3Ddesc%26search%5B%5D%3D@mii-termserv/hl7.terminology\"><code>@mii-termserv/hl7.terminology</code></a></td></tr></tbody></table></div></div>"
  },
  "extension": [
    {
      "url": "http://hl7.org/fhir/StructureDefinition/structuredefinition-wg",
      "valueCode": "pa"
    },
    {
      "url": "http://hl7.org/fhir/StructureDefinition/structuredefinition-fmm",
      "valueInteger": 1
    },
    {
      "url": "http://hl7.org/fhir/StructureDefinition/cqf-scope",
      "valueString": "@mii-termserv/hl7.terminology"
    }
  ],
  "url": "http://terminology.hl7.org/CodeSystem/diet",
  "identifier": [
    {
      "system": "urn:ietf:rfc:3986",
      "value": "urn:oid:2.16.840.1.113883.4.642.1.1091"
    }
  ],
  "version": "1.0.0",
  "name": "Diet",
  "title": "Diet",
  "status": "draft",
  "experimental": false,
  "date": "2024-03-09T14:36:19-07:00",
  "publisher": "Health Level Seven International",
  "contact": [
    {
      "telecom": [
        {
          "system": "url",
          "value": "http://hl7.org"
        },
        {
          "system": "email",
          "value": "hq@HL7.org"
        }
      ]
    }
  ],
  "description": "This value set defines a set of codes that can be used to indicate dietary preferences or restrictions a patient may have.",
  "copyright": "This material derives from the HL7 Terminology (THO). THO is copyright ©1989+ Health Level Seven International and is made available under the CC0 designation. For more licensing information see: https://terminology.hl7.org/license",
  "caseSensitive": true,
  "valueSet": "http://terminology.hl7.org/ValueSet/encounter-diet",
  "content": "complete",
  "concept": [
    {
      "code": "vegetarian",
      "display": "Vegetarian",
      "definition": "Food without meat, poultry or seafood."
    },
    {
      "code": "dairy-free",
      "display": "Dairy Free",
      "definition": "Excludes dairy products."
    },
    {
      "code": "nut-free",
      "display": "Nut Free",
      "definition": "Excludes ingredients containing nuts."
    },
    {
      "code": "gluten-free",
      "display": "Gluten Free",
      "definition": "Excludes ingredients containing gluten."
    },
    {
      "code": "vegan",
      "display": "Vegan",
      "definition": "Food without meat, poultry, seafood, eggs, dairy products and other animal-derived substances."
    },
    {
      "code": "halal",
      "display": "Halal",
      "definition": "Foods that conform to Islamic law."
    },
    {
      "code": "kosher",
      "display": "Kosher",
      "definition": "Foods that conform to Jewish dietary law."
    }
  ]
}