{
  "resourceType": "ValueSet",
  "id": "hl7.term-verificationresult-communication-method",
  "meta": {
    "lastUpdated": "2020-02-24T12:41:39.109+11:00",
    "profile": [
      "http://hl7.org/fhir/StructureDefinition/shareablevalueset"
    ],
    "tag": [
      {
        "system": "https://mii-termserv.de/fhir/su-termserv/CodeSystem/mii-cs-suts-resource-tags-project",
        "code": "hl7",
        "display": "HL7 International"
      },
      {
        "system": "https://mii-termserv.de/fhir/su-termserv/CodeSystem/mii-cs-suts-resource-tags-dataset",
        "code": "hl7",
        "display": "HL7 International"
      },
      {
        "system": "https://mii-termserv.de/fhir/su-termserv/CodeSystem/mii-cs-suts-resource-tags-license",
        "code": "https://mii-termserv.de/licenses#tho",
        "display": "THO license"
      }
    ]
  },
  "text": {
    "status": "generated",
    "div": "<div xmlns=\"http://www.w3.org/1999/xhtml\"><h2>VerificationResult Communication Method</h2><tt>http://terminology.hl7.org/ValueSet/verificationresult-communication-method</tt><p>Attested information may be validated by process that are manual or automated. For automated processes it may accomplished by the system of record reaching out through another system&#x27;s API or information may be sent to the system of record. This value set defines a set of codes to describing the process, the how, a resource or data element is validated.</p><div><p><b>SU-TermServ Metadata</b></p><table><tbody><tr><td><b>Project</b></td><td>HL7 International</td></tr><tr><td><b>Dataset</b></td><td>HL7 International</td></tr><tr><td><b>License</b></td><td><a href=\"https://mii-termserv.de/licenses#tho\">THO license</a></td></tr><tr><td><b>Package Scope</b></td><td><a href=\"https://gitlab.com/groups/mii-termserv/fhir-resources/-/packages/?ForderBy%3Dversion%26sort%3Ddesc%26search%5B%5D%3D@mii-termserv/hl7.terminology\"><code>@mii-termserv/hl7.terminology</code></a></td></tr></tbody></table></div></div>"
  },
  "extension": [
    {
      "url": "http://hl7.org/fhir/StructureDefinition/structuredefinition-wg",
      "valueCode": "pa"
    },
    {
      "url": "http://hl7.org/fhir/StructureDefinition/structuredefinition-fmm",
      "valueInteger": 1
    },
    {
      "url": "http://hl7.org/fhir/StructureDefinition/cqf-scope",
      "valueString": "@mii-termserv/hl7.terminology"
    }
  ],
  "url": "http://terminology.hl7.org/ValueSet/verificationresult-communication-method",
  "identifier": [
    {
      "system": "urn:ietf:rfc:3986",
      "value": "urn:oid:2.16.840.1.113883.4.642.3.1401"
    }
  ],
  "version": "1.0.0",
  "name": "VerificationResult_communication_method",
  "title": "VerificationResult Communication Method",
  "status": "active",
  "experimental": false,
  "date": "2018-10-31",
  "publisher": "Health Level Seven International",
  "contact": [
    {
      "telecom": [
        {
          "system": "url",
          "value": "http://hl7.org"
        },
        {
          "system": "email",
          "value": "hq@HL7.org"
        }
      ]
    }
  ],
  "description": "Attested information may be validated by process that are manual or automated. For automated processes it may accomplished by the system of record reaching out through another system's API or information may be sent to the system of record. This value set defines a set of codes to describing the process, the how, a resource or data element is validated.",
  "immutable": true,
  "copyright": "This material derives from the HL7 Terminology THO. THO is copyright ©1989+ Health Level Seven International and is made available under the CC0 designation. For more licensing information see: https://terminology.hl7.org/license",
  "compose": {
    "include": [
      {
        "system": "http://terminology.hl7.org/CodeSystem/verificationresult-communication-method"
      }
    ]
  }
}