{
  "resourceType": "CodeSystem",
  "id": "hl7.term-diagnosis-role",
  "meta": {
    "lastUpdated": "2020-04-09T21:10:28.568+00:00",
    "profile": [
      "http://hl7.org/fhir/StructureDefinition/shareablecodesystem"
    ],
    "tag": [
      {
        "system": "https://mii-termserv.de/fhir/su-termserv/CodeSystem/mii-cs-suts-resource-tags-project",
        "code": "hl7",
        "display": "HL7 International"
      },
      {
        "system": "https://mii-termserv.de/fhir/su-termserv/CodeSystem/mii-cs-suts-resource-tags-dataset",
        "code": "hl7",
        "display": "HL7 International"
      },
      {
        "system": "https://mii-termserv.de/fhir/su-termserv/CodeSystem/mii-cs-suts-resource-tags-license",
        "code": "https://mii-termserv.de/licenses#tho",
        "display": "THO license"
      }
    ]
  },
  "text": {
    "status": "generated",
    "div": "<div xmlns=\"http://www.w3.org/1999/xhtml\"><h2>Diagnosis Role</h2><tt>http://terminology.hl7.org/CodeSystem/diagnosis-role</tt><p>This value set defines a set of codes that can be used to express the role of a diagnosis on the Encounter or EpisodeOfCare record.</p><div><p><b>SU-TermServ Metadata</b></p><table><tbody><tr><td><b>Project</b></td><td>HL7 International</td></tr><tr><td><b>Dataset</b></td><td>HL7 International</td></tr><tr><td><b>License</b></td><td><a href=\"https://mii-termserv.de/licenses#tho\">THO license</a></td></tr><tr><td><b>Package Scope</b></td><td><a href=\"https://gitlab.com/groups/mii-termserv/fhir-resources/-/packages/?ForderBy%3Dversion%26sort%3Ddesc%26search%5B%5D%3D@mii-termserv/hl7.terminology\"><code>@mii-termserv/hl7.terminology</code></a></td></tr></tbody></table></div></div>"
  },
  "extension": [
    {
      "url": "http://hl7.org/fhir/StructureDefinition/structuredefinition-wg",
      "valueCode": "pa"
    },
    {
      "url": "http://hl7.org/fhir/StructureDefinition/cqf-scope",
      "valueString": "@mii-termserv/hl7.terminology"
    }
  ],
  "url": "http://terminology.hl7.org/CodeSystem/diagnosis-role",
  "identifier": [
    {
      "system": "urn:ietf:rfc:3986",
      "value": "urn:oid:2.16.840.1.113883.4.642.1.1054"
    }
  ],
  "version": "1.1.0",
  "name": "DiagnosisRole",
  "title": "Diagnosis Role",
  "status": "draft",
  "experimental": false,
  "date": "2024-03-09T14:36:19-07:00",
  "publisher": "Health Level Seven International",
  "contact": [
    {
      "telecom": [
        {
          "system": "url",
          "value": "http://hl7.org"
        },
        {
          "system": "email",
          "value": "hq@HL7.org"
        }
      ]
    }
  ],
  "description": "This value set defines a set of codes that can be used to express the role of a diagnosis on the Encounter or EpisodeOfCare record.",
  "copyright": "This material derives from the HL7 Terminology (THO). THO is copyright ©1989+ Health Level Seven International and is made available under the CC0 designation. For more licensing information see: https://terminology.hl7.org/license",
  "caseSensitive": true,
  "valueSet": "http://terminology.hl7.org/ValueSet/diagnosis-role",
  "content": "complete",
  "concept": [
    {
      "code": "AD",
      "display": "Admission diagnosis",
      "definition": "The diagnoses documented for administrative purposes as the basis for a hospital or other institutional admission"
    },
    {
      "code": "DD",
      "display": "Discharge diagnosis",
      "definition": "The diagnoses documented for administrative purposes at the time of hospital or other institutional discharge"
    },
    {
      "code": "CC",
      "display": "Chief complaint"
    },
    {
      "code": "CM",
      "display": "Comorbidity diagnosis"
    },
    {
      "code": "pre-op",
      "display": "pre-op diagnosis"
    },
    {
      "code": "post-op",
      "display": "post-op diagnosis"
    },
    {
      "code": "billing",
      "display": "Billing",
      "definition": "The diagnosis documented for billing purposes"
    }
  ]
}