{
  "resourceType": "CodeSystem",
  "id": "hl7.term-measure-aggregate-method",
  "text": {
    "status": "generated",
    "div": "<div xmlns=\"http://www.w3.org/1999/xhtml\"><h2>Measure Aggregate Method</h2><tt>http://terminology.hl7.org/CodeSystem/measure-aggregate-method</tt><p>Aggregation method for a measure (e.g. sum, average, median, minimum, maximum,    count)</p><div><p><b>SU-TermServ Metadata</b></p><table><tbody><tr><td><b>Project</b></td><td>HL7 International</td></tr><tr><td><b>Dataset</b></td><td>HL7 International</td></tr><tr><td><b>License</b></td><td><a href=\"https://mii-termserv.de/licenses#tho\">THO license</a></td></tr><tr><td><b>Package Scope</b></td><td><a href=\"https://gitlab.com/groups/mii-termserv/fhir-resources/-/packages/?ForderBy%3Dversion%26sort%3Ddesc%26search%5B%5D%3D@mii-termserv/hl7.terminology\"><code>@mii-termserv/hl7.terminology</code></a></td></tr></tbody></table></div></div>"
  },
  "extension": [
    {
      "url": "http://hl7.org/fhir/StructureDefinition/structuredefinition-wg",
      "valueCode": "cqi"
    },
    {
      "url": "http://hl7.org/fhir/StructureDefinition/cqf-scope",
      "valueString": "@mii-termserv/hl7.terminology"
    }
  ],
  "url": "http://terminology.hl7.org/CodeSystem/measure-aggregate-method",
  "version": "2.0.0",
  "name": "MeasureAggregateMethod",
  "title": "Measure Aggregate Method",
  "status": "active",
  "experimental": false,
  "date": "2023-02-08T23:21:03-06:00",
  "publisher": "Health Level Seven International",
  "contact": [
    {
      "telecom": [
        {
          "system": "url",
          "value": "http://hl7.org"
        },
        {
          "system": "email",
          "value": "hq@HL7.org"
        }
      ]
    }
  ],
  "description": "Aggregation method for a measure (e.g. sum, average, median, minimum, maximum,    count)",
  "jurisdiction": [
    {
      "coding": [
        {
          "system": "http://unstats.un.org/unsd/methods/m49/m49.htm",
          "code": "001",
          "display": "World"
        }
      ]
    }
  ],
  "copyright": "This material derives from the HL7 Terminology (THO). THO is copyright ©1989+ Health Level Seven International and is made available under the CC0 designation. For more licensing information see: https://terminology.hl7.org/license",
  "caseSensitive": true,
  "content": "complete",
  "concept": [
    {
      "code": "sum",
      "display": "Sum",
      "definition": "The measure score is determined by adding together the observations derived from      the measure population."
    },
    {
      "code": "average",
      "display": "Average",
      "definition": "The measure score is determined by taking the average of the observations derived      from the measure population."
    },
    {
      "code": "median",
      "display": "Median",
      "definition": "The measure score is determined by taking the median of the observations derived      from the measure population."
    },
    {
      "code": "minimum",
      "display": "Minimum",
      "definition": "The measure score is determined by taking the minimum of the observations derived      from the measure population."
    },
    {
      "code": "maximum",
      "display": "Maximum",
      "definition": "The measure score is determined by taking the maximum of the observations derived      from the measure population."
    },
    {
      "code": "count",
      "display": "Count",
      "definition": "The measure score is determined as the number of observations derived from the      measure population."
    }
  ],
  "meta": {
    "tag": [
      {
        "system": "https://mii-termserv.de/fhir/su-termserv/CodeSystem/mii-cs-suts-resource-tags-project",
        "code": "hl7",
        "display": "HL7 International"
      },
      {
        "system": "https://mii-termserv.de/fhir/su-termserv/CodeSystem/mii-cs-suts-resource-tags-dataset",
        "code": "hl7",
        "display": "HL7 International"
      },
      {
        "system": "https://mii-termserv.de/fhir/su-termserv/CodeSystem/mii-cs-suts-resource-tags-license",
        "code": "https://mii-termserv.de/licenses#tho",
        "display": "THO license"
      }
    ]
  }
}