{
  "resourceType": "ValueSet",
  "id": "hl7.term-v3-SecurityIntegrityProvenanceObservationType",
  "language": "en",
  "text": {
    "status": "generated",
    "div": "<div xmlns=\"http://www.w3.org/1999/xhtml\"><h2>SecurityIntegrityProvenanceObservationType</h2><tt>http://terminology.hl7.org/ValueSet/v3-SecurityIntegrityProvenanceObservationType</tt><p>Type of security metadata observation made about the provenance integrity of an IT resource (data, information object, service, or system capability), which indicates the lifecycle completeness or workflow status of an IT resource, such as its creation, modification, suspension, and deletion; locations in which the resource has been collected or archived, from which it may be retrieved, and the history of its distribution and disclosure. Integrity provenance metadata about an IT resource may be used to assess its veracity, reliability, and trustworthiness.</p><div><p><b>SU-TermServ Metadata</b></p><table><tbody><tr><td><b>Project</b></td><td>HL7 International</td></tr><tr><td><b>Dataset</b></td><td>HL7 International</td></tr><tr><td><b>License</b></td><td><a href=\"https://mii-termserv.de/licenses#tho\">THO license</a></td></tr><tr><td><b>Package Scope</b></td><td><a href=\"https://gitlab.com/groups/mii-termserv/fhir-resources/-/packages/?ForderBy%3Dversion%26sort%3Ddesc%26search%5B%5D%3D@mii-termserv/hl7.terminology\"><code>@mii-termserv/hl7.terminology</code></a></td></tr></tbody></table></div></div>"
  },
  "url": "http://terminology.hl7.org/ValueSet/v3-SecurityIntegrityProvenanceObservationType",
  "identifier": [
    {
      "system": "urn:ietf:rfc:3986",
      "value": "urn:oid:2.16.840.1.113883.1.11.20466"
    }
  ],
  "version": "3.0.0",
  "name": "SecurityIntegrityProvenanceObservationType",
  "title": "SecurityIntegrityProvenanceObservationType",
  "status": "active",
  "experimental": false,
  "date": "2014-03-26",
  "publisher": "Health Level Seven International",
  "contact": [
    {
      "telecom": [
        {
          "system": "url",
          "value": "http://hl7.org"
        },
        {
          "system": "email",
          "value": "hq@HL7.org"
        }
      ]
    }
  ],
  "description": "Type of security metadata observation made about the provenance integrity of an IT resource (data, information object, service, or system capability), which indicates the lifecycle completeness or workflow status of an IT resource, such as its creation, modification, suspension, and deletion; locations in which the resource has been collected or archived, from which it may be retrieved, and the history of its distribution and disclosure. Integrity provenance metadata about an IT resource may be used to assess its veracity, reliability, and trustworthiness.",
  "immutable": true,
  "copyright": "This material derives from the HL7 Terminology THO. THO is copyright ©1989+ Health Level Seven International and is made available under the CC0 designation. For more licensing information see: https://terminology.hl7.org/license",
  "compose": {
    "include": [
      {
        "system": "http://terminology.hl7.org/CodeSystem/v3-ActCode",
        "filter": [
          {
            "property": "concept",
            "op": "is-a",
            "value": "SECINTPRVOBS"
          }
        ]
      }
    ]
  },
  "meta": {
    "tag": [
      {
        "system": "https://mii-termserv.de/fhir/su-termserv/CodeSystem/mii-cs-suts-resource-tags-project",
        "code": "hl7",
        "display": "HL7 International"
      },
      {
        "system": "https://mii-termserv.de/fhir/su-termserv/CodeSystem/mii-cs-suts-resource-tags-dataset",
        "code": "hl7",
        "display": "HL7 International"
      },
      {
        "system": "https://mii-termserv.de/fhir/su-termserv/CodeSystem/mii-cs-suts-resource-tags-license",
        "code": "https://mii-termserv.de/licenses#tho",
        "display": "THO license"
      }
    ]
  },
  "extension": [
    {
      "url": "http://hl7.org/fhir/StructureDefinition/cqf-scope",
      "valueString": "@mii-termserv/hl7.terminology"
    }
  ]
}