{
  "resourceType": "CodeSystem",
  "id": "hl7.term-certainty-subcomponent-type",
  "meta": {
    "lastUpdated": "2020-04-09T21:10:28.568+00:00",
    "tag": [
      {
        "system": "https://mii-termserv.de/fhir/su-termserv/CodeSystem/mii-cs-suts-resource-tags-project",
        "code": "hl7",
        "display": "HL7 International"
      },
      {
        "system": "https://mii-termserv.de/fhir/su-termserv/CodeSystem/mii-cs-suts-resource-tags-dataset",
        "code": "hl7",
        "display": "HL7 International"
      },
      {
        "system": "https://mii-termserv.de/fhir/su-termserv/CodeSystem/mii-cs-suts-resource-tags-license",
        "code": "https://mii-termserv.de/licenses#tho",
        "display": "THO license"
      }
    ]
  },
  "text": {
    "status": "generated",
    "div": "<div xmlns=\"http://www.w3.org/1999/xhtml\"><h2>StatisticCertaintySubcomponentType</h2><tt>http://terminology.hl7.org/CodeSystem/certainty-subcomponent-type</tt><p>The subcomponent classification of quality of evidence rating systems.</p><div><p><b>SU-TermServ Metadata</b></p><table><tbody><tr><td><b>Project</b></td><td>HL7 International</td></tr><tr><td><b>Dataset</b></td><td>HL7 International</td></tr><tr><td><b>License</b></td><td><a href=\"https://mii-termserv.de/licenses#tho\">THO license</a></td></tr><tr><td><b>Package Scope</b></td><td><a href=\"https://gitlab.com/groups/mii-termserv/fhir-resources/-/packages/?ForderBy%3Dversion%26sort%3Ddesc%26search%5B%5D%3D@mii-termserv/hl7.terminology\"><code>@mii-termserv/hl7.terminology</code></a></td></tr></tbody></table></div></div>"
  },
  "url": "http://terminology.hl7.org/CodeSystem/certainty-subcomponent-type",
  "identifier": [
    {
      "system": "urn:ietf:rfc:3986",
      "value": "urn:oid:2.16.840.1.113883.4.642.1.1360"
    }
  ],
  "version": "1.0.0",
  "name": "StatisticCertaintySubcomponentType",
  "title": "StatisticCertaintySubcomponentType",
  "status": "draft",
  "experimental": false,
  "date": "2020-04-09T21:10:28+00:00",
  "publisher": "Health Level Seven International",
  "contact": [
    {
      "telecom": [
        {
          "system": "url",
          "value": "http://hl7.org"
        },
        {
          "system": "email",
          "value": "hq@HL7.org"
        }
      ]
    }
  ],
  "description": "The subcomponent classification of quality of evidence rating systems.",
  "copyright": "This material derives from the HL7 Terminology (THO). THO is copyright ©1989+ Health Level Seven International and is made available under the CC0 designation. For more licensing information see: https://terminology.hl7.org/license",
  "caseSensitive": true,
  "valueSet": "http://terminology.hl7.org/ValueSet/certainty-subcomponent-type",
  "content": "complete",
  "concept": [
    {
      "code": "RiskOfBias",
      "display": "Risk of bias",
      "definition": "methodologic concerns reducing internal validity."
    },
    {
      "code": "Inconsistency",
      "display": "Inconsistency",
      "definition": "concerns that findings are not similar enough to support certainty."
    },
    {
      "code": "Indirectness",
      "display": "Indirectness",
      "definition": "concerns reducing external validity."
    },
    {
      "code": "Imprecision",
      "display": "Imprecision",
      "definition": "fuzzy or wide variability."
    },
    {
      "code": "PublicationBias",
      "display": "Publication bias",
      "definition": "likelihood that what is published misrepresents what is available to publish."
    },
    {
      "code": "DoseResponseGradient",
      "display": "Dose response gradient",
      "definition": "higher certainty due to dose response relationship."
    },
    {
      "code": "PlausibleConfounding",
      "display": "Plausible confounding",
      "definition": "higher certainty due to risk of bias in opposite direction."
    },
    {
      "code": "LargeEffect",
      "display": "Large effect",
      "definition": "higher certainty due to large effect size."
    }
  ],
  "extension": [
    {
      "url": "http://hl7.org/fhir/StructureDefinition/cqf-scope",
      "valueString": "@mii-termserv/hl7.terminology"
    }
  ]
}