{
  "resourceType": "CodeSystem",
  "id": "fhir.r4b-substance-source-material-type",
  "meta": {
    "lastUpdated": "2022-05-28T13:47:40.239+11:00",
    "profile": [
      "http://hl7.org/fhir/StructureDefinition/shareablecodesystem"
    ],
    "tag": [
      {
        "system": "https://mii-termserv.de/fhir/su-termserv/CodeSystem/mii-cs-suts-resource-tags-project",
        "code": "hl7",
        "display": "HL7 International"
      },
      {
        "system": "https://mii-termserv.de/fhir/su-termserv/CodeSystem/mii-cs-suts-resource-tags-dataset",
        "code": "hl7-fhir",
        "display": "HL7 FHIR"
      },
      {
        "system": "https://mii-termserv.de/fhir/su-termserv/CodeSystem/mii-cs-suts-resource-tags-license",
        "code": "https://mii-termserv.de/licenses#fhir",
        "display": "HL7 FHIR License"
      }
    ]
  },
  "text": {
    "status": "generated",
    "div": "<div xmlns=\"http://www.w3.org/1999/xhtml\">\n            <p>This code system http://hl7.org/fhir/substance-source-material-type defines the following codes:</p>\n            <table class=\"codes\">\n              <tr>\n                <td style=\"white-space:nowrap\">\n                  <b>Code</b>\n                </td>\n                <td>\n                  <b>Display</b>\n                </td>\n              </tr>\n              <tr>\n                <td style=\"white-space:nowrap\">Animal\n                  <a name=\"substance-source-material-type-Animal\"> </a>\n                </td>\n                <td>animal</td>\n              </tr>\n              <tr>\n                <td style=\"white-space:nowrap\">Plant\n                  <a name=\"substance-source-material-type-Plant\"> </a>\n                </td>\n                <td>plant</td>\n              </tr>\n              <tr>\n                <td style=\"white-space:nowrap\">Mineral\n                  <a name=\"substance-source-material-type-Mineral\"> </a>\n                </td>\n                <td>mineral</td>\n              </tr>\n            </table>\n          </div>"
  },
  "extension": [
    {
      "url": "http://hl7.org/fhir/StructureDefinition/structuredefinition-wg",
      "valueCode": "brr"
    },
    {
      "url": "http://hl7.org/fhir/StructureDefinition/structuredefinition-standards-status",
      "valueCode": "trial-use"
    },
    {
      "url": "http://hl7.org/fhir/StructureDefinition/structuredefinition-fmm",
      "valueInteger": 1
    },
    {
      "url": "http://hl7.org/fhir/StructureDefinition/cqf-scope",
      "valueString": "@mii-termserv/hl7.fhir.r4b.terminology"
    }
  ],
  "url": "http://hl7.org/fhir/substance-source-material-type",
  "identifier": [
    {
      "system": "urn:ietf:rfc:3986",
      "value": "urn:oid:2.16.840.1.113883.4.642.1.1625"
    }
  ],
  "version": "4.3.0",
  "name": "SubstanceSourceMaterialType",
  "title": "SubstanceSourceMaterialType",
  "status": "draft",
  "experimental": false,
  "date": "2021-01-05T10:01:24+11:00",
  "publisher": "HL7 (FHIR Project)",
  "contact": [
    {
      "telecom": [
        {
          "system": "url",
          "value": "http://hl7.org/fhir"
        },
        {
          "system": "email",
          "value": "fhir@lists.hl7.org"
        }
      ]
    }
  ],
  "caseSensitive": true,
  "valueSet": "http://hl7.org/fhir/ValueSet/substance-source-material-type",
  "content": "complete",
  "concept": [
    {
      "code": "Animal",
      "display": "animal"
    },
    {
      "code": "Plant",
      "display": "plant"
    },
    {
      "code": "Mineral",
      "display": "mineral"
    }
  ]
}