{
  "resourceType": "ConceptMap",
  "id": "fhir.r4b-cm-address-type-v3",
  "text": {
    "status": "extensions",
    "div": "<div xmlns=\"http://www.w3.org/1999/xhtml\">\n            <h2>v3.AddressType (http://hl7.org/fhir/ConceptMap/cm-address-type-v3)</h2>\n            <p>Mapping from \n              <a href=\"valueset-address-type.html\">http://hl7.org/fhir/ValueSet/address-type</a> to \n              <a href=\"http://terminology.hl7.org/3.1.0/ValueSet-v3-AddressUse.html\">http://terminology.hl7.org/ValueSet/v3-AddressUse</a>\n            </p>\n            <p>DRAFT. Published on 2022-05-28T12:47:40+10:00 by HL7 (FHIR Project) (\n              <a href=\"http://hl7.org/fhir\">http://hl7.org/fhir</a>, \n              <a href=\"mailto:fhir@lists.hl7.org\">fhir@lists.hl7.org</a>). \n            </p>\n            <br/>\n            <table class=\"grid\">\n              <tr>\n                <td>\n                  <b>Source Code</b>\n                </td>\n                <td>\n                  <b>Relationship</b>\n                </td>\n                <td>\n                  <b>Destination Code</b>\n                </td>\n              </tr>\n              <tr>\n                <td colspan=\"3\">Mapping from \n                  <a href=\"codesystem-address-type.html\">AddressType</a> to \n                  <a href=\"http://terminology.hl7.org/3.1.0/CodeSystem-v3-AddressUse.html\">AddressUse</a>\n                </td>\n              </tr>\n              <tr>\n                <td>postal</td>\n                <td>\n                  <a href=\"codesystem-concept-map-equivalence.html#equivalent\">is equivalent to</a>\n                </td>\n                <td>PST (postal address)</td>\n              </tr>\n              <tr>\n                <td>physical</td>\n                <td>\n                  <a href=\"codesystem-concept-map-equivalence.html#equivalent\">is equivalent to</a>\n                </td>\n                <td>PHYS (physical visit address)</td>\n              </tr>\n            </table>\n          </div>"
  },
  "url": "http://hl7.org/fhir/ConceptMap/cm-address-type-v3",
  "version": "4.3.0",
  "name": "v3.AddressType",
  "title": "v3 map for AddressType",
  "status": "draft",
  "experimental": false,
  "date": "2022-05-28T12:47:40+10:00",
  "publisher": "HL7 (FHIR Project)",
  "contact": [
    {
      "telecom": [
        {
          "system": "url",
          "value": "http://hl7.org/fhir"
        },
        {
          "system": "email",
          "value": "fhir@lists.hl7.org"
        }
      ]
    }
  ],
  "sourceCanonical": "http://hl7.org/fhir/ValueSet/address-type",
  "targetCanonical": "http://terminology.hl7.org/ValueSet/v3-AddressUse",
  "group": [
    {
      "source": "http://hl7.org/fhir/address-type",
      "target": "http://terminology.hl7.org/CodeSystem/v3-AddressUse",
      "element": [
        {
          "code": "postal",
          "target": [
            {
              "code": "PST",
              "equivalence": "equivalent"
            }
          ]
        },
        {
          "code": "physical",
          "target": [
            {
              "code": "PHYS",
              "equivalence": "equivalent"
            }
          ]
        }
      ]
    }
  ],
  "meta": {
    "tag": [
      {
        "system": "https://mii-termserv.de/fhir/su-termserv/CodeSystem/mii-cs-suts-resource-tags-project",
        "code": "hl7",
        "display": "HL7 International"
      },
      {
        "system": "https://mii-termserv.de/fhir/su-termserv/CodeSystem/mii-cs-suts-resource-tags-dataset",
        "code": "hl7-fhir",
        "display": "HL7 FHIR"
      },
      {
        "system": "https://mii-termserv.de/fhir/su-termserv/CodeSystem/mii-cs-suts-resource-tags-license",
        "code": "https://mii-termserv.de/licenses#fhir",
        "display": "HL7 FHIR License"
      }
    ]
  },
  "extension": [
    {
      "url": "http://hl7.org/fhir/StructureDefinition/cqf-scope",
      "valueString": "@mii-termserv/hl7.fhir.r4b.terminology"
    }
  ]
}