{
  "resourceType": "CodeSystem",
  "id": "fhir.r4b-device-statement-status",
  "meta": {
    "lastUpdated": "2022-05-28T13:47:40.239+11:00",
    "profile": [
      "http://hl7.org/fhir/StructureDefinition/shareablecodesystem"
    ],
    "tag": [
      {
        "system": "https://mii-termserv.de/fhir/su-termserv/CodeSystem/mii-cs-suts-resource-tags-project",
        "code": "hl7",
        "display": "HL7 International"
      },
      {
        "system": "https://mii-termserv.de/fhir/su-termserv/CodeSystem/mii-cs-suts-resource-tags-dataset",
        "code": "hl7-fhir",
        "display": "HL7 FHIR"
      },
      {
        "system": "https://mii-termserv.de/fhir/su-termserv/CodeSystem/mii-cs-suts-resource-tags-license",
        "code": "https://mii-termserv.de/licenses#fhir",
        "display": "HL7 FHIR License"
      }
    ]
  },
  "text": {
    "status": "generated",
    "div": "<div xmlns=\"http://www.w3.org/1999/xhtml\"><h2>DeviceUseStatementStatus</h2><tt>http://hl7.org/fhir/device-statement-status</tt><p>A coded concept indicating the current status of the Device Usage.</p></div>"
  },
  "extension": [
    {
      "url": "http://hl7.org/fhir/StructureDefinition/structuredefinition-wg",
      "valueCode": "oo"
    },
    {
      "url": "http://hl7.org/fhir/StructureDefinition/structuredefinition-standards-status",
      "valueCode": "trial-use"
    },
    {
      "url": "http://hl7.org/fhir/StructureDefinition/structuredefinition-fmm",
      "valueInteger": 0
    },
    {
      "url": "http://hl7.org/fhir/StructureDefinition/cqf-scope",
      "valueString": "@mii-termserv/hl7.fhir.r4b.terminology"
    }
  ],
  "url": "http://hl7.org/fhir/device-statement-status",
  "identifier": [
    {
      "system": "urn:ietf:rfc:3986",
      "value": "urn:oid:2.16.840.1.113883.4.642.4.215"
    }
  ],
  "version": "4.3.0",
  "name": "DeviceUseStatementStatus",
  "title": "DeviceUseStatementStatus",
  "status": "draft",
  "experimental": false,
  "date": "2021-01-17T07:06:13+11:00",
  "publisher": "HL7 (FHIR Project)",
  "contact": [
    {
      "telecom": [
        {
          "system": "url",
          "value": "http://hl7.org/fhir"
        },
        {
          "system": "email",
          "value": "fhir@lists.hl7.org"
        }
      ]
    }
  ],
  "description": "A coded concept indicating the current status of the Device Usage.",
  "caseSensitive": true,
  "valueSet": "http://hl7.org/fhir/ValueSet/device-statement-status",
  "content": "complete",
  "concept": [
    {
      "code": "active",
      "display": "Active",
      "definition": "The device is still being used."
    },
    {
      "code": "completed",
      "display": "Completed",
      "definition": "The device is no longer being used."
    },
    {
      "code": "entered-in-error",
      "display": "Entered in Error",
      "definition": "The statement was recorded incorrectly."
    },
    {
      "code": "intended",
      "display": "Intended",
      "definition": "The device may be used at some time in the future."
    },
    {
      "code": "stopped",
      "display": "Stopped",
      "definition": "Actions implied by the statement have been permanently halted, before all of them occurred."
    },
    {
      "code": "on-hold",
      "display": "On Hold",
      "definition": "Actions implied by the statement have been temporarily halted, but are expected to continue later. May also be called \"suspended\"."
    }
  ]
}