{
  "resourceType": "CodeSystem",
  "id": "fhir.r4b-assert-response-code-types",
  "meta": {
    "lastUpdated": "2022-05-28T13:47:40.239+11:00",
    "profile": [
      "http://hl7.org/fhir/StructureDefinition/shareablecodesystem"
    ],
    "tag": [
      {
        "system": "https://mii-termserv.de/fhir/su-termserv/CodeSystem/mii-cs-suts-resource-tags-project",
        "code": "hl7",
        "display": "HL7 International"
      },
      {
        "system": "https://mii-termserv.de/fhir/su-termserv/CodeSystem/mii-cs-suts-resource-tags-dataset",
        "code": "hl7-fhir",
        "display": "HL7 FHIR"
      },
      {
        "system": "https://mii-termserv.de/fhir/su-termserv/CodeSystem/mii-cs-suts-resource-tags-license",
        "code": "https://mii-termserv.de/licenses#fhir",
        "display": "HL7 FHIR License"
      }
    ]
  },
  "text": {
    "status": "generated",
    "div": "<div xmlns=\"http://www.w3.org/1999/xhtml\"><h2>AssertionResponseTypes</h2><tt>http://hl7.org/fhir/assert-response-code-types</tt><p>The type of response code to use for assertion.</p></div>"
  },
  "extension": [
    {
      "url": "http://hl7.org/fhir/StructureDefinition/structuredefinition-wg",
      "valueCode": "fhir"
    },
    {
      "url": "http://hl7.org/fhir/StructureDefinition/structuredefinition-standards-status",
      "valueCode": "trial-use"
    },
    {
      "url": "http://hl7.org/fhir/StructureDefinition/structuredefinition-fmm",
      "valueInteger": 2
    },
    {
      "url": "http://hl7.org/fhir/StructureDefinition/cqf-scope",
      "valueString": "@mii-termserv/hl7.fhir.r4b.terminology"
    }
  ],
  "url": "http://hl7.org/fhir/assert-response-code-types",
  "identifier": [
    {
      "system": "urn:ietf:rfc:3986",
      "value": "urn:oid:2.16.840.1.113883.4.642.4.711"
    }
  ],
  "version": "4.3.0",
  "name": "AssertionResponseTypes",
  "title": "AssertionResponseTypes",
  "status": "draft",
  "experimental": false,
  "date": "2021-01-17T07:06:13+11:00",
  "publisher": "HL7 (FHIR Project)",
  "contact": [
    {
      "telecom": [
        {
          "system": "url",
          "value": "http://hl7.org/fhir"
        },
        {
          "system": "email",
          "value": "fhir@lists.hl7.org"
        }
      ]
    }
  ],
  "description": "The type of response code to use for assertion.",
  "caseSensitive": true,
  "valueSet": "http://hl7.org/fhir/ValueSet/assert-response-code-types",
  "content": "complete",
  "concept": [
    {
      "code": "okay",
      "display": "okay",
      "definition": "Response code is 200."
    },
    {
      "code": "created",
      "display": "created",
      "definition": "Response code is 201."
    },
    {
      "code": "noContent",
      "display": "noContent",
      "definition": "Response code is 204."
    },
    {
      "code": "notModified",
      "display": "notModified",
      "definition": "Response code is 304."
    },
    {
      "code": "bad",
      "display": "bad",
      "definition": "Response code is 400."
    },
    {
      "code": "forbidden",
      "display": "forbidden",
      "definition": "Response code is 403."
    },
    {
      "code": "notFound",
      "display": "notFound",
      "definition": "Response code is 404."
    },
    {
      "code": "methodNotAllowed",
      "display": "methodNotAllowed",
      "definition": "Response code is 405."
    },
    {
      "code": "conflict",
      "display": "conflict",
      "definition": "Response code is 409."
    },
    {
      "code": "gone",
      "display": "gone",
      "definition": "Response code is 410."
    },
    {
      "code": "preconditionFailed",
      "display": "preconditionFailed",
      "definition": "Response code is 412."
    },
    {
      "code": "unprocessable",
      "display": "unprocessable",
      "definition": "Response code is 422."
    }
  ]
}