{
  "resourceType": "CodeSystem",
  "id": "fhir.r4b-coverage-class",
  "meta": {
    "lastUpdated": "2022-05-28T12:47:40.239+10:00",
    "profile": [
      "http://hl7.org/fhir/StructureDefinition/shareablecodesystem"
    ],
    "tag": [
      {
        "system": "https://mii-termserv.de/fhir/su-termserv/CodeSystem/mii-cs-suts-resource-tags-project",
        "code": "hl7",
        "display": "HL7 International"
      },
      {
        "system": "https://mii-termserv.de/fhir/su-termserv/CodeSystem/mii-cs-suts-resource-tags-dataset",
        "code": "hl7-fhir",
        "display": "HL7 FHIR"
      },
      {
        "system": "https://mii-termserv.de/fhir/su-termserv/CodeSystem/mii-cs-suts-resource-tags-license",
        "code": "https://mii-termserv.de/licenses#fhir",
        "display": "HL7 FHIR License"
      }
    ]
  },
  "text": {
    "status": "generated",
    "div": "<div xmlns=\"http://www.w3.org/1999/xhtml\"><h2>Coverage Class Codes</h2><tt>http://terminology.hl7.org/CodeSystem/coverage-class</tt><p>This value set includes Coverage Class codes.</p></div>"
  },
  "extension": [
    {
      "url": "http://hl7.org/fhir/StructureDefinition/structuredefinition-wg",
      "valueCode": "fm"
    },
    {
      "url": "http://hl7.org/fhir/StructureDefinition/cqf-scope",
      "valueString": "@mii-termserv/hl7.fhir.r4b.terminology"
    }
  ],
  "url": "http://terminology.hl7.org/CodeSystem/coverage-class",
  "identifier": [
    {
      "system": "urn:ietf:rfc:3986",
      "value": "urn:oid:2.16.840.1.113883.4.642.1.1147"
    }
  ],
  "version": "4.3.0",
  "name": "CoverageClassCodes",
  "title": "Coverage Class Codes",
  "status": "draft",
  "experimental": false,
  "publisher": "Financial Management",
  "contact": [
    {
      "telecom": [
        {
          "system": "url",
          "value": "http://hl7.org/fhir"
        }
      ]
    }
  ],
  "description": "This value set includes Coverage Class codes.",
  "copyright": "HL7 Inc.",
  "caseSensitive": true,
  "content": "complete",
  "concept": [
    {
      "code": "group",
      "display": "Group",
      "definition": "An employee group"
    },
    {
      "code": "subgroup",
      "display": "SubGroup",
      "definition": "A sub-group of an employee group"
    },
    {
      "code": "plan",
      "display": "Plan",
      "definition": "A specific suite of benefits."
    },
    {
      "code": "subplan",
      "display": "SubPlan",
      "definition": "A subset of a specific suite of benefits."
    },
    {
      "code": "class",
      "display": "Class",
      "definition": "A class of benefits."
    },
    {
      "code": "subclass",
      "display": "SubClass",
      "definition": "A subset of a class of benefits."
    },
    {
      "code": "sequence",
      "display": "Sequence",
      "definition": "A sequence number associated with a short-term continuance of the coverage."
    },
    {
      "code": "rxbin",
      "display": "RX BIN",
      "definition": "Pharmacy benefit manager's Business Identification Number."
    },
    {
      "code": "rxpcn",
      "display": "RX PCN",
      "definition": "A Pharmacy Benefit Manager specified Processor Control Number."
    },
    {
      "code": "rxid",
      "display": "RX Id",
      "definition": "A Pharmacy Benefit Manager specified Member ID."
    },
    {
      "code": "rxgroup",
      "display": "RX Group",
      "definition": "A Pharmacy Benefit Manager specified Group number."
    }
  ]
}