{
  "resourceType": "CodeSystem",
  "id": "fhir.r4b-product-storage-scale",
  "meta": {
    "lastUpdated": "2022-05-28T13:47:40.239+11:00",
    "profile": [
      "http://hl7.org/fhir/StructureDefinition/shareablecodesystem"
    ],
    "tag": [
      {
        "system": "https://mii-termserv.de/fhir/su-termserv/CodeSystem/mii-cs-suts-resource-tags-project",
        "code": "hl7",
        "display": "HL7 International"
      },
      {
        "system": "https://mii-termserv.de/fhir/su-termserv/CodeSystem/mii-cs-suts-resource-tags-dataset",
        "code": "hl7-fhir",
        "display": "HL7 FHIR"
      },
      {
        "system": "https://mii-termserv.de/fhir/su-termserv/CodeSystem/mii-cs-suts-resource-tags-license",
        "code": "https://mii-termserv.de/licenses#fhir",
        "display": "HL7 FHIR License"
      }
    ]
  },
  "text": {
    "status": "generated",
    "div": "<div xmlns=\"http://www.w3.org/1999/xhtml\"><h2>BiologicallyDerivedProductStorageScale</h2><tt>http://hl7.org/fhir/product-storage-scale</tt><p>BiologicallyDerived Product Storage Scale.</p></div>"
  },
  "extension": [
    {
      "url": "http://hl7.org/fhir/StructureDefinition/structuredefinition-wg",
      "valueCode": "oo"
    },
    {
      "url": "http://hl7.org/fhir/StructureDefinition/structuredefinition-standards-status",
      "valueCode": "trial-use"
    },
    {
      "url": "http://hl7.org/fhir/StructureDefinition/structuredefinition-fmm",
      "valueInteger": 0
    },
    {
      "url": "http://hl7.org/fhir/StructureDefinition/cqf-scope",
      "valueString": "@mii-termserv/hl7.fhir.r4b.terminology"
    }
  ],
  "url": "http://hl7.org/fhir/product-storage-scale",
  "identifier": [
    {
      "system": "urn:ietf:rfc:3986",
      "value": "urn:oid:2.16.840.1.113883.4.642.4.905"
    }
  ],
  "version": "4.3.0",
  "name": "BiologicallyDerivedProductStorageScale",
  "title": "BiologicallyDerivedProductStorageScale",
  "status": "draft",
  "experimental": false,
  "date": "2021-01-17T07:06:13+11:00",
  "publisher": "HL7 (FHIR Project)",
  "contact": [
    {
      "telecom": [
        {
          "system": "url",
          "value": "http://hl7.org/fhir"
        },
        {
          "system": "email",
          "value": "fhir@lists.hl7.org"
        }
      ]
    }
  ],
  "description": "BiologicallyDerived Product Storage Scale.",
  "caseSensitive": true,
  "valueSet": "http://hl7.org/fhir/ValueSet/product-storage-scale",
  "content": "complete",
  "concept": [
    {
      "code": "farenheit",
      "display": "Fahrenheit",
      "definition": "Fahrenheit temperature scale."
    },
    {
      "code": "celsius",
      "display": "Celsius",
      "definition": "Celsius or centigrade temperature scale."
    },
    {
      "code": "kelvin",
      "display": "Kelvin",
      "definition": "Kelvin absolute thermodynamic temperature scale."
    }
  ]
}