{
  "resourceType": "CodeSystem",
  "id": "fhir.r4b-claim-careteamrole",
  "meta": {
    "lastUpdated": "2022-05-28T12:47:40.239+10:00",
    "profile": [
      "http://hl7.org/fhir/StructureDefinition/shareablecodesystem"
    ],
    "tag": [
      {
        "system": "https://mii-termserv.de/fhir/su-termserv/CodeSystem/mii-cs-suts-resource-tags-project",
        "code": "hl7",
        "display": "HL7 International"
      },
      {
        "system": "https://mii-termserv.de/fhir/su-termserv/CodeSystem/mii-cs-suts-resource-tags-dataset",
        "code": "hl7-fhir",
        "display": "HL7 FHIR"
      },
      {
        "system": "https://mii-termserv.de/fhir/su-termserv/CodeSystem/mii-cs-suts-resource-tags-license",
        "code": "https://mii-termserv.de/licenses#fhir",
        "display": "HL7 FHIR License"
      }
    ]
  },
  "text": {
    "status": "generated",
    "div": "<div xmlns=\"http://www.w3.org/1999/xhtml\"><h2>Claim Care Team Role Codes</h2><tt>http://terminology.hl7.org/CodeSystem/claimcareteamrole</tt><p>This value set includes sample Claim Care Team Role codes.</p></div>"
  },
  "extension": [
    {
      "url": "http://hl7.org/fhir/StructureDefinition/structuredefinition-wg",
      "valueCode": "fm"
    },
    {
      "url": "http://hl7.org/fhir/StructureDefinition/cqf-scope",
      "valueString": "@mii-termserv/hl7.fhir.r4b.terminology"
    }
  ],
  "url": "http://terminology.hl7.org/CodeSystem/claimcareteamrole",
  "identifier": [
    {
      "system": "urn:ietf:rfc:3986",
      "value": "urn:oid:2.16.840.1.113883.4.642.1.1165"
    }
  ],
  "version": "4.3.0",
  "name": "ClaimCareTeamRoleCodes",
  "title": "Claim Care Team Role Codes",
  "status": "draft",
  "experimental": false,
  "description": "This value set includes sample Claim Care Team Role codes.",
  "copyright": "This is an example set.",
  "caseSensitive": true,
  "content": "complete",
  "concept": [
    {
      "code": "primary",
      "display": "Primary provider",
      "definition": "The primary care provider."
    },
    {
      "code": "assist",
      "display": "Assisting Provider",
      "definition": "Assisting care provider."
    },
    {
      "code": "supervisor",
      "display": "Supervising Provider",
      "definition": "Supervising care provider."
    },
    {
      "code": "other",
      "display": "Other",
      "definition": "Other role on the care team."
    }
  ]
}