{
  "resourceType": "CodeSystem",
  "id": "fhir.r4b-specimen-status",
  "meta": {
    "lastUpdated": "2022-05-28T13:47:40.239+11:00",
    "profile": [
      "http://hl7.org/fhir/StructureDefinition/shareablecodesystem"
    ],
    "tag": [
      {
        "system": "https://mii-termserv.de/fhir/su-termserv/CodeSystem/mii-cs-suts-resource-tags-project",
        "code": "hl7",
        "display": "HL7 International"
      },
      {
        "system": "https://mii-termserv.de/fhir/su-termserv/CodeSystem/mii-cs-suts-resource-tags-dataset",
        "code": "hl7-fhir",
        "display": "HL7 FHIR"
      },
      {
        "system": "https://mii-termserv.de/fhir/su-termserv/CodeSystem/mii-cs-suts-resource-tags-license",
        "code": "https://mii-termserv.de/licenses#fhir",
        "display": "HL7 FHIR License"
      }
    ]
  },
  "text": {
    "status": "generated",
    "div": "<div xmlns=\"http://www.w3.org/1999/xhtml\"><h2>SpecimenStatus</h2><tt>http://hl7.org/fhir/specimen-status</tt><p>Codes providing the status/availability of a specimen.</p></div>"
  },
  "extension": [
    {
      "url": "http://hl7.org/fhir/StructureDefinition/structuredefinition-wg",
      "valueCode": "oo"
    },
    {
      "url": "http://hl7.org/fhir/StructureDefinition/structuredefinition-standards-status",
      "valueCode": "trial-use"
    },
    {
      "url": "http://hl7.org/fhir/StructureDefinition/structuredefinition-fmm",
      "valueInteger": 2
    },
    {
      "url": "http://hl7.org/fhir/StructureDefinition/cqf-scope",
      "valueString": "@mii-termserv/hl7.fhir.r4b.terminology"
    }
  ],
  "url": "http://hl7.org/fhir/specimen-status",
  "identifier": [
    {
      "system": "urn:ietf:rfc:3986",
      "value": "urn:oid:2.16.840.1.113883.4.642.4.472"
    }
  ],
  "version": "4.3.0",
  "name": "SpecimenStatus",
  "title": "SpecimenStatus",
  "status": "draft",
  "experimental": false,
  "date": "2021-01-17T07:06:13+11:00",
  "publisher": "HL7 (FHIR Project)",
  "contact": [
    {
      "telecom": [
        {
          "system": "url",
          "value": "http://hl7.org/fhir"
        },
        {
          "system": "email",
          "value": "fhir@lists.hl7.org"
        }
      ]
    }
  ],
  "description": "Codes providing the status/availability of a specimen.",
  "caseSensitive": true,
  "valueSet": "http://hl7.org/fhir/ValueSet/specimen-status",
  "content": "complete",
  "concept": [
    {
      "code": "available",
      "display": "Available",
      "definition": "The physical specimen is present and in good condition."
    },
    {
      "code": "unavailable",
      "display": "Unavailable",
      "definition": "There is no physical specimen because it is either lost, destroyed or consumed."
    },
    {
      "code": "unsatisfactory",
      "display": "Unsatisfactory",
      "definition": "The specimen cannot be used because of a quality issue such as a broken container, contamination, or too old."
    },
    {
      "code": "entered-in-error",
      "display": "Entered in Error",
      "definition": "The specimen was entered in error and therefore nullified."
    }
  ]
}