{
  "resourceType": "ConceptMap",
  "id": "fhir.r4b-cm-address-use-v3",
  "text": {
    "status": "extensions",
    "div": "<div xmlns=\"http://www.w3.org/1999/xhtml\">\n            <h2>v3.AddressUse (http://hl7.org/fhir/ConceptMap/cm-address-use-v3)</h2>\n            <p>Mapping from \n              <a href=\"valueset-address-use.html\">http://hl7.org/fhir/ValueSet/address-use</a> to \n              <a href=\"http://terminology.hl7.org/3.1.0/ValueSet-v3-AddressUse.html\">http://terminology.hl7.org/ValueSet/v3-AddressUse</a>\n            </p>\n            <p>DRAFT. Published on 2022-05-28T12:47:40+10:00 by HL7 (FHIR Project) (\n              <a href=\"http://hl7.org/fhir\">http://hl7.org/fhir</a>, \n              <a href=\"mailto:fhir@lists.hl7.org\">fhir@lists.hl7.org</a>). \n            </p>\n            <br/>\n            <table class=\"grid\">\n              <tr>\n                <td colspan=\"2\">\n                  <b>Source Concept Details</b>\n                </td>\n                <td>\n                  <b>Relationship</b>\n                </td>\n                <td colspan=\"2\">\n                  <b>Destination Concept Details</b>\n                </td>\n                <td>\n                  <b>Comment</b>\n                </td>\n              </tr>\n              <tr>\n                <td colspan=\"2\">\n                  <b>Code</b> from \n                  <a href=\"codesystem-address-use.html\" title=\"http://hl7.org/fhir/address-use\">AddressUse</a>\n                </td>\n                <td/>\n                <td colspan=\"2\">\n                  <b>Code</b> from \n                  <a href=\"http://terminology.hl7.org/3.1.0/CodeSystem-v3-AddressUse.html\" title=\"http://terminology.hl7.org/CodeSystem/v3-AddressUse\">AddressUse</a>\n                </td>\n                <td/>\n              </tr>\n              <tr>\n                <td style=\"border-right-width: 0px\">home</td>\n                <td style=\"border-left-width: 0px\">Home</td>\n                <td>\n                  <a href=\"codesystem-concept-map-equivalence.html#equivalent\">is equivalent to</a>\n                </td>\n                <td style=\"border-right-width: 0px\">H</td>\n                <td style=\"border-left-width: 0px\">home address</td>\n                <td/>\n              </tr>\n              <tr>\n                <td style=\"border-right-width: 0px\">work</td>\n                <td style=\"border-left-width: 0px\">Work</td>\n                <td>\n                  <a href=\"codesystem-concept-map-equivalence.html#equivalent\">is equivalent to</a>\n                </td>\n                <td style=\"border-right-width: 0px\">WP</td>\n                <td style=\"border-left-width: 0px\">work place</td>\n                <td/>\n              </tr>\n              <tr>\n                <td style=\"border-right-width: 0px\">temp</td>\n                <td style=\"border-left-width: 0px\">Temporary</td>\n                <td>\n                  <a href=\"codesystem-concept-map-equivalence.html#equivalent\">is equivalent to</a>\n                </td>\n                <td style=\"border-right-width: 0px\">TMP</td>\n                <td style=\"border-left-width: 0px\">temporary address</td>\n                <td/>\n              </tr>\n              <tr>\n                <td style=\"border-right-width: 0px; border-bottom-style: none\">old</td>\n                <td style=\"border-left-width: 0px; border-bottom-style: none\">Old / Incorrect</td>\n                <td>\n                  <a href=\"codesystem-concept-map-equivalence.html#source-is-broader-than-target\">is broader than</a>\n                </td>\n                <td style=\"border-right-width: 0px\">OLD</td>\n                <td style=\"border-left-width: 0px\">no longer in use</td>\n                <td>Bad or Old</td>\n              </tr>\n              <tr>\n                <td style=\"border-right-width: 0px; border-top-style: none\"/>\n                <td style=\"border-top-style: none; border-left-width: 0px\"/>\n                <td>\n                  <a href=\"codesystem-concept-map-equivalence.html#source-is-broader-than-target\">is broader than</a>\n                </td>\n                <td style=\"border-right-width: 0px\">BAD</td>\n                <td style=\"border-left-width: 0px\">bad address</td>\n                <td>Bad or Old</td>\n              </tr>\n            </table>\n          </div>"
  },
  "url": "http://hl7.org/fhir/ConceptMap/cm-address-use-v3",
  "version": "4.3.0",
  "name": "v3.AddressUse",
  "title": "v3 map for AddressUse",
  "status": "draft",
  "experimental": false,
  "date": "2022-05-28T12:47:40+10:00",
  "publisher": "HL7 (FHIR Project)",
  "contact": [
    {
      "telecom": [
        {
          "system": "url",
          "value": "http://hl7.org/fhir"
        },
        {
          "system": "email",
          "value": "fhir@lists.hl7.org"
        }
      ]
    }
  ],
  "sourceCanonical": "http://hl7.org/fhir/ValueSet/address-use",
  "targetCanonical": "http://terminology.hl7.org/ValueSet/v3-AddressUse",
  "group": [
    {
      "source": "http://hl7.org/fhir/address-use",
      "target": "http://terminology.hl7.org/CodeSystem/v3-AddressUse",
      "element": [
        {
          "code": "home",
          "target": [
            {
              "code": "H",
              "equivalence": "equivalent"
            }
          ]
        },
        {
          "code": "work",
          "target": [
            {
              "code": "WP",
              "equivalence": "equivalent"
            }
          ]
        },
        {
          "code": "temp",
          "target": [
            {
              "code": "TMP",
              "equivalence": "equivalent"
            }
          ]
        },
        {
          "code": "old",
          "target": [
            {
              "code": "OLD",
              "equivalence": "narrower",
              "comment": "Bad or Old"
            },
            {
              "code": "BAD",
              "equivalence": "narrower",
              "comment": "Bad or Old"
            }
          ]
        }
      ]
    }
  ],
  "meta": {
    "tag": [
      {
        "system": "https://mii-termserv.de/fhir/su-termserv/CodeSystem/mii-cs-suts-resource-tags-project",
        "code": "hl7",
        "display": "HL7 International"
      },
      {
        "system": "https://mii-termserv.de/fhir/su-termserv/CodeSystem/mii-cs-suts-resource-tags-dataset",
        "code": "hl7-fhir",
        "display": "HL7 FHIR"
      },
      {
        "system": "https://mii-termserv.de/fhir/su-termserv/CodeSystem/mii-cs-suts-resource-tags-license",
        "code": "https://mii-termserv.de/licenses#fhir",
        "display": "HL7 FHIR License"
      }
    ]
  },
  "extension": [
    {
      "url": "http://hl7.org/fhir/StructureDefinition/cqf-scope",
      "valueString": "@mii-termserv/hl7.fhir.r4b.terminology"
    }
  ]
}