{
  "resourceType": "CodeSystem",
  "id": "fhir.r4b-service-uscls",
  "meta": {
    "lastUpdated": "2022-05-28T12:47:40.239+10:00",
    "profile": [
      "http://hl7.org/fhir/StructureDefinition/shareablecodesystem"
    ],
    "tag": [
      {
        "system": "https://mii-termserv.de/fhir/su-termserv/CodeSystem/mii-cs-suts-resource-tags-project",
        "code": "hl7",
        "display": "HL7 International"
      },
      {
        "system": "https://mii-termserv.de/fhir/su-termserv/CodeSystem/mii-cs-suts-resource-tags-dataset",
        "code": "hl7-fhir",
        "display": "HL7 FHIR"
      },
      {
        "system": "https://mii-termserv.de/fhir/su-termserv/CodeSystem/mii-cs-suts-resource-tags-license",
        "code": "https://mii-termserv.de/licenses#fhir",
        "display": "HL7 FHIR License"
      }
    ]
  },
  "text": {
    "status": "generated",
    "div": "<div xmlns=\"http://www.w3.org/1999/xhtml\"><h2>USCLS Codes</h2><tt>http://terminology.hl7.org/CodeSystem/ex-USCLS</tt><p>This value set includes a smattering of USCLS codes.</p></div>"
  },
  "extension": [
    {
      "url": "http://hl7.org/fhir/StructureDefinition/structuredefinition-wg",
      "valueCode": "fm"
    },
    {
      "url": "http://hl7.org/fhir/StructureDefinition/cqf-scope",
      "valueString": "@mii-termserv/hl7.fhir.r4b.terminology"
    }
  ],
  "url": "http://terminology.hl7.org/CodeSystem/ex-USCLS",
  "identifier": [
    {
      "system": "urn:ietf:rfc:3986",
      "value": "urn:oid:2.16.840.1.113883.4.642.1.1153"
    }
  ],
  "version": "4.3.0",
  "name": "USCLSCodes",
  "title": "USCLS Codes",
  "status": "draft",
  "experimental": false,
  "description": "This value set includes a smattering of USCLS codes.",
  "copyright": "This is an example set.",
  "caseSensitive": true,
  "content": "complete",
  "concept": [
    {
      "code": "1101",
      "display": "Exam, comp, primary",
      "definition": "Exam, comp, primary"
    },
    {
      "code": "1102",
      "display": "Exam, comp, mixed",
      "definition": "Exam, comp, mixed"
    },
    {
      "code": "1103",
      "display": "Exam, comp, permanent",
      "definition": "Exam, comp, permanent"
    },
    {
      "code": "1201",
      "display": "Exam, recall",
      "definition": "Exam, recall"
    },
    {
      "code": "1205",
      "display": "Exam, emergency",
      "definition": "Exam, emergency"
    },
    {
      "code": "2101",
      "display": "Radiograph, series (12)",
      "definition": "Radiograph, series (12)"
    },
    {
      "code": "2102",
      "display": "Radiograph, series (16)",
      "definition": "Radiograph, series (16)"
    },
    {
      "code": "2141",
      "display": "Radiograph, bitewing",
      "definition": "Radiograph, bitewing"
    },
    {
      "code": "2601",
      "display": "Radiograph, panoramic",
      "definition": "Radiograph, panoramic"
    },
    {
      "code": "11101",
      "display": "Polishing, 1 unit",
      "definition": "Polishing, 1 unit"
    },
    {
      "code": "11102",
      "display": "Polishing, 2 unit",
      "definition": "Polishing, 2 unit"
    },
    {
      "code": "11103",
      "display": "Polishing, 3 unit",
      "definition": "Polishing, 3 unit"
    },
    {
      "code": "11104",
      "display": "Polishing, 4 unit",
      "definition": "Polishing, 4 unit"
    },
    {
      "code": "21211",
      "display": "Amalgam, 1 surface",
      "definition": "Amalgam, 1 surface"
    },
    {
      "code": "21212",
      "display": "Amalgam, 2 surface",
      "definition": "Amalgam, 2 surface"
    },
    {
      "code": "27211",
      "display": "Crown, PFM",
      "definition": "Crown, PFM"
    },
    {
      "code": "67211",
      "display": "Maryland Bridge",
      "definition": "Maryland Bridge"
    },
    {
      "code": "99111",
      "display": "Lab, commercial",
      "definition": "Lab, commercial"
    },
    {
      "code": "99333",
      "display": "Lab, in office",
      "definition": "Lab, in office"
    },
    {
      "code": "99555",
      "display": "Expense",
      "definition": "Expense"
    }
  ]
}