{
  "resourceType": "CodeSystem",
  "id": "fhir.r4b-publication-status",
  "meta": {
    "lastUpdated": "2022-05-28T12:47:40.239+10:00",
    "tag": [
      {
        "system": "https://mii-termserv.de/fhir/su-termserv/CodeSystem/mii-cs-suts-resource-tags-project",
        "code": "hl7",
        "display": "HL7 International"
      },
      {
        "system": "https://mii-termserv.de/fhir/su-termserv/CodeSystem/mii-cs-suts-resource-tags-dataset",
        "code": "hl7-fhir",
        "display": "HL7 FHIR"
      },
      {
        "system": "https://mii-termserv.de/fhir/su-termserv/CodeSystem/mii-cs-suts-resource-tags-license",
        "code": "https://mii-termserv.de/licenses#fhir",
        "display": "HL7 FHIR License"
      }
    ]
  },
  "text": {
    "status": "generated",
    "div": "<div xmlns=\"http://www.w3.org/1999/xhtml\"><h2>PublicationStatus</h2><tt>http://hl7.org/fhir/publication-status</tt><p>The lifecycle status of an artifact.</p></div>"
  },
  "extension": [
    {
      "url": "http://hl7.org/fhir/StructureDefinition/structuredefinition-wg",
      "valueCode": "cds"
    },
    {
      "url": "http://hl7.org/fhir/StructureDefinition/structuredefinition-standards-status",
      "valueCode": "normative"
    },
    {
      "url": "http://hl7.org/fhir/StructureDefinition/structuredefinition-fmm",
      "valueInteger": 5
    },
    {
      "url": "http://hl7.org/fhir/StructureDefinition/structuredefinition-normative-version",
      "valueCode": "4.0.0"
    },
    {
      "url": "http://hl7.org/fhir/StructureDefinition/cqf-scope",
      "valueString": "@mii-termserv/hl7.fhir.r4b.terminology"
    }
  ],
  "url": "http://hl7.org/fhir/publication-status",
  "identifier": [
    {
      "system": "urn:ietf:rfc:3986",
      "value": "urn:oid:2.16.840.1.113883.4.642.1.4"
    }
  ],
  "version": "4.3.0",
  "name": "PublicationStatus",
  "title": "PublicationStatus",
  "status": "active",
  "experimental": false,
  "date": "2022-05-28T12:47:40+10:00",
  "description": "The lifecycle status of an artifact.",
  "caseSensitive": true,
  "valueSet": "http://hl7.org/fhir/ValueSet/publication-status",
  "content": "complete",
  "concept": [
    {
      "code": "draft",
      "display": "Draft",
      "definition": "This resource is still under development and is not yet considered to be ready for normal use.",
      "designation": [
        {
          "language": "ru",
          "value": "черновик"
        },
        {
          "language": "nl",
          "value": "ontwerp"
        }
      ]
    },
    {
      "code": "active",
      "display": "Active",
      "definition": "This resource is ready for normal use.",
      "designation": [
        {
          "language": "ru",
          "value": "активный"
        },
        {
          "language": "nl",
          "value": "actief"
        }
      ]
    },
    {
      "code": "retired",
      "display": "Retired",
      "definition": "This resource has been withdrawn or superseded and should no longer be used.",
      "designation": [
        {
          "language": "ru",
          "value": "удалён"
        },
        {
          "language": "nl",
          "value": "verouderd"
        }
      ]
    },
    {
      "code": "unknown",
      "display": "Unknown",
      "definition": "The authoring system does not know which of the status values currently applies for this resource.  Note: This concept is not to be used for \"other\" - one of the listed statuses is presumed to apply, it's just not known which one."
    }
  ]
}