{
  "resourceType": "CodeSystem",
  "id": "fhir.r4b-service-provision-conditions",
  "meta": {
    "lastUpdated": "2022-05-28T13:47:40.239+11:00",
    "profile": [
      "http://hl7.org/fhir/StructureDefinition/shareablecodesystem"
    ],
    "tag": [
      {
        "system": "https://mii-termserv.de/fhir/su-termserv/CodeSystem/mii-cs-suts-resource-tags-project",
        "code": "hl7",
        "display": "HL7 International"
      },
      {
        "system": "https://mii-termserv.de/fhir/su-termserv/CodeSystem/mii-cs-suts-resource-tags-dataset",
        "code": "hl7-fhir",
        "display": "HL7 FHIR"
      },
      {
        "system": "https://mii-termserv.de/fhir/su-termserv/CodeSystem/mii-cs-suts-resource-tags-license",
        "code": "https://mii-termserv.de/licenses#fhir",
        "display": "HL7 FHIR License"
      }
    ]
  },
  "text": {
    "status": "generated",
    "div": "<div xmlns=\"http://www.w3.org/1999/xhtml\"><h2>ServiceProvisionConditions</h2><tt>http://terminology.hl7.org/CodeSystem/service-provision-conditions</tt><p>The code(s) that detail the conditions under which the healthcare service is available/offered.</p></div>"
  },
  "extension": [
    {
      "url": "http://hl7.org/fhir/StructureDefinition/structuredefinition-wg",
      "valueCode": "pa"
    },
    {
      "url": "http://hl7.org/fhir/StructureDefinition/structuredefinition-standards-status",
      "valueCode": "draft"
    },
    {
      "url": "http://hl7.org/fhir/StructureDefinition/structuredefinition-fmm",
      "valueInteger": 1
    },
    {
      "url": "http://hl7.org/fhir/StructureDefinition/cqf-scope",
      "valueString": "@mii-termserv/hl7.fhir.r4b.terminology"
    }
  ],
  "url": "http://terminology.hl7.org/CodeSystem/service-provision-conditions",
  "identifier": [
    {
      "system": "urn:ietf:rfc:3986",
      "value": "urn:oid:2.16.840.1.113883.4.642.4.1143"
    }
  ],
  "version": "4.3.0",
  "name": "ServiceProvisionConditions",
  "title": "ServiceProvisionConditions",
  "status": "draft",
  "experimental": false,
  "date": "2021-01-17T07:06:13+11:00",
  "publisher": "HL7 (FHIR Project)",
  "contact": [
    {
      "telecom": [
        {
          "system": "url",
          "value": "http://hl7.org/fhir"
        },
        {
          "system": "email",
          "value": "fhir@lists.hl7.org"
        }
      ]
    }
  ],
  "description": "The code(s) that detail the conditions under which the healthcare service is available/offered.",
  "caseSensitive": true,
  "valueSet": "http://hl7.org/fhir/ValueSet/service-provision-conditions",
  "content": "complete",
  "concept": [
    {
      "code": "free",
      "display": "Free",
      "definition": "This service is available for no patient cost."
    },
    {
      "code": "disc",
      "display": "Discounts Available",
      "definition": "There are discounts available on this service for qualifying patients."
    },
    {
      "code": "cost",
      "display": "Fees apply",
      "definition": "Fees apply for this service."
    }
  ]
}