{
  "resourceType": "CodeSystem",
  "id": "fhir.r4b-product-intended-use",
  "meta": {
    "lastUpdated": "2022-05-28T13:47:40.239+11:00",
    "profile": [
      "http://hl7.org/fhir/StructureDefinition/shareablecodesystem"
    ],
    "tag": [
      {
        "system": "https://mii-termserv.de/fhir/su-termserv/CodeSystem/mii-cs-suts-resource-tags-project",
        "code": "hl7",
        "display": "HL7 International"
      },
      {
        "system": "https://mii-termserv.de/fhir/su-termserv/CodeSystem/mii-cs-suts-resource-tags-dataset",
        "code": "hl7-fhir",
        "display": "HL7 FHIR"
      },
      {
        "system": "https://mii-termserv.de/fhir/su-termserv/CodeSystem/mii-cs-suts-resource-tags-license",
        "code": "https://mii-termserv.de/licenses#fhir",
        "display": "HL7 FHIR License"
      }
    ]
  },
  "text": {
    "status": "generated",
    "div": "<div xmlns=\"http://www.w3.org/1999/xhtml\">\n            <p>This code system http://hl7.org/fhir/product-intended-use defines the following codes:</p>\n            <table class=\"codes\">\n              <tr>\n                <td style=\"white-space:nowrap\">\n                  <b>Code</b>\n                </td>\n                <td>\n                  <b>Display</b>\n                </td>\n              </tr>\n              <tr>\n                <td style=\"white-space:nowrap\">Prevention\n                  <a name=\"product-intended-use-Prevention\"> </a>\n                </td>\n                <td>Prevention</td>\n              </tr>\n              <tr>\n                <td style=\"white-space:nowrap\">Treatment\n                  <a name=\"product-intended-use-Treatment\"> </a>\n                </td>\n                <td>Treatment</td>\n              </tr>\n              <tr>\n                <td style=\"white-space:nowrap\">Alleviation\n                  <a name=\"product-intended-use-Alleviation\"> </a>\n                </td>\n                <td>Alleviation</td>\n              </tr>\n              <tr>\n                <td style=\"white-space:nowrap\">Diagnosis\n                  <a name=\"product-intended-use-Diagnosis\"> </a>\n                </td>\n                <td>Diagnosis</td>\n              </tr>\n              <tr>\n                <td style=\"white-space:nowrap\">Monitoring\n                  <a name=\"product-intended-use-Monitoring\"> </a>\n                </td>\n                <td>Monitoring</td>\n              </tr>\n            </table>\n          </div>"
  },
  "extension": [
    {
      "url": "http://hl7.org/fhir/StructureDefinition/structuredefinition-wg",
      "valueCode": "brr"
    },
    {
      "url": "http://hl7.org/fhir/StructureDefinition/structuredefinition-standards-status",
      "valueCode": "trial-use"
    },
    {
      "url": "http://hl7.org/fhir/StructureDefinition/structuredefinition-fmm",
      "valueInteger": 1
    },
    {
      "url": "http://hl7.org/fhir/StructureDefinition/cqf-scope",
      "valueString": "@mii-termserv/hl7.fhir.r4b.terminology"
    }
  ],
  "url": "http://hl7.org/fhir/product-intended-use",
  "identifier": [
    {
      "system": "urn:ietf:rfc:3986",
      "value": "urn:oid:2.16.840.1.113883.4.642.1.1641"
    }
  ],
  "version": "4.3.0",
  "name": "ProductIntendedUse",
  "title": "ProductIntendedUse",
  "status": "draft",
  "experimental": false,
  "date": "2021-01-05T10:01:24+11:00",
  "publisher": "HL7 (FHIR Project)",
  "contact": [
    {
      "telecom": [
        {
          "system": "url",
          "value": "http://hl7.org/fhir"
        },
        {
          "system": "email",
          "value": "fhir@lists.hl7.org"
        }
      ]
    }
  ],
  "caseSensitive": true,
  "valueSet": "http://hl7.org/fhir/ValueSet/product-intended-use",
  "content": "complete",
  "concept": [
    {
      "code": "Prevention",
      "display": "Prevention"
    },
    {
      "code": "Treatment",
      "display": "Treatment"
    },
    {
      "code": "Alleviation",
      "display": "Alleviation"
    },
    {
      "code": "Diagnosis",
      "display": "Diagnosis"
    },
    {
      "code": "Monitoring",
      "display": "Monitoring"
    }
  ]
}