{
  "resourceType": "CodeSystem",
  "id": "fhir.r4b-title-type",
  "meta": {
    "lastUpdated": "2022-05-28T13:47:40.239+11:00",
    "profile": [
      "http://hl7.org/fhir/StructureDefinition/shareablecodesystem"
    ],
    "tag": [
      {
        "system": "https://mii-termserv.de/fhir/su-termserv/CodeSystem/mii-cs-suts-resource-tags-project",
        "code": "hl7",
        "display": "HL7 International"
      },
      {
        "system": "https://mii-termserv.de/fhir/su-termserv/CodeSystem/mii-cs-suts-resource-tags-dataset",
        "code": "hl7-fhir",
        "display": "HL7 FHIR"
      },
      {
        "system": "https://mii-termserv.de/fhir/su-termserv/CodeSystem/mii-cs-suts-resource-tags-license",
        "code": "https://mii-termserv.de/licenses#fhir",
        "display": "HL7 FHIR License"
      }
    ]
  },
  "text": {
    "status": "generated",
    "div": "<div xmlns=\"http://www.w3.org/1999/xhtml\"><h2>TitleType</h2><tt>http://terminology.hl7.org/CodeSystem/title-type</tt><p>Used to express the reason and specific aspect for the variant title, such as language and specific language.</p></div>"
  },
  "extension": [
    {
      "url": "http://hl7.org/fhir/StructureDefinition/structuredefinition-wg",
      "valueCode": "cds"
    },
    {
      "url": "http://hl7.org/fhir/StructureDefinition/structuredefinition-standards-status",
      "valueCode": "trial-use"
    },
    {
      "url": "http://hl7.org/fhir/StructureDefinition/structuredefinition-fmm",
      "valueInteger": 0
    },
    {
      "url": "http://hl7.org/fhir/StructureDefinition/cqf-scope",
      "valueString": "@mii-termserv/hl7.fhir.r4b.terminology"
    }
  ],
  "url": "http://terminology.hl7.org/CodeSystem/title-type",
  "identifier": [
    {
      "system": "urn:ietf:rfc:3986",
      "value": "urn:oid:2.16.840.1.113883.4.642.1.1492"
    }
  ],
  "version": "4.3.0",
  "name": "TitleType",
  "title": "TitleType",
  "status": "draft",
  "experimental": false,
  "date": "2020-12-28T16:55:11+11:00",
  "publisher": "HL7 (FHIR Project)",
  "contact": [
    {
      "telecom": [
        {
          "system": "url",
          "value": "http://hl7.org/fhir"
        },
        {
          "system": "email",
          "value": "fhir@lists.hl7.org"
        }
      ]
    }
  ],
  "description": "Used to express the reason and specific aspect for the variant title, such as language and specific language.",
  "caseSensitive": true,
  "valueSet": "http://hl7.org/fhir/ValueSet/title-type",
  "content": "complete",
  "concept": [
    {
      "code": "primary",
      "display": "Primary title",
      "definition": "Main title for common use. The primary title used for representation if multiple titles exist."
    },
    {
      "code": "official",
      "display": "Official title",
      "definition": "The official or authoritative title."
    },
    {
      "code": "scientific",
      "display": "Scientific title",
      "definition": "Title using scientific terminology."
    },
    {
      "code": "plain-language",
      "display": "Plain language title",
      "definition": "Title using language common to lay public discourse."
    },
    {
      "code": "subtitle",
      "display": "Subtitle",
      "definition": "Subtitle or secondary title."
    },
    {
      "code": "short-title",
      "display": "Short title",
      "definition": "Brief title (e.g. 'running title' or title used in page headers)"
    },
    {
      "code": "acronym",
      "display": "Acronym",
      "definition": "Abbreviation used as title"
    },
    {
      "code": "earlier-title",
      "display": "Different text in an earlier version",
      "definition": "Alternative form of title in an earlier version such as epub ahead of print."
    },
    {
      "code": "language",
      "display": "Different language",
      "definition": "Additional form of title in a different language."
    },
    {
      "code": "autotranslated",
      "display": "Different language derived from autotranslation",
      "definition": "Machine translated form of title in a different language, language element codes the language into which it was translated by machine."
    },
    {
      "code": "human-use",
      "display": "Human use",
      "definition": "Human-friendly title"
    },
    {
      "code": "machine-use",
      "display": "Machine use",
      "definition": "Machine-friendly title"
    },
    {
      "code": "duplicate-uid",
      "display": "Different text for the same object with a different identifier",
      "definition": "An alternative form of the title in two or more entries, e.g. in multiple medline entries"
    }
  ]
}