{
  "resourceType": "CodeSystem",
  "id": "fhir.r4b-immunization-subpotent-reason",
  "meta": {
    "lastUpdated": "2022-05-28T12:47:40.239+10:00",
    "profile": [
      "http://hl7.org/fhir/StructureDefinition/shareablecodesystem"
    ],
    "tag": [
      {
        "system": "https://mii-termserv.de/fhir/su-termserv/CodeSystem/mii-cs-suts-resource-tags-project",
        "code": "hl7",
        "display": "HL7 International"
      },
      {
        "system": "https://mii-termserv.de/fhir/su-termserv/CodeSystem/mii-cs-suts-resource-tags-dataset",
        "code": "hl7-fhir",
        "display": "HL7 FHIR"
      },
      {
        "system": "https://mii-termserv.de/fhir/su-termserv/CodeSystem/mii-cs-suts-resource-tags-license",
        "code": "https://mii-termserv.de/licenses#fhir",
        "display": "HL7 FHIR License"
      }
    ]
  },
  "text": {
    "status": "generated",
    "div": "<div xmlns=\"http://www.w3.org/1999/xhtml\"><h2>Immunization Event Subpotent Reason</h2><tt>http://terminology.hl7.org/CodeSystem/immunization-subpotent-reason</tt><p>This code system supports describing the reason why a dose is considered to be subpotent.</p></div>"
  },
  "extension": [
    {
      "url": "http://hl7.org/fhir/StructureDefinition/structuredefinition-wg",
      "valueCode": "pher"
    },
    {
      "url": "http://hl7.org/fhir/StructureDefinition/cqf-scope",
      "valueString": "@mii-termserv/hl7.fhir.r4b.terminology"
    }
  ],
  "url": "http://terminology.hl7.org/CodeSystem/immunization-subpotent-reason",
  "identifier": [
    {
      "system": "urn:ietf:rfc:3986",
      "value": "urn:oid:2.16.840.1.113883.4.642.1.1098"
    }
  ],
  "version": "4.3.0",
  "name": "ImmunizationEventSubpotentReason",
  "title": "Immunization Event Subpotent Reason",
  "status": "draft",
  "experimental": false,
  "description": "This code system supports describing the reason why a dose is considered to be subpotent.",
  "caseSensitive": true,
  "content": "complete",
  "concept": [
    {
      "code": "partial",
      "display": "Partial Dose",
      "definition": "The full volume of the dose was not administered to the patient."
    },
    {
      "code": "coldchainbreak",
      "display": "Cold Chain Break",
      "definition": "The vaccine experienced a cold chain break."
    },
    {
      "code": "recall",
      "display": "Manufacturer Recall",
      "definition": "The vaccine was recalled by the manufacturer."
    }
  ]
}