{
  "resourceType": "CodeSystem",
  "id": "fhir.r4b-medicinal-product-cross-reference-type",
  "meta": {
    "lastUpdated": "2022-05-28T13:47:40.239+11:00",
    "profile": [
      "http://hl7.org/fhir/StructureDefinition/shareablecodesystem"
    ],
    "tag": [
      {
        "system": "https://mii-termserv.de/fhir/su-termserv/CodeSystem/mii-cs-suts-resource-tags-project",
        "code": "hl7",
        "display": "HL7 International"
      },
      {
        "system": "https://mii-termserv.de/fhir/su-termserv/CodeSystem/mii-cs-suts-resource-tags-dataset",
        "code": "hl7-fhir",
        "display": "HL7 FHIR"
      },
      {
        "system": "https://mii-termserv.de/fhir/su-termserv/CodeSystem/mii-cs-suts-resource-tags-license",
        "code": "https://mii-termserv.de/licenses#fhir",
        "display": "HL7 FHIR License"
      }
    ]
  },
  "text": {
    "status": "generated",
    "div": "<div xmlns=\"http://www.w3.org/1999/xhtml\"><h2>ProductCrossReferenceType</h2><tt>http://hl7.org/fhir/medicinal-product-cross-reference-type</tt><p>Relationship to another Medicinal Product.</p></div>"
  },
  "extension": [
    {
      "url": "http://hl7.org/fhir/StructureDefinition/structuredefinition-wg",
      "valueCode": "brr"
    },
    {
      "url": "http://hl7.org/fhir/StructureDefinition/structuredefinition-standards-status",
      "valueCode": "trial-use"
    },
    {
      "url": "http://hl7.org/fhir/StructureDefinition/structuredefinition-fmm",
      "valueInteger": 1
    },
    {
      "url": "http://hl7.org/fhir/StructureDefinition/cqf-scope",
      "valueString": "@mii-termserv/hl7.fhir.r4b.terminology"
    }
  ],
  "url": "http://hl7.org/fhir/medicinal-product-cross-reference-type",
  "identifier": [
    {
      "system": "urn:ietf:rfc:3986",
      "value": "urn:oid:2.16.840.1.113883.4.642.1.1569"
    }
  ],
  "version": "4.3.0",
  "name": "ProductCrossReferenceType",
  "title": "ProductCrossReferenceType",
  "status": "draft",
  "experimental": false,
  "date": "2021-01-05T10:01:24+11:00",
  "publisher": "HL7 (FHIR Project)",
  "contact": [
    {
      "telecom": [
        {
          "system": "url",
          "value": "http://hl7.org/fhir"
        },
        {
          "system": "email",
          "value": "fhir@lists.hl7.org"
        }
      ]
    }
  ],
  "description": "Relationship to another Medicinal Product.",
  "caseSensitive": true,
  "valueSet": "http://hl7.org/fhir/ValueSet/medicinal-product-cross-reference-type",
  "content": "complete",
  "concept": [
    {
      "code": "InvestigationalProduct",
      "display": "Link to Investigational Product",
      "definition": "Link to Investigational (Development) Product"
    },
    {
      "code": "VirtualProduct",
      "display": "Link Actual to Virtual Product",
      "definition": "Link Actual to Virtual Product"
    },
    {
      "code": "ActualProduct",
      "display": "Link Virtual to Actual Product",
      "definition": "Link Virtual to Actual Product"
    },
    {
      "code": "BrandedProduct",
      "display": "Link Generic to Branded Product",
      "definition": "Link Generic to Branded Product"
    },
    {
      "code": "GenericProduct",
      "display": "Link Branded to Generic Product",
      "definition": "Link Branded to Generic Product"
    },
    {
      "code": "Parallel",
      "display": "Link to Parallel Import Product",
      "definition": "Link to Parallel Import Product"
    }
  ]
}