{
  "resourceType": "CodeSystem",
  "id": "fhir.r4b-adverse-event-seriousness",
  "meta": {
    "lastUpdated": "2022-05-28T13:47:40.239+11:00",
    "profile": [
      "http://hl7.org/fhir/StructureDefinition/shareablecodesystem"
    ],
    "tag": [
      {
        "system": "https://mii-termserv.de/fhir/su-termserv/CodeSystem/mii-cs-suts-resource-tags-project",
        "code": "hl7",
        "display": "HL7 International"
      },
      {
        "system": "https://mii-termserv.de/fhir/su-termserv/CodeSystem/mii-cs-suts-resource-tags-dataset",
        "code": "hl7-fhir",
        "display": "HL7 FHIR"
      },
      {
        "system": "https://mii-termserv.de/fhir/su-termserv/CodeSystem/mii-cs-suts-resource-tags-license",
        "code": "https://mii-termserv.de/licenses#fhir",
        "display": "HL7 FHIR License"
      }
    ]
  },
  "text": {
    "status": "generated",
    "div": "<div xmlns=\"http://www.w3.org/1999/xhtml\"><h2>AdverseEventSeriousness</h2><tt>http://terminology.hl7.org/CodeSystem/adverse-event-seriousness</tt><p>Overall seriousness of this event for the patient.</p></div>"
  },
  "extension": [
    {
      "url": "http://hl7.org/fhir/StructureDefinition/structuredefinition-wg",
      "valueCode": "pc"
    },
    {
      "url": "http://hl7.org/fhir/StructureDefinition/structuredefinition-standards-status",
      "valueCode": "draft"
    },
    {
      "url": "http://hl7.org/fhir/StructureDefinition/structuredefinition-fmm",
      "valueInteger": 1
    },
    {
      "url": "http://hl7.org/fhir/StructureDefinition/cqf-scope",
      "valueString": "@mii-termserv/hl7.fhir.r4b.terminology"
    }
  ],
  "url": "http://terminology.hl7.org/CodeSystem/adverse-event-seriousness",
  "identifier": [
    {
      "system": "urn:ietf:rfc:3986",
      "value": "urn:oid:2.16.840.1.113883.4.642.4.1253"
    }
  ],
  "version": "4.3.0",
  "name": "AdverseEventSeriousness",
  "title": "AdverseEventSeriousness",
  "status": "draft",
  "experimental": false,
  "date": "2021-01-17T07:06:13+11:00",
  "publisher": "HL7 (FHIR Project)",
  "contact": [
    {
      "telecom": [
        {
          "system": "url",
          "value": "http://hl7.org/fhir"
        },
        {
          "system": "email",
          "value": "fhir@lists.hl7.org"
        }
      ]
    }
  ],
  "description": "Overall seriousness of this event for the patient.",
  "caseSensitive": true,
  "valueSet": "http://hl7.org/fhir/ValueSet/adverse-event-seriousness",
  "hierarchyMeaning": "is-a",
  "content": "complete",
  "concept": [
    {
      "code": "Non-serious",
      "display": "Non-serious",
      "definition": "Non-serious."
    },
    {
      "code": "Serious",
      "display": "Serious",
      "definition": "Serious.",
      "concept": [
        {
          "code": "SeriousResultsInDeath",
          "display": "Results in death",
          "definition": "Results in death."
        },
        {
          "code": "SeriousIsLifeThreatening",
          "display": "Is Life-threatening",
          "definition": "Is Life-threatening."
        },
        {
          "code": "SeriousResultsInHospitalization",
          "display": "Requires or prolongs inpatient hospitalization",
          "definition": "Requires inpatient hospitalization or causes prolongation of existing hospitalization."
        },
        {
          "code": "SeriousResultsInDisability",
          "display": "Results in persistent or significant disability/incapacity",
          "definition": "Results in persistent or significant disability/incapacity."
        },
        {
          "code": "SeriousIsBirthDefect",
          "display": "Is a congenital anomaly/birth defect",
          "definition": "Is a congenital anomaly/birth defect."
        },
        {
          "code": "SeriousRequiresPreventImpairment",
          "display": "Requires intervention to prevent permanent impairment",
          "definition": "Requires intervention to prevent permanent impairment or damage (i.e., an important medical event that requires medical judgement)."
        }
      ]
    }
  ]
}