{
  "resourceType": "ConceptMap",
  "id": "fhir.r4b-sc-contract-publicationstatus",
  "text": {
    "status": "generated",
    "div": "<div xmlns=\"http://www.w3.org/1999/xhtml\"><h2>Canonical Mapping for \"Contract Resource Publication Status codes\"</h2><tt>http://hl7.org/fhir/ConceptMap/sc-contract-publicationstatus</tt><p>Canonical Mapping for \"This value set contract specific codes for status.\"</p></div>"
  },
  "url": "http://hl7.org/fhir/ConceptMap/sc-contract-publicationstatus",
  "version": "4.3.0",
  "name": "ContractResourcePublicationStatusCodesCanonicalMap",
  "title": "Canonical Mapping for \"Contract Resource Publication Status codes\"",
  "status": "draft",
  "experimental": false,
  "publisher": "Financial Management",
  "contact": [
    {
      "telecom": [
        {
          "system": "url",
          "value": "http://hl7.org/fhir"
        }
      ]
    }
  ],
  "description": "Canonical Mapping for \"This value set contract specific codes for status.\"",
  "sourceCanonical": "http://hl7.org/fhir/ValueSet/contract-publicationstatus",
  "targetCanonical": "http://hl7.org/fhir/ValueSet/resource-status",
  "group": [
    {
      "source": "http://hl7.org/fhir/contract-publicationstatus",
      "target": "http://hl7.org/fhir/resource-status",
      "element": [
        {
          "code": "entered-in-error",
          "target": [
            {
              "code": "error",
              "equivalence": "equivalent"
            }
          ]
        },
        {
          "code": "offered",
          "target": [
            {
              "code": "proposed",
              "equivalence": "equivalent"
            }
          ]
        },
        {
          "code": "negotiable,policy",
          "target": [
            {
              "code": "draft",
              "equivalence": "equivalent"
            }
          ]
        },
        {
          "code": "executable,resolved",
          "target": [
            {
              "code": "active",
              "equivalence": "equivalent"
            }
          ]
        },
        {
          "code": "disputed",
          "target": [
            {
              "code": "suspended",
              "equivalence": "equivalent"
            }
          ]
        },
        {
          "code": "revoked",
          "target": [
            {
              "code": "failed",
              "equivalence": "equivalent"
            }
          ]
        },
        {
          "code": "amended,appended,renewed",
          "target": [
            {
              "code": "replaced",
              "equivalence": "equivalent"
            }
          ]
        },
        {
          "code": "executed",
          "target": [
            {
              "code": "complete",
              "equivalence": "equivalent"
            }
          ]
        },
        {
          "code": "cancelled,rejected,terminated",
          "target": [
            {
              "code": "abandoned",
              "equivalence": "equivalent"
            }
          ]
        }
      ]
    }
  ],
  "meta": {
    "tag": [
      {
        "system": "https://mii-termserv.de/fhir/su-termserv/CodeSystem/mii-cs-suts-resource-tags-project",
        "code": "hl7",
        "display": "HL7 International"
      },
      {
        "system": "https://mii-termserv.de/fhir/su-termserv/CodeSystem/mii-cs-suts-resource-tags-dataset",
        "code": "hl7-fhir",
        "display": "HL7 FHIR"
      },
      {
        "system": "https://mii-termserv.de/fhir/su-termserv/CodeSystem/mii-cs-suts-resource-tags-license",
        "code": "https://mii-termserv.de/licenses#fhir",
        "display": "HL7 FHIR License"
      }
    ]
  },
  "extension": [
    {
      "url": "http://hl7.org/fhir/StructureDefinition/cqf-scope",
      "valueString": "@mii-termserv/hl7.fhir.r4b.terminology"
    }
  ]
}