{
  "resourceType": "CodeSystem",
  "id": "fhir.r4b-medication-admin-status",
  "meta": {
    "lastUpdated": "2022-05-28T12:47:40.239+10:00",
    "profile": [
      "http://hl7.org/fhir/StructureDefinition/shareablecodesystem"
    ],
    "tag": [
      {
        "system": "https://mii-termserv.de/fhir/su-termserv/CodeSystem/mii-cs-suts-resource-tags-project",
        "code": "hl7",
        "display": "HL7 International"
      },
      {
        "system": "https://mii-termserv.de/fhir/su-termserv/CodeSystem/mii-cs-suts-resource-tags-dataset",
        "code": "hl7-fhir",
        "display": "HL7 FHIR"
      },
      {
        "system": "https://mii-termserv.de/fhir/su-termserv/CodeSystem/mii-cs-suts-resource-tags-license",
        "code": "https://mii-termserv.de/licenses#fhir",
        "display": "HL7 FHIR License"
      }
    ]
  },
  "text": {
    "status": "generated",
    "div": "<div xmlns=\"http://www.w3.org/1999/xhtml\">\n            <p>This code system http://terminology.hl7.org/CodeSystem/medication-admin-status defines the following codes:</p>\n            <table class=\"codes\">\n              <tr>\n                <td style=\"white-space:nowrap\">\n                  <b>Code</b>\n                </td>\n                <td>\n                  <b>Display</b>\n                </td>\n                <td>\n                  <b>Definition</b>\n                </td>\n              </tr>\n              <tr>\n                <td style=\"white-space:nowrap\">in-progress\n                  <a name=\"medication-admin-status-in-progress\"> </a>\n                </td>\n                <td>In Progress</td>\n                <td>The administration has started but has not yet completed.</td>\n              </tr>\n              <tr>\n                <td style=\"white-space:nowrap\">not-done\n                  <a name=\"medication-admin-status-not-done\"> </a>\n                </td>\n                <td>Not Done</td>\n                <td>The administration was terminated prior to any impact on the subject (though preparatory actions may have been taken)</td>\n              </tr>\n              <tr>\n                <td style=\"white-space:nowrap\">on-hold\n                  <a name=\"medication-admin-status-on-hold\"> </a>\n                </td>\n                <td>On Hold</td>\n                <td>Actions implied by the administration have been temporarily halted, but are expected to continue later. May also be called 'suspended'.</td>\n              </tr>\n              <tr>\n                <td style=\"white-space:nowrap\">completed\n                  <a name=\"medication-admin-status-completed\"> </a>\n                </td>\n                <td>Completed</td>\n                <td>All actions that are implied by the administration have occurred.</td>\n              </tr>\n              <tr>\n                <td style=\"white-space:nowrap\">entered-in-error\n                  <a name=\"medication-admin-status-entered-in-error\"> </a>\n                </td>\n                <td>Entered in Error</td>\n                <td>The administration was entered in error and therefore nullified.</td>\n              </tr>\n              <tr>\n                <td style=\"white-space:nowrap\">stopped\n                  <a name=\"medication-admin-status-stopped\"> </a>\n                </td>\n                <td>Stopped</td>\n                <td>Actions implied by the administration have been permanently halted, before all of them occurred.</td>\n              </tr>\n              <tr>\n                <td style=\"white-space:nowrap\">unknown\n                  <a name=\"medication-admin-status-unknown\"> </a>\n                </td>\n                <td>Unknown</td>\n                <td>The authoring system does not know which of the status values currently applies for this request. Note: This concept is not to be used for 'other' - one of the listed statuses is presumed to apply, it's just not known which one.</td>\n              </tr>\n            </table>\n          </div>"
  },
  "extension": [
    {
      "url": "http://hl7.org/fhir/StructureDefinition/structuredefinition-wg",
      "valueCode": "phx"
    },
    {
      "url": "http://hl7.org/fhir/StructureDefinition/cqf-scope",
      "valueString": "@mii-termserv/hl7.fhir.r4b.terminology"
    }
  ],
  "url": "http://terminology.hl7.org/CodeSystem/medication-admin-status",
  "identifier": [
    {
      "system": "urn:ietf:rfc:3986",
      "value": "urn:oid:2.16.840.1.113883.4.642.1.1311"
    }
  ],
  "version": "4.3.0",
  "name": "MedicationAdministration Status Codes",
  "status": "draft",
  "experimental": false,
  "caseSensitive": true,
  "valueSet": "http://hl7.org/fhir/ValueSet/medication-admin-status",
  "content": "complete",
  "concept": [
    {
      "code": "in-progress",
      "display": "In Progress",
      "definition": "The administration has started but has not yet completed."
    },
    {
      "code": "not-done",
      "display": "Not Done",
      "definition": "The administration was terminated prior to any impact on the subject (though preparatory actions may have been taken)"
    },
    {
      "code": "on-hold",
      "display": "On Hold",
      "definition": "Actions implied by the administration have been temporarily halted, but are expected to continue later. May also be called 'suspended'."
    },
    {
      "code": "completed",
      "display": "Completed",
      "definition": "All actions that are implied by the administration have occurred."
    },
    {
      "code": "entered-in-error",
      "display": "Entered in Error",
      "definition": "The administration was entered in error and therefore nullified."
    },
    {
      "code": "stopped",
      "display": "Stopped",
      "definition": "Actions implied by the administration have been permanently halted, before all of them occurred."
    },
    {
      "code": "unknown",
      "display": "Unknown",
      "definition": "The authoring system does not know which of the status values currently applies for this request. Note: This concept is not to be used for 'other' - one of the listed statuses is presumed to apply, it's just not known which one."
    }
  ]
}