{
  "resourceType": "ValueSet",
  "id": "fhir.r4b-performer-function",
  "meta": {
    "lastUpdated": "2022-05-28T12:47:40.239+10:00",
    "tag": [
      {
        "system": "https://mii-termserv.de/fhir/su-termserv/CodeSystem/mii-cs-suts-resource-tags-project",
        "code": "hl7",
        "display": "HL7 International"
      },
      {
        "system": "https://mii-termserv.de/fhir/su-termserv/CodeSystem/mii-cs-suts-resource-tags-dataset",
        "code": "hl7-fhir",
        "display": "HL7 FHIR"
      },
      {
        "system": "https://mii-termserv.de/fhir/su-termserv/CodeSystem/mii-cs-suts-resource-tags-license",
        "code": "https://mii-termserv.de/licenses#fhir",
        "display": "HL7 FHIR License"
      }
    ]
  },
  "text": {
    "status": "generated",
    "div": "<div xmlns=\"http://www.w3.org/1999/xhtml\"><h2>Performer Function Codes</h2><tt>http://hl7.org/fhir/ValueSet/performer-function</tt><p>The types of involvement of the performer in the Event.</p></div>"
  },
  "url": "http://hl7.org/fhir/ValueSet/performer-function",
  "version": "4.3.0",
  "name": "Performer Function Codes",
  "status": "draft",
  "experimental": false,
  "publisher": "HL7 International - Orders and Observations WG",
  "contact": [
    {
      "telecom": [
        {
          "system": "url",
          "value": "http://www.hl7.org/Special/committees/orders/index.cfm"
        }
      ]
    }
  ],
  "description": "The types of involvement of the performer in the Event.",
  "compose": {
    "include": [
      {
        "system": "http://terminology.hl7.org/CodeSystem/v3-ParticipationType",
        "concept": [
          {
            "code": "TRANS"
          },
          {
            "code": "PART"
          },
          {
            "code": "ATND"
          },
          {
            "code": "CON"
          },
          {
            "code": "AUT"
          },
          {
            "code": "INF"
          },
          {
            "code": "ENT"
          },
          {
            "code": "WIT"
          },
          {
            "code": "PPRF"
          },
          {
            "code": "SPRF"
          },
          {
            "code": "RESP"
          },
          {
            "code": "VRF"
          },
          {
            "code": "AUTHEN"
          },
          {
            "code": "LA"
          }
        ]
      }
    ]
  },
  "title": "Performer Function Codes",
  "extension": [
    {
      "url": "http://hl7.org/fhir/StructureDefinition/cqf-scope",
      "valueString": "@mii-termserv/hl7.fhir.r4b.terminology"
    }
  ]
}