{
  "contact": [
    {
      "telecom": [
        {
          "system": "url",
          "value": "http://hl7.org/fhir"
        },
        {
          "system": "email",
          "value": "fhir@lists.hl7.org"
        }
      ]
    }
  ],
  "date": "2021-01-17T07:06:13+11:00",
  "description": "Canonical Mapping for \"Indicates whether the account is available to be used.\"",
  "experimental": false,
  "group": [
    {
      "element": [
        {
          "code": "entered-in-error",
          "target": [
            {
              "code": "error",
              "equivalence": "equivalent"
            }
          ]
        },
        {
          "code": "active",
          "target": [
            {
              "code": "active",
              "equivalence": "equivalent"
            }
          ]
        },
        {
          "code": "on-hold",
          "target": [
            {
              "code": "suspended",
              "equivalence": "equivalent"
            }
          ]
        },
        {
          "code": "inactive",
          "target": [
            {
              "code": "inactive",
              "equivalence": "equivalent"
            }
          ]
        },
        {
          "code": "unknown",
          "target": [
            {
              "code": "unknown",
              "equivalence": "equivalent"
            }
          ]
        }
      ],
      "source": "http://hl7.org/fhir/account-status",
      "target": "http://hl7.org/fhir/resource-status"
    }
  ],
  "id": "fhir.r4b-sc-account-status",
  "name": "AccountStatusCanonicalMap",
  "publisher": "HL7 (FHIR Project)",
  "resourceType": "ConceptMap",
  "sourceCanonical": "http://hl7.org/fhir/ValueSet/account-status",
  "status": "draft",
  "targetCanonical": "http://hl7.org/fhir/ValueSet/resource-status",
  "text": {
    "status": "generated",
    "div": "<div xmlns=\"http://www.w3.org/1999/xhtml\"><h2>Canonical Mapping for \"AccountStatus\"</h2><tt>http://hl7.org/fhir/ConceptMap/sc-account-status</tt><p>Canonical Mapping for \"Indicates whether the account is available to be used.\"</p></div>"
  },
  "title": "Canonical Mapping for \"AccountStatus\"",
  "url": "http://hl7.org/fhir/ConceptMap/sc-account-status",
  "version": "4.3.0",
  "meta": {
    "tag": [
      {
        "system": "https://mii-termserv.de/fhir/su-termserv/CodeSystem/mii-cs-suts-resource-tags-project",
        "code": "hl7",
        "display": "HL7 International"
      },
      {
        "system": "https://mii-termserv.de/fhir/su-termserv/CodeSystem/mii-cs-suts-resource-tags-dataset",
        "code": "hl7-fhir",
        "display": "HL7 FHIR"
      },
      {
        "system": "https://mii-termserv.de/fhir/su-termserv/CodeSystem/mii-cs-suts-resource-tags-license",
        "code": "https://mii-termserv.de/licenses#fhir",
        "display": "HL7 FHIR License"
      }
    ]
  },
  "extension": [
    {
      "url": "http://hl7.org/fhir/StructureDefinition/cqf-scope",
      "valueString": "@mii-termserv/hl7.fhir.r4b.terminology"
    }
  ]
}