{
  "resourceType": "ConceptMap",
  "id": "fhir.r4b-sc-research-subject-status",
  "text": {
    "status": "generated",
    "div": "<div xmlns=\"http://www.w3.org/1999/xhtml\"><h2>Canonical Mapping for \"ResearchSubjectStatus\"</h2><tt>http://hl7.org/fhir/ConceptMap/sc-research-subject-status</tt><p>Canonical Mapping for \"Indicates the progression of a study subject through a study.\"</p></div>"
  },
  "url": "http://hl7.org/fhir/ConceptMap/sc-research-subject-status",
  "version": "4.3.0",
  "name": "ResearchSubjectStatusCanonicalMap",
  "title": "Canonical Mapping for \"ResearchSubjectStatus\"",
  "status": "draft",
  "experimental": false,
  "date": "2021-01-17T07:06:13+11:00",
  "publisher": "HL7 (FHIR Project)",
  "contact": [
    {
      "telecom": [
        {
          "system": "url",
          "value": "http://hl7.org/fhir"
        },
        {
          "system": "email",
          "value": "fhir@lists.hl7.org"
        }
      ]
    }
  ],
  "description": "Canonical Mapping for \"Indicates the progression of a study subject through a study.\"",
  "sourceCanonical": "http://hl7.org/fhir/ValueSet/research-subject-status",
  "targetCanonical": "http://hl7.org/fhir/ValueSet/resource-status",
  "group": [
    {
      "source": "http://hl7.org/fhir/research-subject-status",
      "target": "http://hl7.org/fhir/resource-status",
      "element": [
        {
          "code": "candidate, screening, eligible, potential-candidate",
          "target": [
            {
              "code": "draft",
              "equivalence": "equivalent"
            }
          ]
        },
        {
          "code": "ineligible",
          "target": [
            {
              "code": "declined",
              "equivalence": "equivalent"
            }
          ]
        },
        {
          "code": "on-study, on-study-intervention, on-study-observation",
          "target": [
            {
              "code": "active",
              "equivalence": "equivalent"
            }
          ]
        },
        {
          "code": "pending-on-study",
          "target": [
            {
              "code": "suspended",
              "equivalence": "equivalent"
            }
          ]
        },
        {
          "code": "withdrawn",
          "target": [
            {
              "code": "failed",
              "equivalence": "equivalent"
            }
          ]
        },
        {
          "code": "follow-up",
          "target": [
            {
              "code": "replaced",
              "equivalence": "equivalent"
            }
          ]
        },
        {
          "code": "off-study",
          "target": [
            {
              "code": "complete",
              "equivalence": "equivalent"
            }
          ]
        },
        {
          "code": "not-registered",
          "target": [
            {
              "code": "abandoned",
              "equivalence": "equivalent"
            }
          ]
        }
      ]
    }
  ],
  "meta": {
    "tag": [
      {
        "system": "https://mii-termserv.de/fhir/su-termserv/CodeSystem/mii-cs-suts-resource-tags-project",
        "code": "hl7",
        "display": "HL7 International"
      },
      {
        "system": "https://mii-termserv.de/fhir/su-termserv/CodeSystem/mii-cs-suts-resource-tags-dataset",
        "code": "hl7-fhir",
        "display": "HL7 FHIR"
      },
      {
        "system": "https://mii-termserv.de/fhir/su-termserv/CodeSystem/mii-cs-suts-resource-tags-license",
        "code": "https://mii-termserv.de/licenses#fhir",
        "display": "HL7 FHIR License"
      }
    ]
  },
  "extension": [
    {
      "url": "http://hl7.org/fhir/StructureDefinition/cqf-scope",
      "valueString": "@mii-termserv/hl7.fhir.r4b.terminology"
    }
  ]
}