{
  "resourceType": "CodeSystem",
  "id": "fhir.r4b-packaging-type",
  "meta": {
    "lastUpdated": "2022-05-28T13:47:40.239+11:00",
    "profile": [
      "http://hl7.org/fhir/StructureDefinition/shareablecodesystem"
    ],
    "tag": [
      {
        "system": "https://mii-termserv.de/fhir/su-termserv/CodeSystem/mii-cs-suts-resource-tags-project",
        "code": "hl7",
        "display": "HL7 International"
      },
      {
        "system": "https://mii-termserv.de/fhir/su-termserv/CodeSystem/mii-cs-suts-resource-tags-dataset",
        "code": "hl7-fhir",
        "display": "HL7 FHIR"
      },
      {
        "system": "https://mii-termserv.de/fhir/su-termserv/CodeSystem/mii-cs-suts-resource-tags-license",
        "code": "https://mii-termserv.de/licenses#fhir",
        "display": "HL7 FHIR License"
      }
    ]
  },
  "text": {
    "status": "generated",
    "div": "<div xmlns=\"http://www.w3.org/1999/xhtml\"><h2>PackagingType</h2><tt>http://hl7.org/fhir/packaging-type</tt><p>A type of packaging.</p></div>"
  },
  "extension": [
    {
      "url": "http://hl7.org/fhir/StructureDefinition/structuredefinition-wg",
      "valueCode": "brr"
    },
    {
      "url": "http://hl7.org/fhir/StructureDefinition/structuredefinition-standards-status",
      "valueCode": "trial-use"
    },
    {
      "url": "http://hl7.org/fhir/StructureDefinition/structuredefinition-fmm",
      "valueInteger": 1
    },
    {
      "url": "http://hl7.org/fhir/StructureDefinition/cqf-scope",
      "valueString": "@mii-termserv/hl7.fhir.r4b.terminology"
    }
  ],
  "url": "http://hl7.org/fhir/packaging-type",
  "identifier": [
    {
      "system": "urn:ietf:rfc:3986",
      "value": "urn:oid:2.16.840.1.113883.4.642.1.1679"
    }
  ],
  "version": "4.3.0",
  "name": "PackagingType",
  "title": "PackagingType",
  "status": "draft",
  "experimental": false,
  "date": "2021-01-05T10:01:24+11:00",
  "publisher": "HL7 (FHIR Project)",
  "contact": [
    {
      "telecom": [
        {
          "system": "url",
          "value": "http://hl7.org/fhir"
        },
        {
          "system": "email",
          "value": "fhir@lists.hl7.org"
        }
      ]
    }
  ],
  "description": "A type of packaging.",
  "caseSensitive": true,
  "valueSet": "http://hl7.org/fhir/ValueSet/packaging-type",
  "content": "complete",
  "concept": [
    {
      "code": "100000073490",
      "display": "Ampoule"
    },
    {
      "code": "100000073491",
      "display": "Applicator"
    },
    {
      "code": "100000073492",
      "display": "Automatic injection device"
    },
    {
      "code": "100000073493",
      "display": "Bag"
    },
    {
      "code": "100000073494",
      "display": "Balling gun"
    },
    {
      "code": "100000073495",
      "display": "Barrel"
    },
    {
      "code": "100000073496",
      "display": "Blister"
    },
    {
      "code": "100000073497",
      "display": "Bottle"
    },
    {
      "code": "100000073498",
      "display": "Box"
    },
    {
      "code": "100000073499",
      "display": "Brush"
    },
    {
      "code": "100000073500",
      "display": "Brush applicator"
    },
    {
      "code": "100000073501",
      "display": "Cannula"
    },
    {
      "code": "100000073502",
      "display": "Cap"
    },
    {
      "code": "100000073503",
      "display": "Cartridge"
    },
    {
      "code": "100000073504",
      "display": "Child-resistant closure"
    },
    {
      "code": "100000073505",
      "display": "Cup"
    },
    {
      "code": "100000073506",
      "display": "Dabbing applicator"
    },
    {
      "code": "100000073507",
      "display": "Dart"
    },
    {
      "code": "100000073508",
      "display": "Dredging applicator"
    },
    {
      "code": "100000073509",
      "display": "Dredging container"
    },
    {
      "code": "100000073510",
      "display": "Drench gun"
    },
    {
      "code": "100000073511",
      "display": "Dropper applicator"
    },
    {
      "code": "100000073512",
      "display": "Dropper container"
    },
    {
      "code": "100000073513",
      "display": "Fixed cryogenic vessel"
    },
    {
      "code": "100000073514",
      "display": "Gas cylinder"
    },
    {
      "code": "100000073515",
      "display": "High pressure transdermal delivery device"
    },
    {
      "code": "100000073516",
      "display": "Implanter"
    },
    {
      "code": "100000073517",
      "display": "Inhaler"
    },
    {
      "code": "100000073518",
      "display": "In-ovo injection device"
    },
    {
      "code": "100000073519",
      "display": "Injection needle"
    },
    {
      "code": "100000073520",
      "display": "Injection syringe"
    },
    {
      "code": "100000073521",
      "display": "Internal graduated calibration chamber"
    },
    {
      "code": "100000073522",
      "display": "Intramammary syringe"
    },
    {
      "code": "100000073523",
      "display": "Jar"
    },
    {
      "code": "100000073524",
      "display": "Measuring device"
    },
    {
      "code": "100000073525",
      "display": "Measuring spoon"
    },
    {
      "code": "100000073526",
      "display": "Metering pump"
    },
    {
      "code": "100000073527",
      "display": "Metering valve"
    },
    {
      "code": "100000073528",
      "display": "Mobile cryogenic vessel"
    },
    {
      "code": "100000073529",
      "display": "Mouthpiece"
    },
    {
      "code": "100000073530",
      "display": "Multidose container"
    },
    {
      "code": "100000073531",
      "display": "Multidose container with airless pump"
    },
    {
      "code": "100000073532",
      "display": "Multipuncturer"
    },
    {
      "code": "100000073533",
      "display": "Nasal applicator"
    },
    {
      "code": "100000073534",
      "display": "Nebuliser"
    },
    {
      "code": "100000073535",
      "display": "Needle applicator"
    },
    {
      "code": "100000073536",
      "display": "Nozzle"
    },
    {
      "code": "100000073537",
      "display": "Oral syringe"
    },
    {
      "code": "100000073538",
      "display": "Pipette"
    },
    {
      "code": "100000073539",
      "display": "Pipette applicator"
    },
    {
      "code": "100000073540",
      "display": "Pouch"
    },
    {
      "code": "100000073541",
      "display": "Pour-on container"
    },
    {
      "code": "100000073542",
      "display": "Pre-filled gastroenteral tube"
    },
    {
      "code": "100000073543",
      "display": "Pre-filled pen"
    },
    {
      "code": "100000073544",
      "display": "Pre-filled syringe"
    },
    {
      "code": "100000073545",
      "display": "Pressurised container"
    },
    {
      "code": "100000073546",
      "display": "Prick test applicator"
    },
    {
      "code": "100000073547",
      "display": "Sachet"
    },
    {
      "code": "100000073548",
      "display": "Scarifier"
    },
    {
      "code": "100000073549",
      "display": "Screw cap"
    },
    {
      "code": "100000073550",
      "display": "Single-dose container"
    },
    {
      "code": "100000073551",
      "display": "Spatula"
    },
    {
      "code": "100000073552",
      "display": "Spot-on applicator"
    },
    {
      "code": "100000073553",
      "display": "Spray container"
    },
    {
      "code": "100000073554",
      "display": "Spray pump"
    },
    {
      "code": "100000073555",
      "display": "Spray valve"
    },
    {
      "code": "100000073556",
      "display": "Stab vaccinator"
    },
    {
      "code": "100000073557",
      "display": "Stopper"
    },
    {
      "code": "100000073558",
      "display": "Straw"
    },
    {
      "code": "100000073559",
      "display": "Strip"
    },
    {
      "code": "100000073560",
      "display": "Tablet container"
    },
    {
      "code": "100000073561",
      "display": "Tube"
    },
    {
      "code": "100000073562",
      "display": "Vaginal sponge applicator"
    },
    {
      "code": "100000073563",
      "display": "Vial"
    },
    {
      "code": "100000075664",
      "display": "Administration system"
    },
    {
      "code": "100000116195",
      "display": "Calendar package"
    },
    {
      "code": "100000116196",
      "display": "Needle-free injector"
    },
    {
      "code": "100000116197",
      "display": "Roll-on container"
    },
    {
      "code": "100000125779",
      "display": "Multidose container with pump"
    },
    {
      "code": "100000137702",
      "display": "Container"
    },
    {
      "code": "100000137703",
      "display": "Oral applicator"
    },
    {
      "code": "100000143554",
      "display": "Multidose container with metering pump"
    },
    {
      "code": "100000143555",
      "display": "Pack"
    },
    {
      "code": "100000163233",
      "display": "disk"
    },
    {
      "code": "100000163234",
      "display": "plunger"
    },
    {
      "code": "100000164143",
      "display": "infusion port"
    },
    {
      "code": "100000166980",
      "display": "Valve"
    },
    {
      "code": "100000169899",
      "display": "Jerrycan"
    },
    {
      "code": "100000173982",
      "display": "Oral applicator"
    },
    {
      "code": "100000173983",
      "display": "Dose dispenser"
    },
    {
      "code": "100000174066",
      "display": "Unit-dose blister"
    },
    {
      "code": "100000174067",
      "display": "Pre-filled injector"
    },
    {
      "code": "100000174068",
      "display": "Pre-filled oral syringe"
    },
    {
      "code": "100000174069",
      "display": "Pre-filled oral applicator"
    },
    {
      "code": "100000174070",
      "display": "Dose-dispenser cartridge"
    },
    {
      "code": "200000005068",
      "display": "Pen"
    },
    {
      "code": "200000005585",
      "display": "Wrapper"
    },
    {
      "code": "200000010647",
      "display": "Lid"
    },
    {
      "code": "200000011726",
      "display": "Capsule for opening"
    },
    {
      "code": "200000012539",
      "display": "Child-resistant sachet"
    },
    {
      "code": "200000013191",
      "display": "Tamper-evident closure"
    },
    {
      "code": "200000024874",
      "display": "Tablet tube"
    }
  ]
}