{
  "resourceType": "CodeSystem",
  "id": "fhir.r4b-metric-operational-status",
  "meta": {
    "lastUpdated": "2022-05-28T13:47:40.239+11:00",
    "profile": [
      "http://hl7.org/fhir/StructureDefinition/shareablecodesystem"
    ],
    "tag": [
      {
        "system": "https://mii-termserv.de/fhir/su-termserv/CodeSystem/mii-cs-suts-resource-tags-project",
        "code": "hl7",
        "display": "HL7 International"
      },
      {
        "system": "https://mii-termserv.de/fhir/su-termserv/CodeSystem/mii-cs-suts-resource-tags-dataset",
        "code": "hl7-fhir",
        "display": "HL7 FHIR"
      },
      {
        "system": "https://mii-termserv.de/fhir/su-termserv/CodeSystem/mii-cs-suts-resource-tags-license",
        "code": "https://mii-termserv.de/licenses#fhir",
        "display": "HL7 FHIR License"
      }
    ]
  },
  "text": {
    "status": "generated",
    "div": "<div xmlns=\"http://www.w3.org/1999/xhtml\"><h2>DeviceMetricOperationalStatus</h2><tt>http://hl7.org/fhir/metric-operational-status</tt><p>Describes the operational status of the DeviceMetric.</p></div>"
  },
  "extension": [
    {
      "url": "http://hl7.org/fhir/StructureDefinition/structuredefinition-wg",
      "valueCode": "dev"
    },
    {
      "url": "http://hl7.org/fhir/StructureDefinition/structuredefinition-standards-status",
      "valueCode": "trial-use"
    },
    {
      "url": "http://hl7.org/fhir/StructureDefinition/structuredefinition-fmm",
      "valueInteger": 1
    },
    {
      "url": "http://hl7.org/fhir/StructureDefinition/cqf-scope",
      "valueString": "@mii-termserv/hl7.fhir.r4b.terminology"
    }
  ],
  "url": "http://hl7.org/fhir/metric-operational-status",
  "identifier": [
    {
      "system": "urn:ietf:rfc:3986",
      "value": "urn:oid:2.16.840.1.113883.4.642.4.647"
    }
  ],
  "version": "4.3.0",
  "name": "DeviceMetricOperationalStatus",
  "title": "DeviceMetricOperationalStatus",
  "status": "draft",
  "experimental": false,
  "date": "2021-01-17T07:06:13+11:00",
  "publisher": "HL7 (FHIR Project)",
  "contact": [
    {
      "telecom": [
        {
          "system": "url",
          "value": "http://hl7.org/fhir"
        },
        {
          "system": "email",
          "value": "fhir@lists.hl7.org"
        }
      ]
    }
  ],
  "description": "Describes the operational status of the DeviceMetric.",
  "caseSensitive": true,
  "valueSet": "http://hl7.org/fhir/ValueSet/metric-operational-status",
  "content": "complete",
  "concept": [
    {
      "code": "on",
      "display": "On",
      "definition": "The DeviceMetric is operating and will generate DeviceObservations."
    },
    {
      "code": "off",
      "display": "Off",
      "definition": "The DeviceMetric is not operating."
    },
    {
      "code": "standby",
      "display": "Standby",
      "definition": "The DeviceMetric is operating, but will not generate any DeviceObservations."
    },
    {
      "code": "entered-in-error",
      "display": "Entered In Error",
      "definition": "The DeviceMetric was entered in error."
    }
  ]
}