{
  "resourceType": "CodeSystem",
  "id": "fhir.r4b-report-status-codes",
  "meta": {
    "lastUpdated": "2022-05-28T13:47:40.239+11:00",
    "profile": [
      "http://hl7.org/fhir/StructureDefinition/shareablecodesystem"
    ],
    "tag": [
      {
        "system": "https://mii-termserv.de/fhir/su-termserv/CodeSystem/mii-cs-suts-resource-tags-project",
        "code": "hl7",
        "display": "HL7 International"
      },
      {
        "system": "https://mii-termserv.de/fhir/su-termserv/CodeSystem/mii-cs-suts-resource-tags-dataset",
        "code": "hl7-fhir",
        "display": "HL7 FHIR"
      },
      {
        "system": "https://mii-termserv.de/fhir/su-termserv/CodeSystem/mii-cs-suts-resource-tags-license",
        "code": "https://mii-termserv.de/licenses#fhir",
        "display": "HL7 FHIR License"
      }
    ]
  },
  "text": {
    "status": "generated",
    "div": "<div xmlns=\"http://www.w3.org/1999/xhtml\"><h2>TestReportStatus</h2><tt>http://hl7.org/fhir/report-status-codes</tt><p>The current status of the test report.</p></div>"
  },
  "extension": [
    {
      "url": "http://hl7.org/fhir/StructureDefinition/structuredefinition-wg",
      "valueCode": "fhir"
    },
    {
      "url": "http://hl7.org/fhir/StructureDefinition/structuredefinition-standards-status",
      "valueCode": "trial-use"
    },
    {
      "url": "http://hl7.org/fhir/StructureDefinition/structuredefinition-fmm",
      "valueInteger": 0
    },
    {
      "url": "http://hl7.org/fhir/StructureDefinition/cqf-scope",
      "valueString": "@mii-termserv/hl7.fhir.r4b.terminology"
    }
  ],
  "url": "http://hl7.org/fhir/report-status-codes",
  "identifier": [
    {
      "system": "urn:ietf:rfc:3986",
      "value": "urn:oid:2.16.840.1.113883.4.642.4.725"
    }
  ],
  "version": "4.3.0",
  "name": "TestReportStatus",
  "title": "TestReportStatus",
  "status": "draft",
  "experimental": false,
  "date": "2021-01-17T07:06:13+11:00",
  "publisher": "HL7 (FHIR Project)",
  "contact": [
    {
      "telecom": [
        {
          "system": "url",
          "value": "http://hl7.org/fhir"
        },
        {
          "system": "email",
          "value": "fhir@lists.hl7.org"
        }
      ]
    }
  ],
  "description": "The current status of the test report.",
  "caseSensitive": true,
  "valueSet": "http://hl7.org/fhir/ValueSet/report-status-codes",
  "content": "complete",
  "concept": [
    {
      "code": "completed",
      "display": "Completed",
      "definition": "All test operations have completed."
    },
    {
      "code": "in-progress",
      "display": "In Progress",
      "definition": "A test operations is currently executing."
    },
    {
      "code": "waiting",
      "display": "Waiting",
      "definition": "A test operation is waiting for an external client request."
    },
    {
      "code": "stopped",
      "display": "Stopped",
      "definition": "The test script execution was manually stopped."
    },
    {
      "code": "entered-in-error",
      "display": "Entered In Error",
      "definition": "This test report was entered or created in error."
    }
  ]
}