{
  "resourceType": "CodeSystem",
  "id": "fhir.r4b-medicinal-product-package-type",
  "meta": {
    "lastUpdated": "2022-05-28T13:47:40.239+11:00",
    "profile": [
      "http://hl7.org/fhir/StructureDefinition/shareablecodesystem"
    ],
    "tag": [
      {
        "system": "https://mii-termserv.de/fhir/su-termserv/CodeSystem/mii-cs-suts-resource-tags-project",
        "code": "hl7",
        "display": "HL7 International"
      },
      {
        "system": "https://mii-termserv.de/fhir/su-termserv/CodeSystem/mii-cs-suts-resource-tags-dataset",
        "code": "hl7-fhir",
        "display": "HL7 FHIR"
      },
      {
        "system": "https://mii-termserv.de/fhir/su-termserv/CodeSystem/mii-cs-suts-resource-tags-license",
        "code": "https://mii-termserv.de/licenses#fhir",
        "display": "HL7 FHIR License"
      }
    ]
  },
  "text": {
    "status": "generated",
    "div": "<div xmlns=\"http://www.w3.org/1999/xhtml\"><h2>MedicinalProductPackageType</h2><tt>http://hl7.org/fhir/medicinal-product-package-type</tt><p>Types of medicinal product packs</p></div>"
  },
  "extension": [
    {
      "url": "http://hl7.org/fhir/StructureDefinition/structuredefinition-wg",
      "valueCode": "brr"
    },
    {
      "url": "http://hl7.org/fhir/StructureDefinition/structuredefinition-standards-status",
      "valueCode": "trial-use"
    },
    {
      "url": "http://hl7.org/fhir/StructureDefinition/structuredefinition-fmm",
      "valueInteger": 1
    },
    {
      "url": "http://hl7.org/fhir/StructureDefinition/cqf-scope",
      "valueString": "@mii-termserv/hl7.fhir.r4b.terminology"
    }
  ],
  "url": "http://hl7.org/fhir/medicinal-product-package-type",
  "identifier": [
    {
      "system": "urn:ietf:rfc:3986",
      "value": "urn:oid:2.16.840.1.113883.4.642.1.1552"
    }
  ],
  "version": "4.3.0",
  "name": "MedicinalProductPackageType",
  "title": "MedicinalProductPackageType",
  "status": "draft",
  "experimental": false,
  "date": "2021-01-05T10:01:24+11:00",
  "publisher": "HL7 (FHIR Project)",
  "contact": [
    {
      "telecom": [
        {
          "system": "url",
          "value": "http://hl7.org/fhir"
        },
        {
          "system": "email",
          "value": "fhir@lists.hl7.org"
        }
      ]
    }
  ],
  "description": "Types of medicinal product packs",
  "caseSensitive": true,
  "valueSet": "http://hl7.org/fhir/ValueSet/medicinal-product-package-type",
  "content": "complete",
  "concept": [
    {
      "code": "100000073490",
      "display": "Ampoule"
    },
    {
      "code": "100000073491",
      "display": "Applicator"
    },
    {
      "code": "100000073492",
      "display": "Automatic injection device"
    },
    {
      "code": "100000073493",
      "display": "Bag"
    },
    {
      "code": "100000073494",
      "display": "Balling gun"
    },
    {
      "code": "100000073495",
      "display": "Barrel"
    },
    {
      "code": "100000073496",
      "display": "Blister"
    },
    {
      "code": "100000073497",
      "display": "Bottle"
    },
    {
      "code": "100000073498",
      "display": "Box"
    },
    {
      "code": "100000073547",
      "display": "Sachet"
    },
    {
      "code": "100000073563",
      "display": "Vial"
    },
    {
      "code": "100000143555",
      "display": "Pack"
    }
  ]
}