{
  "resourceType": "CodeSystem",
  "id": "fhir.r4b-animal-species",
  "meta": {
    "lastUpdated": "2022-05-28T12:47:40.239+10:00",
    "profile": [
      "http://hl7.org/fhir/StructureDefinition/shareablecodesystem"
    ],
    "tag": [
      {
        "system": "https://mii-termserv.de/fhir/su-termserv/CodeSystem/mii-cs-suts-resource-tags-project",
        "code": "hl7",
        "display": "HL7 International"
      },
      {
        "system": "https://mii-termserv.de/fhir/su-termserv/CodeSystem/mii-cs-suts-resource-tags-dataset",
        "code": "hl7-fhir",
        "display": "HL7 FHIR"
      },
      {
        "system": "https://mii-termserv.de/fhir/su-termserv/CodeSystem/mii-cs-suts-resource-tags-license",
        "code": "https://mii-termserv.de/licenses#fhir",
        "display": "HL7 FHIR License"
      }
    ]
  },
  "text": {
    "status": "generated",
    "div": "<div xmlns=\"http://www.w3.org/1999/xhtml\"><h2>AnimalSpecies</h2><tt>http://hl7.org/fhir/animal-species</tt><p>This example value set defines a set of codes that can be used to indicate species of animal patients.</p></div>"
  },
  "extension": [
    {
      "url": "http://hl7.org/fhir/StructureDefinition/structuredefinition-wg",
      "valueCode": "pa"
    },
    {
      "url": "http://hl7.org/fhir/StructureDefinition/cqf-scope",
      "valueString": "@mii-termserv/hl7.fhir.r4b.terminology"
    }
  ],
  "url": "http://hl7.org/fhir/animal-species",
  "identifier": [
    {
      "system": "urn:ietf:rfc:3986",
      "value": "urn:oid:2.16.840.1.113883.4.642.1.421"
    }
  ],
  "version": "4.3.0",
  "name": "AnimalSpecies",
  "status": "draft",
  "experimental": false,
  "description": "This example value set defines a set of codes that can be used to indicate species of animal patients.",
  "caseSensitive": true,
  "content": "complete",
  "concept": [
    {
      "code": "canislf",
      "display": "Dog",
      "definition": "Canis lupus familiaris"
    },
    {
      "code": "ovisa",
      "display": "Sheep",
      "definition": "Ovis aries"
    },
    {
      "code": "serinuscd",
      "display": "Domestic Canary",
      "definition": "Serinus canaria domestica"
    }
  ],
  "title": "AnimalSpecies"
}