{
  "resourceType": "CodeSystem",
  "id": "fhir.r4b-organization-role",
  "meta": {
    "lastUpdated": "2022-05-28T12:47:40.239+10:00",
    "profile": [
      "http://hl7.org/fhir/StructureDefinition/shareablecodesystem"
    ],
    "tag": [
      {
        "system": "https://mii-termserv.de/fhir/su-termserv/CodeSystem/mii-cs-suts-resource-tags-project",
        "code": "hl7",
        "display": "HL7 International"
      },
      {
        "system": "https://mii-termserv.de/fhir/su-termserv/CodeSystem/mii-cs-suts-resource-tags-dataset",
        "code": "hl7-fhir",
        "display": "HL7 FHIR"
      },
      {
        "system": "https://mii-termserv.de/fhir/su-termserv/CodeSystem/mii-cs-suts-resource-tags-license",
        "code": "https://mii-termserv.de/licenses#fhir",
        "display": "HL7 FHIR License"
      }
    ]
  },
  "text": {
    "status": "generated",
    "div": "<div xmlns=\"http://www.w3.org/1999/xhtml\"><h2>OrganizationAffiliationRole</h2><tt>http://hl7.org/fhir/organization-role</tt><p>This example value set defines a set of codes that can be used to indicate the role of one Organization in relation to its affiliation with another.</p></div>"
  },
  "extension": [
    {
      "url": "http://hl7.org/fhir/StructureDefinition/structuredefinition-wg",
      "valueCode": "pa"
    },
    {
      "url": "http://hl7.org/fhir/StructureDefinition/cqf-scope",
      "valueString": "@mii-termserv/hl7.fhir.r4b.terminology"
    }
  ],
  "url": "http://hl7.org/fhir/organization-role",
  "identifier": [
    {
      "system": "urn:ietf:rfc:3986",
      "value": "urn:oid:2.16.840.1.113883.4.642.1.881"
    }
  ],
  "version": "4.3.0",
  "name": "OrganizationAffiliationRole",
  "status": "draft",
  "experimental": false,
  "description": "This example value set defines a set of codes that can be used to indicate the role of one Organization in relation to its affiliation with another.",
  "caseSensitive": true,
  "content": "complete",
  "concept": [
    {
      "code": "provider",
      "display": "Provider"
    },
    {
      "code": "agency",
      "display": "Agency",
      "definition": "An organization such as a public health agency, community/social services provider, etc."
    },
    {
      "code": "research",
      "display": "Research",
      "definition": "An organization providing research-related services such as conducting research, recruiting research participants, analyzing data, etc."
    },
    {
      "code": "payer",
      "display": "Payer",
      "definition": "An organization providing reimbursement, payment, or related services"
    },
    {
      "code": "diagnostics",
      "display": "Diagnostics",
      "definition": "An organization providing diagnostic testing/laboratory services"
    },
    {
      "code": "supplier",
      "display": "Supplier",
      "definition": "An organization that provides medical supplies (e.g. medical devices, equipment, pharmaceutical products, etc.)"
    },
    {
      "code": "HIE/HIO",
      "display": "HIE/HIO",
      "definition": "An organization that facilitates electronic clinical data exchange between entities"
    },
    {
      "code": "member",
      "display": "Member",
      "definition": "A type of non-ownership relationship between entities (encompasses partnerships, collaboration, joint ventures, etc.)"
    }
  ],
  "title": "OrganizationAffiliationRole"
}