{
  "resourceType": "CodeSystem",
  "id": "fhir.r4b-verificationresult-status",
  "meta": {
    "lastUpdated": "2022-05-28T12:47:40.239+10:00",
    "profile": [
      "http://hl7.org/fhir/StructureDefinition/shareablecodesystem"
    ],
    "tag": [
      {
        "system": "https://mii-termserv.de/fhir/su-termserv/CodeSystem/mii-cs-suts-resource-tags-project",
        "code": "hl7",
        "display": "HL7 International"
      },
      {
        "system": "https://mii-termserv.de/fhir/su-termserv/CodeSystem/mii-cs-suts-resource-tags-dataset",
        "code": "hl7-fhir",
        "display": "HL7 FHIR"
      },
      {
        "system": "https://mii-termserv.de/fhir/su-termserv/CodeSystem/mii-cs-suts-resource-tags-license",
        "code": "https://mii-termserv.de/licenses#fhir",
        "display": "HL7 FHIR License"
      }
    ]
  },
  "text": {
    "status": "generated",
    "div": "<div xmlns=\"http://www.w3.org/1999/xhtml\"><h2>status</h2><tt>http://hl7.org/fhir/verificationresult-status</tt><p>The validation status of the target</p></div>"
  },
  "extension": [
    {
      "url": "http://hl7.org/fhir/StructureDefinition/structuredefinition-wg",
      "valueCode": "pa"
    },
    {
      "url": "http://hl7.org/fhir/StructureDefinition/cqf-scope",
      "valueString": "@mii-termserv/hl7.fhir.r4b.terminology"
    }
  ],
  "url": "http://hl7.org/fhir/verificationresult-status",
  "identifier": [
    {
      "system": "urn:ietf:rfc:3986",
      "value": "urn:oid:2.16.840.1.113883.4.642.1.885"
    }
  ],
  "version": "4.3.0",
  "name": "status",
  "status": "draft",
  "experimental": false,
  "date": "2018-06-05T14:06:02+00:00",
  "publisher": "HL7 (FHIR Project)",
  "contact": [
    {
      "telecom": [
        {
          "system": "url",
          "value": "http://hl7.org/fhir"
        },
        {
          "system": "email",
          "value": "fhir@lists.hl7.org"
        }
      ]
    }
  ],
  "description": "The validation status of the target",
  "caseSensitive": true,
  "valueSet": "http://hl7.org/fhir/ValueSet/status",
  "content": "complete",
  "concept": [
    {
      "code": "attested",
      "display": "Attested",
      "definition": "***TODO***"
    },
    {
      "code": "validated",
      "display": "Validated",
      "definition": "***TODO***"
    },
    {
      "code": "in-process",
      "display": "In process",
      "definition": "***TODO***"
    },
    {
      "code": "req-revalid",
      "display": "Requires revalidation",
      "definition": "***TODO***"
    },
    {
      "code": "val-fail",
      "display": "Validation failed",
      "definition": "***TODO***"
    },
    {
      "code": "reval-fail",
      "display": "Re-Validation failed",
      "definition": "***TODO***"
    }
  ],
  "title": "status"
}