{
  "resourceType": "CodeSystem",
  "id": "fhir.r4b-icd-10-procedures",
  "meta": {
    "lastUpdated": "2022-05-28T12:47:40.239+10:00",
    "profile": [
      "http://hl7.org/fhir/StructureDefinition/shareablecodesystem"
    ],
    "tag": [
      {
        "system": "https://mii-termserv.de/fhir/su-termserv/CodeSystem/mii-cs-suts-resource-tags-project",
        "code": "hl7",
        "display": "HL7 International"
      },
      {
        "system": "https://mii-termserv.de/fhir/su-termserv/CodeSystem/mii-cs-suts-resource-tags-dataset",
        "code": "hl7-fhir",
        "display": "HL7 FHIR"
      },
      {
        "system": "https://mii-termserv.de/fhir/su-termserv/CodeSystem/mii-cs-suts-resource-tags-license",
        "code": "https://mii-termserv.de/licenses#fhir",
        "display": "HL7 FHIR License"
      }
    ]
  },
  "text": {
    "status": "generated",
    "div": "<div xmlns=\"http://www.w3.org/1999/xhtml\"><h2>ICD-10 Procedure Codes</h2><tt>http://hl7.org/fhir/sid/ex-icd-10-procedures</tt><p>This value set includes sample ICD-10 Procedure codes.</p></div>"
  },
  "extension": [
    {
      "url": "http://hl7.org/fhir/StructureDefinition/structuredefinition-wg",
      "valueCode": "fm"
    },
    {
      "url": "http://hl7.org/fhir/StructureDefinition/cqf-scope",
      "valueString": "@mii-termserv/hl7.fhir.r4b.terminology"
    }
  ],
  "url": "http://hl7.org/fhir/sid/ex-icd-10-procedures",
  "identifier": [
    {
      "system": "urn:ietf:rfc:3986",
      "value": "urn:oid:2.16.840.1.113883.4.642.1.575"
    }
  ],
  "version": "4.3.0",
  "name": "ICD-10ProcedureCodes",
  "title": "ICD-10 Procedure Codes",
  "status": "draft",
  "experimental": false,
  "description": "This value set includes sample ICD-10 Procedure codes.",
  "copyright": "This is an example set.",
  "caseSensitive": true,
  "content": "complete",
  "concept": [
    {
      "code": "123001",
      "display": "PROC-1",
      "definition": "Procedure 1"
    },
    {
      "code": "123002",
      "display": "PROC-2",
      "definition": "Procedure 2"
    },
    {
      "code": "123003",
      "display": "PROC-3",
      "definition": "Procedure 3"
    }
  ]
}