{
  "resourceType": "CodeSystem",
  "id": "fhir.r4b-condition-ver-status",
  "meta": {
    "lastUpdated": "2022-05-28T13:47:40.239+11:00",
    "profile": [
      "http://hl7.org/fhir/StructureDefinition/shareablecodesystem"
    ],
    "tag": [
      {
        "system": "https://mii-termserv.de/fhir/su-termserv/CodeSystem/mii-cs-suts-resource-tags-project",
        "code": "hl7",
        "display": "HL7 International"
      },
      {
        "system": "https://mii-termserv.de/fhir/su-termserv/CodeSystem/mii-cs-suts-resource-tags-dataset",
        "code": "hl7-fhir",
        "display": "HL7 FHIR"
      },
      {
        "system": "https://mii-termserv.de/fhir/su-termserv/CodeSystem/mii-cs-suts-resource-tags-license",
        "code": "https://mii-termserv.de/licenses#fhir",
        "display": "HL7 FHIR License"
      }
    ]
  },
  "text": {
    "status": "generated",
    "div": "<div xmlns=\"http://www.w3.org/1999/xhtml\"><h2>ConditionVerificationStatus</h2><tt>http://terminology.hl7.org/CodeSystem/condition-ver-status</tt><p>The verification status to support or decline the clinical status of the condition or diagnosis.</p></div>"
  },
  "extension": [
    {
      "url": "http://hl7.org/fhir/StructureDefinition/structuredefinition-wg",
      "valueCode": "pc"
    },
    {
      "url": "http://hl7.org/fhir/StructureDefinition/structuredefinition-standards-status",
      "valueCode": "trial-use"
    },
    {
      "url": "http://hl7.org/fhir/StructureDefinition/structuredefinition-fmm",
      "valueInteger": 3
    },
    {
      "url": "http://hl7.org/fhir/StructureDefinition/cqf-scope",
      "valueString": "@mii-termserv/hl7.fhir.r4b.terminology"
    }
  ],
  "url": "http://terminology.hl7.org/CodeSystem/condition-ver-status",
  "identifier": [
    {
      "system": "urn:ietf:rfc:3986",
      "value": "urn:oid:2.16.840.1.113883.4.642.4.1075"
    }
  ],
  "version": "4.3.0",
  "name": "ConditionVerificationStatus",
  "title": "ConditionVerificationStatus",
  "status": "draft",
  "experimental": false,
  "date": "2021-01-17T07:06:13+11:00",
  "publisher": "HL7 (FHIR Project)",
  "contact": [
    {
      "telecom": [
        {
          "system": "url",
          "value": "http://hl7.org/fhir"
        },
        {
          "system": "email",
          "value": "fhir@lists.hl7.org"
        }
      ]
    }
  ],
  "description": "The verification status to support or decline the clinical status of the condition or diagnosis.",
  "caseSensitive": true,
  "valueSet": "http://hl7.org/fhir/ValueSet/condition-ver-status",
  "hierarchyMeaning": "is-a",
  "content": "complete",
  "concept": [
    {
      "code": "unconfirmed",
      "display": "Unconfirmed",
      "definition": "There is not sufficient diagnostic and/or clinical evidence to treat this as a confirmed condition.",
      "concept": [
        {
          "code": "provisional",
          "display": "Provisional",
          "definition": "This is a tentative diagnosis - still a candidate that is under consideration."
        },
        {
          "code": "differential",
          "display": "Differential",
          "definition": "One of a set of potential (and typically mutually exclusive) diagnoses asserted to further guide the diagnostic process and preliminary treatment."
        }
      ]
    },
    {
      "code": "confirmed",
      "display": "Confirmed",
      "definition": "There is sufficient diagnostic and/or clinical evidence to treat this as a confirmed condition."
    },
    {
      "code": "refuted",
      "display": "Refuted",
      "definition": "This condition has been ruled out by diagnostic and clinical evidence."
    },
    {
      "code": "entered-in-error",
      "display": "Entered in Error",
      "definition": "The statement was entered in error and is not valid."
    }
  ]
}