{
  "resourceType": "CodeSystem",
  "id": "fhir.r4b-knowledge-resource-types",
  "meta": {
    "lastUpdated": "2022-05-28T12:47:40.239+10:00",
    "tag": [
      {
        "system": "https://mii-termserv.de/fhir/su-termserv/CodeSystem/mii-cs-suts-resource-tags-project",
        "code": "hl7",
        "display": "HL7 International"
      },
      {
        "system": "https://mii-termserv.de/fhir/su-termserv/CodeSystem/mii-cs-suts-resource-tags-dataset",
        "code": "hl7-fhir",
        "display": "HL7 FHIR"
      },
      {
        "system": "https://mii-termserv.de/fhir/su-termserv/CodeSystem/mii-cs-suts-resource-tags-license",
        "code": "https://mii-termserv.de/licenses#fhir",
        "display": "HL7 FHIR License"
      }
    ]
  },
  "text": {
    "status": "generated",
    "div": "<div xmlns=\"http://www.w3.org/1999/xhtml\"><h2>KnowledgeResourceType</h2><tt>http://hl7.org/fhir/knowledge-resource-types</tt><p>A list of all the knowledge resource types defined in this version of the FHIR specification.</p></div>"
  },
  "extension": [
    {
      "url": "http://hl7.org/fhir/StructureDefinition/structuredefinition-wg",
      "valueCode": "vocab"
    },
    {
      "url": "http://hl7.org/fhir/StructureDefinition/cqf-scope",
      "valueString": "@mii-termserv/hl7.fhir.r4b.terminology"
    }
  ],
  "url": "http://hl7.org/fhir/knowledge-resource-types",
  "identifier": [
    {
      "system": "urn:ietf:rfc:3986",
      "value": "urn:oid:2.16.840.1.113883.4.642.1.1063"
    }
  ],
  "version": "4.3.0",
  "name": "KnowledgeResourceType",
  "title": "KnowledgeResourceType",
  "status": "draft",
  "experimental": false,
  "date": "2022-05-28T12:47:40+10:00",
  "description": "A list of all the knowledge resource types defined in this version of the FHIR specification.",
  "caseSensitive": true,
  "valueSet": "http://hl7.org/fhir/ValueSet/knowledge-resource-types",
  "content": "complete",
  "concept": [
    {
      "code": "ActivityDefinition",
      "display": "ActivityDefinition",
      "definition": "The definition of a specific activity to be taken, independent of any particular patient or context."
    },
    {
      "code": "CodeSystem",
      "display": "CodeSystem",
      "definition": "A set of codes drawn from one or more code systems."
    },
    {
      "code": "ConceptMap",
      "display": "ConceptMap",
      "definition": "A map from one set of concepts to one or more other concepts."
    },
    {
      "code": "Library",
      "display": "Library",
      "definition": "Represents a library of quality improvement components."
    },
    {
      "code": "Measure",
      "display": "Measure",
      "definition": "A quality measure definition."
    },
    {
      "code": "PlanDefinition",
      "display": "PlanDefinition",
      "definition": "The definition of a plan for a series of actions, independent of any specific patient or context."
    },
    {
      "code": "StructureDefinition",
      "display": "StructureDefinition",
      "definition": "Structural Definition."
    },
    {
      "code": "StructureMap",
      "display": "StructureMap",
      "definition": "A Map of relationships between 2 structures that can be used to transform data."
    },
    {
      "code": "ValueSet",
      "display": "ValueSet",
      "definition": "A set of codes drawn from one or more code systems."
    }
  ]
}