{
  "resourceType": "CodeSystem",
  "id": "fhir.r4b-entformula-additive",
  "meta": {
    "lastUpdated": "2022-05-28T12:47:40.239+10:00",
    "profile": [
      "http://hl7.org/fhir/StructureDefinition/shareablecodesystem"
    ],
    "tag": [
      {
        "system": "https://mii-termserv.de/fhir/su-termserv/CodeSystem/mii-cs-suts-resource-tags-project",
        "code": "hl7",
        "display": "HL7 International"
      },
      {
        "system": "https://mii-termserv.de/fhir/su-termserv/CodeSystem/mii-cs-suts-resource-tags-dataset",
        "code": "hl7-fhir",
        "display": "HL7 FHIR"
      },
      {
        "system": "https://mii-termserv.de/fhir/su-termserv/CodeSystem/mii-cs-suts-resource-tags-license",
        "code": "https://mii-termserv.de/licenses#fhir",
        "display": "HL7 FHIR License"
      }
    ]
  },
  "text": {
    "status": "generated",
    "div": "<div xmlns=\"http://www.w3.org/1999/xhtml\"><h2>Enteral Formula Additive Type Code</h2><tt>http://terminology.hl7.org/CodeSystem/entformula-additive</tt><p>EnteralFormulaAdditiveType: Codes for the type of modular component such as protein, carbohydrate or fiber to be provided in addition to or mixed with the base formula. This value set is provided as a suggestive example.</p></div>"
  },
  "extension": [
    {
      "url": "http://hl7.org/fhir/StructureDefinition/structuredefinition-wg",
      "valueCode": "oo"
    },
    {
      "url": "http://hl7.org/fhir/StructureDefinition/cqf-scope",
      "valueString": "@mii-termserv/hl7.fhir.r4b.terminology"
    }
  ],
  "url": "http://terminology.hl7.org/CodeSystem/entformula-additive",
  "identifier": [
    {
      "system": "urn:ietf:rfc:3986",
      "value": "urn:oid:2.16.840.1.113883.4.642.1.1123"
    }
  ],
  "version": "4.3.0",
  "name": "EnteralFormulaAdditiveTypeCode",
  "title": "Enteral Formula Additive Type Code",
  "status": "draft",
  "experimental": false,
  "description": "EnteralFormulaAdditiveType: Codes for the type of modular component such as protein, carbohydrate or fiber to be provided in addition to or mixed with the base formula. This value set is provided as a suggestive example.",
  "caseSensitive": true,
  "content": "complete",
  "concept": [
    {
      "code": "lipid",
      "display": "Lipid",
      "definition": "Modular lipid enteral formula component"
    },
    {
      "code": "protein",
      "display": "Protein",
      "definition": "Modular protein enteral formula component"
    },
    {
      "code": "carbohydrate",
      "display": "Carbohydrate",
      "definition": "Modular carbohydrate enteral formula component"
    },
    {
      "code": "fiber",
      "display": "Fiber",
      "definition": "Modular fiber enteral formula component"
    },
    {
      "code": "water",
      "display": "Water",
      "definition": "Added water"
    }
  ]
}