{
  "resourceType": "ValueSet",
  "id": "fhir.r4b-enteral-route",
  "meta": {
    "lastUpdated": "2022-05-28T12:47:40.239+10:00",
    "profile": [
      "http://hl7.org/fhir/StructureDefinition/shareablevalueset"
    ],
    "tag": [
      {
        "system": "https://mii-termserv.de/fhir/su-termserv/CodeSystem/mii-cs-suts-resource-tags-project",
        "code": "hl7",
        "display": "HL7 International"
      },
      {
        "system": "https://mii-termserv.de/fhir/su-termserv/CodeSystem/mii-cs-suts-resource-tags-dataset",
        "code": "hl7-fhir",
        "display": "HL7 FHIR"
      },
      {
        "system": "https://mii-termserv.de/fhir/su-termserv/CodeSystem/mii-cs-suts-resource-tags-license",
        "code": "https://mii-termserv.de/licenses#fhir",
        "display": "HL7 FHIR License"
      }
    ]
  },
  "text": {
    "status": "generated",
    "div": "<div xmlns=\"http://www.w3.org/1999/xhtml\"><h2>Enteral Route Codes</h2><tt>http://hl7.org/fhir/ValueSet/enteral-route</tt><p>EnteralRouteOfAdministration: Codes specifying the route of administration of enteral formula.  This value set is composed of HL7 V3 codes and is provided as a suggestive example.</p></div>"
  },
  "extension": [
    {
      "url": "http://hl7.org/fhir/StructureDefinition/structuredefinition-wg",
      "valueCode": "oo"
    },
    {
      "url": "http://hl7.org/fhir/StructureDefinition/structuredefinition-standards-status",
      "valueCode": "trial-use"
    },
    {
      "url": "http://hl7.org/fhir/StructureDefinition/structuredefinition-fmm",
      "valueInteger": 2
    },
    {
      "url": "http://hl7.org/fhir/StructureDefinition/cqf-scope",
      "valueString": "@mii-termserv/hl7.fhir.r4b.terminology"
    }
  ],
  "url": "http://hl7.org/fhir/ValueSet/enteral-route",
  "identifier": [
    {
      "system": "urn:ietf:rfc:3986",
      "value": "urn:oid:2.16.840.1.113883.4.642.3.394"
    }
  ],
  "version": "4.3.0",
  "name": "EnteralRouteCodes",
  "title": "Enteral Route Codes",
  "status": "draft",
  "experimental": false,
  "publisher": "FHIR NutritionOrder team",
  "contact": [
    {
      "telecom": [
        {
          "system": "url",
          "value": "http://hl7.org/fhir"
        }
      ]
    }
  ],
  "description": "EnteralRouteOfAdministration: Codes specifying the route of administration of enteral formula.  This value set is composed of HL7 V3 codes and is provided as a suggestive example.",
  "compose": {
    "include": [
      {
        "system": "http://terminology.hl7.org/CodeSystem/v3-RouteOfAdministration",
        "concept": [
          {
            "code": "PO"
          },
          {
            "code": "EFT"
          },
          {
            "code": "ENTINSTL"
          },
          {
            "code": "GT"
          },
          {
            "code": "NGT"
          },
          {
            "code": "OGT"
          },
          {
            "code": "GJT"
          },
          {
            "code": "JJTINSTL"
          },
          {
            "code": "OJJ"
          }
        ]
      }
    ]
  }
}