{
  "resourceType": "CodeSystem",
  "id": "fhir.r4b-testscript-profile-origin-types",
  "meta": {
    "lastUpdated": "2022-05-28T12:47:40.239+10:00",
    "profile": [
      "http://hl7.org/fhir/StructureDefinition/shareablecodesystem"
    ],
    "tag": [
      {
        "system": "https://mii-termserv.de/fhir/su-termserv/CodeSystem/mii-cs-suts-resource-tags-project",
        "code": "hl7",
        "display": "HL7 International"
      },
      {
        "system": "https://mii-termserv.de/fhir/su-termserv/CodeSystem/mii-cs-suts-resource-tags-dataset",
        "code": "hl7-fhir",
        "display": "HL7 FHIR"
      },
      {
        "system": "https://mii-termserv.de/fhir/su-termserv/CodeSystem/mii-cs-suts-resource-tags-license",
        "code": "https://mii-termserv.de/licenses#fhir",
        "display": "HL7 FHIR License"
      }
    ]
  },
  "text": {
    "status": "generated",
    "div": "<div xmlns=\"http://www.w3.org/1999/xhtml\"><h2>TestScriptProfileOriginTypes</h2><tt>http://terminology.hl7.org/CodeSystem/testscript-profile-origin-types</tt><p>This value set defines a set of codes that are used to indicate the profile type of a test system when acting as the origin within a TestScript.</p></div>"
  },
  "extension": [
    {
      "url": "http://hl7.org/fhir/StructureDefinition/structuredefinition-wg",
      "valueCode": "fhir"
    },
    {
      "url": "http://hl7.org/fhir/StructureDefinition/cqf-scope",
      "valueString": "@mii-termserv/hl7.fhir.r4b.terminology"
    }
  ],
  "url": "http://terminology.hl7.org/CodeSystem/testscript-profile-origin-types",
  "identifier": [
    {
      "system": "urn:ietf:rfc:3986",
      "value": "urn:oid:2.16.840.1.113883.4.642.1.1196"
    }
  ],
  "version": "4.3.0",
  "name": "TestScriptProfileOriginTypes",
  "status": "draft",
  "experimental": false,
  "description": "This value set defines a set of codes that are used to indicate the profile type of a test system when acting as the origin within a TestScript.",
  "caseSensitive": true,
  "content": "complete",
  "concept": [
    {
      "code": "FHIR-Client",
      "display": "FHIR Client",
      "definition": "General FHIR client used to initiate operations against a FHIR server."
    },
    {
      "code": "FHIR-SDC-FormFiller",
      "display": "FHIR SDC FormFiller",
      "definition": "A FHIR client acting as a Structured Data Capture Form Filler."
    }
  ],
  "title": "TestScriptProfileOriginTypes"
}