{
  "resourceType": "CodeSystem",
  "id": "fhir.r4b-messageheader-response-request",
  "meta": {
    "lastUpdated": "2022-05-28T13:47:40.239+11:00",
    "profile": [
      "http://hl7.org/fhir/StructureDefinition/shareablecodesystem"
    ],
    "tag": [
      {
        "system": "https://mii-termserv.de/fhir/su-termserv/CodeSystem/mii-cs-suts-resource-tags-project",
        "code": "hl7",
        "display": "HL7 International"
      },
      {
        "system": "https://mii-termserv.de/fhir/su-termserv/CodeSystem/mii-cs-suts-resource-tags-dataset",
        "code": "hl7-fhir",
        "display": "HL7 FHIR"
      },
      {
        "system": "https://mii-termserv.de/fhir/su-termserv/CodeSystem/mii-cs-suts-resource-tags-license",
        "code": "https://mii-termserv.de/licenses#fhir",
        "display": "HL7 FHIR License"
      }
    ]
  },
  "text": {
    "status": "generated",
    "div": "<div xmlns=\"http://www.w3.org/1999/xhtml\"><h2>messageheader-response-request</h2><tt>http://hl7.org/fhir/messageheader-response-request</tt><p>HL7-defined table of codes which identify conditions under which acknowledgments are required to be returned in response to a message.</p></div>"
  },
  "extension": [
    {
      "url": "http://hl7.org/fhir/StructureDefinition/structuredefinition-wg",
      "valueCode": "inm"
    },
    {
      "url": "http://hl7.org/fhir/StructureDefinition/structuredefinition-standards-status",
      "valueCode": "trial-use"
    },
    {
      "url": "http://hl7.org/fhir/StructureDefinition/structuredefinition-fmm",
      "valueInteger": 1
    },
    {
      "url": "http://hl7.org/fhir/StructureDefinition/cqf-scope",
      "valueString": "@mii-termserv/hl7.fhir.r4b.terminology"
    }
  ],
  "url": "http://hl7.org/fhir/messageheader-response-request",
  "identifier": [
    {
      "system": "urn:ietf:rfc:3986",
      "value": "urn:oid:2.16.840.1.113883.4.642.4.925"
    }
  ],
  "version": "4.3.0",
  "name": "messageheader-response-request",
  "title": "messageheader-response-request",
  "status": "draft",
  "experimental": false,
  "date": "2021-01-17T07:06:13+11:00",
  "publisher": "HL7 (FHIR Project)",
  "contact": [
    {
      "telecom": [
        {
          "system": "url",
          "value": "http://hl7.org/fhir"
        },
        {
          "system": "email",
          "value": "fhir@lists.hl7.org"
        }
      ]
    }
  ],
  "description": "HL7-defined table of codes which identify conditions under which acknowledgments are required to be returned in response to a message.",
  "caseSensitive": true,
  "valueSet": "http://hl7.org/fhir/ValueSet/messageheader-response-request",
  "content": "complete",
  "concept": [
    {
      "code": "always",
      "display": "Always",
      "definition": "initiator expects a response for this message."
    },
    {
      "code": "on-error",
      "display": "Error/reject conditions only",
      "definition": "initiator expects a response only if in error."
    },
    {
      "code": "never",
      "display": "Never",
      "definition": "initiator does not expect a response."
    },
    {
      "code": "on-success",
      "display": "Successful completion only",
      "definition": "initiator expects a response only if successful."
    }
  ]
}