{
  "resourceType": "CodeSystem",
  "id": "fhir.r4b-codesystem-content-mode",
  "meta": {
    "lastUpdated": "2022-05-28T13:47:40.239+11:00",
    "profile": [
      "http://hl7.org/fhir/StructureDefinition/shareablecodesystem"
    ],
    "tag": [
      {
        "system": "https://mii-termserv.de/fhir/su-termserv/CodeSystem/mii-cs-suts-resource-tags-project",
        "code": "hl7",
        "display": "HL7 International"
      },
      {
        "system": "https://mii-termserv.de/fhir/su-termserv/CodeSystem/mii-cs-suts-resource-tags-dataset",
        "code": "hl7-fhir",
        "display": "HL7 FHIR"
      },
      {
        "system": "https://mii-termserv.de/fhir/su-termserv/CodeSystem/mii-cs-suts-resource-tags-license",
        "code": "https://mii-termserv.de/licenses#fhir",
        "display": "HL7 FHIR License"
      }
    ]
  },
  "text": {
    "status": "generated",
    "div": "<div xmlns=\"http://www.w3.org/1999/xhtml\"><h2>CodeSystemContentMode</h2><tt>http://hl7.org/fhir/codesystem-content-mode</tt><p>The extent of the content of the code system (the concepts and codes it defines) are represented in a code system resource.</p></div>"
  },
  "extension": [
    {
      "url": "http://hl7.org/fhir/StructureDefinition/structuredefinition-wg",
      "valueCode": "vocab"
    },
    {
      "url": "http://hl7.org/fhir/StructureDefinition/structuredefinition-standards-status",
      "valueCode": "normative"
    },
    {
      "url": "http://hl7.org/fhir/StructureDefinition/structuredefinition-normative-version",
      "valueCode": "4.0.0"
    },
    {
      "url": "http://hl7.org/fhir/StructureDefinition/structuredefinition-fmm",
      "valueInteger": 5
    },
    {
      "url": "http://hl7.org/fhir/StructureDefinition/cqf-scope",
      "valueString": "@mii-termserv/hl7.fhir.r4b.terminology"
    }
  ],
  "url": "http://hl7.org/fhir/codesystem-content-mode",
  "identifier": [
    {
      "system": "urn:ietf:rfc:3986",
      "value": "urn:oid:2.16.840.1.113883.4.642.4.783"
    }
  ],
  "version": "4.3.0",
  "name": "CodeSystemContentMode",
  "title": "CodeSystemContentMode",
  "status": "active",
  "experimental": false,
  "date": "2021-01-17T07:06:13+11:00",
  "publisher": "HL7 (FHIR Project)",
  "contact": [
    {
      "telecom": [
        {
          "system": "url",
          "value": "http://hl7.org/fhir"
        },
        {
          "system": "email",
          "value": "fhir@lists.hl7.org"
        }
      ]
    }
  ],
  "description": "The extent of the content of the code system (the concepts and codes it defines) are represented in a code system resource.",
  "caseSensitive": true,
  "valueSet": "http://hl7.org/fhir/ValueSet/codesystem-content-mode",
  "content": "complete",
  "concept": [
    {
      "code": "not-present",
      "display": "Not Present",
      "definition": "None of the concepts defined by the code system are included in the code system resource."
    },
    {
      "code": "example",
      "display": "Example",
      "definition": "A few representative concepts are included in the code system resource. There is no useful intent in the subset choice and there's no process to make it workable: it's not intended to be workable."
    },
    {
      "code": "fragment",
      "display": "Fragment",
      "definition": "A subset of the code system concepts are included in the code system resource. This is a curated subset released for a specific purpose under the governance of the code system steward, and that the intent, bounds and consequences of the fragmentation are clearly defined in the fragment or the code system documentation. Fragments are also known as partitions."
    },
    {
      "code": "complete",
      "display": "Complete",
      "definition": "All the concepts defined by the code system are included in the code system resource."
    },
    {
      "code": "supplement",
      "display": "Supplement",
      "definition": "The resource doesn't define any new concepts; it just provides additional designations and properties to another code system."
    }
  ]
}