{
  "resourceType": "CodeSystem",
  "id": "fhir.r4b-medicationdispense-status-reason",
  "meta": {
    "lastUpdated": "2022-05-28T12:47:40.239+10:00",
    "profile": [
      "http://hl7.org/fhir/StructureDefinition/shareablecodesystem"
    ],
    "tag": [
      {
        "system": "https://mii-termserv.de/fhir/su-termserv/CodeSystem/mii-cs-suts-resource-tags-project",
        "code": "hl7",
        "display": "HL7 International"
      },
      {
        "system": "https://mii-termserv.de/fhir/su-termserv/CodeSystem/mii-cs-suts-resource-tags-dataset",
        "code": "hl7-fhir",
        "display": "HL7 FHIR"
      },
      {
        "system": "https://mii-termserv.de/fhir/su-termserv/CodeSystem/mii-cs-suts-resource-tags-license",
        "code": "https://mii-termserv.de/licenses#fhir",
        "display": "HL7 FHIR License"
      }
    ]
  },
  "text": {
    "status": "generated",
    "div": "<div xmlns=\"http://www.w3.org/1999/xhtml\">\n            <p>This code system http://terminology.hl7.org/CodeSystem/medicationdispense-status-reason defines the following codes:</p>\n            <table class=\"codes\">\n              <tr>\n                <td style=\"white-space:nowrap\">\n                  <b>Code</b>\n                </td>\n                <td>\n                  <b>Display</b>\n                </td>\n                <td>\n                  <b>Definition</b>\n                </td>\n              </tr>\n              <tr>\n                <td style=\"white-space:nowrap\">frr01\n                  <a name=\"medicationdispense-status-reason-frr01\"> </a>\n                </td>\n                <td>Order Stopped</td>\n                <td>The order has been stopped by the prescriber but this fact has not necessarily captured electronically. Example: A verbal stop, a fax, etc.</td>\n              </tr>\n              <tr>\n                <td style=\"white-space:nowrap\">frr02\n                  <a name=\"medicationdispense-status-reason-frr02\"> </a>\n                </td>\n                <td>Stale-dated Order</td>\n                <td>Order has not been fulfilled within a reasonable amount of time, and might not be current.</td>\n              </tr>\n              <tr>\n                <td style=\"white-space:nowrap\">frr03\n                  <a name=\"medicationdispense-status-reason-frr03\"> </a>\n                </td>\n                <td>Incomplete data</td>\n                <td>Data needed to safely act on the order which was expected to become available independent of the order is not yet available. Example: Lab results, diagnostic imaging, etc.</td>\n              </tr>\n              <tr>\n                <td style=\"white-space:nowrap\">frr04\n                  <a name=\"medicationdispense-status-reason-frr04\"> </a>\n                </td>\n                <td>Product unavailable</td>\n                <td>Product not available or manufactured. Cannot supply.</td>\n              </tr>\n              <tr>\n                <td style=\"white-space:nowrap\">frr05\n                  <a name=\"medicationdispense-status-reason-frr05\"> </a>\n                </td>\n                <td>Ethical/religious</td>\n                <td>The dispenser has ethical, religious or moral objections to fulfilling the order/dispensing the product.</td>\n              </tr>\n              <tr>\n                <td style=\"white-space:nowrap\">frr06\n                  <a name=\"medicationdispense-status-reason-frr06\"> </a>\n                </td>\n                <td>Unable to provide care</td>\n                <td>Fulfiller not able to provide appropriate care associated with fulfilling the order. Example: Therapy requires ongoing monitoring by fulfiller and fulfiller will be ending practice, leaving town, unable to schedule necessary time, etc.</td>\n              </tr>\n              <tr>\n                <td style=\"white-space:nowrap\">altchoice\n                  <a name=\"medicationdispense-status-reason-altchoice\"> </a>\n                </td>\n                <td>Try another treatment first</td>\n                <td>This therapy has been ordered as a backup to a preferred therapy. This order will be released when and if the preferred therapy is unsuccessful.</td>\n              </tr>\n              <tr>\n                <td style=\"white-space:nowrap\">clarif\n                  <a name=\"medicationdispense-status-reason-clarif\"> </a>\n                </td>\n                <td>Prescription/Request requires clarification</td>\n                <td>Clarification is required before the order can be acted upon.</td>\n              </tr>\n              <tr>\n                <td style=\"white-space:nowrap\">drughigh\n                  <a name=\"medicationdispense-status-reason-drughigh\"> </a>\n                </td>\n                <td>Drug level too high</td>\n                <td>The current level of the medication in the patient's system is too high. The medication is suspended to allow the level to subside to a safer level.</td>\n              </tr>\n              <tr>\n                <td style=\"white-space:nowrap\">hospadm\n                  <a name=\"medicationdispense-status-reason-hospadm\"> </a>\n                </td>\n                <td>Admission to hospital</td>\n                <td>The patient has been admitted to a care facility and their community medications are suspended until hospital discharge.</td>\n              </tr>\n              <tr>\n                <td style=\"white-space:nowrap\">labint\n                  <a name=\"medicationdispense-status-reason-labint\"> </a>\n                </td>\n                <td>Lab interference issues</td>\n                <td>The therapy would interfere with a planned lab test and the therapy is being withdrawn until the test is completed.</td>\n              </tr>\n              <tr>\n                <td style=\"white-space:nowrap\">non-avail\n                  <a name=\"medicationdispense-status-reason-non-avail\"> </a>\n                </td>\n                <td>Patient not available</td>\n                <td>Patient not available for a period of time due to a scheduled therapy, leave of absence or other reason.</td>\n              </tr>\n              <tr>\n                <td style=\"white-space:nowrap\">preg\n                  <a name=\"medicationdispense-status-reason-preg\"> </a>\n                </td>\n                <td>Patient is pregnant or breastfeeding</td>\n                <td>The patient is pregnant or breast feeding. The therapy will be resumed when the pregnancy is complete and the patient is no longer breastfeeding.</td>\n              </tr>\n              <tr>\n                <td style=\"white-space:nowrap\">saig\n                  <a name=\"medicationdispense-status-reason-saig\"> </a>\n                </td>\n                <td>Allergy</td>\n                <td>The patient is believed to be allergic to a substance that is part of the therapy and the therapy is being temporarily withdrawn to confirm.</td>\n              </tr>\n              <tr>\n                <td style=\"white-space:nowrap\">sddi\n                  <a name=\"medicationdispense-status-reason-sddi\"> </a>\n                </td>\n                <td>Drug interacts with another drug</td>\n                <td>The drug interacts with a short-term treatment that is more urgently required. This order will be resumed when the short-term treatment is complete.</td>\n              </tr>\n              <tr>\n                <td style=\"white-space:nowrap\">sdupther\n                  <a name=\"medicationdispense-status-reason-sdupther\"> </a>\n                </td>\n                <td>Duplicate therapy</td>\n                <td>Another short-term co-occurring therapy fulfills the same purpose as this therapy. This therapy will be resumed when the co-occuring therapy is complete.</td>\n              </tr>\n              <tr>\n                <td style=\"white-space:nowrap\">sintol\n                  <a name=\"medicationdispense-status-reason-sintol\"> </a>\n                </td>\n                <td>Suspected intolerance</td>\n                <td>The patient is believed to have an intolerance to a substance that is part of the therapy and the therapy is being temporarily withdrawn to confirm.</td>\n              </tr>\n              <tr>\n                <td style=\"white-space:nowrap\">surg\n                  <a name=\"medicationdispense-status-reason-surg\"> </a>\n                </td>\n                <td>Patient scheduled for surgery</td>\n                <td>The drug is contraindicated for patients receiving surgery and the patient is scheduled to be admitted for surgery in the near future. The drug will be resumed when the patient has sufficiently recovered from the surgery.</td>\n              </tr>\n              <tr>\n                <td style=\"white-space:nowrap\">washout\n                  <a name=\"medicationdispense-status-reason-washout\"> </a>\n                </td>\n                <td>Washout</td>\n                <td>The patient was previously receiving a medication contraindicated with the current medication. The current medication will remain on hold until the prior medication has been cleansed from their system.</td>\n              </tr>\n              <tr>\n                <td style=\"white-space:nowrap\">outofstock\n                  <a name=\"medicationdispense-status-reason-outofstock\"> </a>\n                </td>\n                <td>Drug not available - out of stock</td>\n                <td>Drug out of stock. Cannot supply.</td>\n              </tr>\n              <tr>\n                <td style=\"white-space:nowrap\">offmarket\n                  <a name=\"medicationdispense-status-reason-offmarket\"> </a>\n                </td>\n                <td>Drug not available - off market</td>\n                <td>Drug no longer marketed Cannot supply.</td>\n              </tr>\n            </table>\n          </div>"
  },
  "extension": [
    {
      "url": "http://hl7.org/fhir/StructureDefinition/structuredefinition-wg",
      "valueCode": "phx"
    },
    {
      "url": "http://hl7.org/fhir/StructureDefinition/cqf-scope",
      "valueString": "@mii-termserv/hl7.fhir.r4b.terminology"
    }
  ],
  "url": "http://terminology.hl7.org/CodeSystem/medicationdispense-status-reason",
  "identifier": [
    {
      "system": "urn:ietf:rfc:3986",
      "value": "urn:oid:2.16.840.1.113883.4.642.1.1317"
    }
  ],
  "version": "4.3.0",
  "name": "Medication Dispense Status Reason Codes",
  "status": "draft",
  "experimental": false,
  "caseSensitive": true,
  "valueSet": "http://hl7.org/fhir/ValueSet/medicationdispense-status-reason",
  "content": "complete",
  "concept": [
    {
      "code": "frr01",
      "display": "Order Stopped",
      "definition": "The order has been stopped by the prescriber but this fact has not necessarily captured electronically. Example: A verbal stop, a fax, etc."
    },
    {
      "code": "frr02",
      "display": "Stale-dated Order",
      "definition": "Order has not been fulfilled within a reasonable amount of time, and might not be current."
    },
    {
      "code": "frr03",
      "display": "Incomplete data",
      "definition": "Data needed to safely act on the order which was expected to become available independent of the order is not yet available. Example: Lab results, diagnostic imaging, etc."
    },
    {
      "code": "frr04",
      "display": "Product unavailable",
      "definition": "Product not available or manufactured. Cannot supply."
    },
    {
      "code": "frr05",
      "display": "Ethical/religious",
      "definition": "The dispenser has ethical, religious or moral objections to fulfilling the order/dispensing the product."
    },
    {
      "code": "frr06",
      "display": "Unable to provide care",
      "definition": "Fulfiller not able to provide appropriate care associated with fulfilling the order. Example: Therapy requires ongoing monitoring by fulfiller and fulfiller will be ending practice, leaving town, unable to schedule necessary time, etc."
    },
    {
      "code": "altchoice",
      "display": "Try another treatment first",
      "definition": "This therapy has been ordered as a backup to a preferred therapy. This order will be released when and if the preferred therapy is unsuccessful."
    },
    {
      "code": "clarif",
      "display": "Prescription/Request requires clarification",
      "definition": "Clarification is required before the order can be acted upon."
    },
    {
      "code": "drughigh",
      "display": "Drug level too high",
      "definition": "The current level of the medication in the patient's system is too high. The medication is suspended to allow the level to subside to a safer level."
    },
    {
      "code": "hospadm",
      "display": "Admission to hospital",
      "definition": "The patient has been admitted to a care facility and their community medications are suspended until hospital discharge."
    },
    {
      "code": "labint",
      "display": "Lab interference issues",
      "definition": "The therapy would interfere with a planned lab test and the therapy is being withdrawn until the test is completed."
    },
    {
      "code": "non-avail",
      "display": "Patient not available",
      "definition": "Patient not available for a period of time due to a scheduled therapy, leave of absence or other reason."
    },
    {
      "code": "preg",
      "display": "Patient is pregnant or breastfeeding",
      "definition": "The patient is pregnant or breast feeding. The therapy will be resumed when the pregnancy is complete and the patient is no longer breastfeeding."
    },
    {
      "code": "saig",
      "display": "Allergy",
      "definition": "The patient is believed to be allergic to a substance that is part of the therapy and the therapy is being temporarily withdrawn to confirm."
    },
    {
      "code": "sddi",
      "display": "Drug interacts with another drug",
      "definition": "The drug interacts with a short-term treatment that is more urgently required. This order will be resumed when the short-term treatment is complete."
    },
    {
      "code": "sdupther",
      "display": "Duplicate therapy",
      "definition": "Another short-term co-occurring therapy fulfills the same purpose as this therapy. This therapy will be resumed when the co-occuring therapy is complete."
    },
    {
      "code": "sintol",
      "display": "Suspected intolerance",
      "definition": "The patient is believed to have an intolerance to a substance that is part of the therapy and the therapy is being temporarily withdrawn to confirm."
    },
    {
      "code": "surg",
      "display": "Patient scheduled for surgery",
      "definition": "The drug is contraindicated for patients receiving surgery and the patient is scheduled to be admitted for surgery in the near future. The drug will be resumed when the patient has sufficiently recovered from the surgery."
    },
    {
      "code": "washout",
      "display": "Washout",
      "definition": "The patient was previously receiving a medication contraindicated with the current medication. The current medication will remain on hold until the prior medication has been cleansed from their system."
    },
    {
      "code": "outofstock",
      "display": "Drug not available - out of stock",
      "definition": "Drug out of stock. Cannot supply."
    },
    {
      "code": "offmarket",
      "display": "Drug not available - off market",
      "definition": "Drug no longer marketed Cannot supply."
    }
  ]
}