{
  "resourceType": "ValueSet",
  "id": "dicom-cid-6031-BenignPathologyCodeFromBIRADS",
  "url": "http://dicom.nema.org/medical/dicom/current/output/chtml/part16/sect_CID_6031.html",
  "identifier": [
    {
      "system": "urn:ietf:rfc:3986",
      "value": "urn:oid:1.2.840.10008.6.1.361"
    }
  ],
  "version": "20230630",
  "name": "BenignPathologyCodefromBIRADS®",
  "status": "active",
  "experimental": false,
  "date": "2024-06-17",
  "publisher": "NEMA MITA DICOM",
  "description": "Transitive closure of CID 6031 BenignPathologyCodefromBIRADS®",
  "copyright": "© 2024 NEMA",
  "compose": {
    "include": [
      {
        "system": "http://dicom.nema.org/resources/ontology/DCM",
        "concept": [
          {
            "code": "111263",
            "display": "Fibroadenomatoid hyperplasia"
          },
          {
            "code": "111264",
            "display": "Fibroadenolipoma"
          },
          {
            "code": "111292",
            "display": "Pseudoangiomatous stromal hyperplasia"
          },
          {
            "code": "111251",
            "display": "Normal axillary node"
          },
          {
            "code": "111252",
            "display": "Axillary node with calcifications"
          },
          {
            "code": "111296",
            "display": "Silicone granuloma"
          },
          {
            "code": "111253",
            "display": "Axillary node hyperplasia"
          },
          {
            "code": "111298",
            "display": "Virginal hyperplasia"
          },
          {
            "code": "111255",
            "display": "Benign cyst with blood"
          },
          {
            "code": "111290",
            "display": "Oil cyst (fat necrosis cyst)"
          },
          {
            "code": "111291",
            "display": "Post reduction mammoplasty"
          },
          {
            "code": "111256",
            "display": "Benign Calcifications"
          },
          {
            "code": "111258",
            "display": "Ductal adenoma"
          },
          {
            "code": "111259",
            "display": "Diabetic fibrous mastopathy"
          },
          {
            "code": "111281",
            "display": "Large duct papilloma"
          },
          {
            "code": "111284",
            "display": "Microglandular adenosis"
          },
          {
            "code": "111285",
            "display": "Multiple Intraductal Papillomas"
          },
          {
            "code": "111286",
            "display": "No abnormality"
          },
          {
            "code": "111287",
            "display": "Normal breast tissue"
          },
          {
            "code": "111277",
            "display": "Juvenile papillomatosis"
          },
          {
            "code": "111279",
            "display": "Lactational change"
          }
        ]
      },
      {
        "system": "http://snomed.info/sct",
        "concept": [
          {
            "code": "128651002",
            "display": "Lactating adenoma"
          },
          {
            "code": "1162890002",
            "display": "Leiomyoma"
          },
          {
            "code": "399294002",
            "display": "Cyst of breast"
          },
          {
            "code": "21381006",
            "display": "Fat necrosis of breast"
          },
          {
            "code": "77296004",
            "display": "Infarction of breast"
          },
          {
            "code": "400210000",
            "display": "Hemangioma"
          },
          {
            "code": "133855003",
            "display": "Radial scar"
          },
          {
            "code": "93473009",
            "display": "Hemangioma of subcutaneous tissue"
          },
          {
            "code": "59441001",
            "display": "Lymph node"
          },
          {
            "code": "56468002",
            "display": "Hemangioma - venous"
          },
          {
            "code": "6703006",
            "display": "Breast lobular hyperplasia"
          },
          {
            "code": "1187375007",
            "display": "Adenoma"
          },
          {
            "code": "12169001",
            "display": "Granular cell tumor"
          },
          {
            "code": "73219006",
            "display": "Angiolipoma"
          },
          {
            "code": "419670003",
            "display": "Epidermal inclusion cyst"
          },
          {
            "code": "42385006",
            "display": "Galactocele"
          },
          {
            "code": "37058002",
            "display": "Foreign body (reaction)"
          },
          {
            "code": "76197007",
            "display": "Hyperplasia, usual"
          },
          {
            "code": "134328007",
            "display": "Lipoma"
          },
          {
            "code": "69954004",
            "display": "Thrombophlebitis of breast (Mondor's disease)"
          },
          {
            "code": "12402003",
            "display": "Scar tissue"
          },
          {
            "code": "14350002",
            "display": "Angiomatosis"
          },
          {
            "code": "57597008",
            "display": "Adenosis"
          },
          {
            "code": "67617000",
            "display": "Ductal hyperplasia, Usual"
          },
          {
            "code": "404029005",
            "display": "Neurofibroma"
          },
          {
            "code": "254845004",
            "display": "Fibroadenoma"
          },
          {
            "code": "56021002",
            "display": "Seroma"
          },
          {
            "code": "4754008",
            "display": "Gynecomastia"
          },
          {
            "code": "47284001",
            "display": "Extra abdominal desmoid"
          },
          {
            "code": "34882000",
            "display": "Giant fibroadenoma"
          },
          {
            "code": "19928005",
            "display": "Fibromatosis"
          },
          {
            "code": "409774005",
            "display": "Inflammation"
          },
          {
            "code": "443808008",
            "display": "Intramammary lymph node"
          },
          {
            "code": "81274009",
            "display": "Apocrine Metaplasia"
          },
          {
            "code": "5244003",
            "display": "Intraductal papilloma"
          },
          {
            "code": "35566002",
            "display": "Hematoma"
          },
          {
            "code": "37279009",
            "display": "Amyloid (tumor)"
          },
          {
            "code": "444408007",
            "display": "Tubular adenoma"
          },
          {
            "code": "711329002",
            "display": "Papilloma"
          },
          {
            "code": "81669005",
            "display": "Neurofibromatosis"
          },
          {
            "code": "8360001",
            "display": "Pleomorphic adenoma"
          },
          {
            "code": "128765009",
            "display": "Adenomyoepithelioma"
          },
          {
            "code": "45559001",
            "display": "Focal fibrosis"
          },
          {
            "code": "47488001",
            "display": "Intracystic papilloma"
          },
          {
            "code": "128738002",
            "display": "Myofibroblastoma"
          },
          {
            "code": "46212000",
            "display": "Juvenile fibroadenoma"
          },
          {
            "code": "1896004",
            "display": "Ectopic (accessory) breast tissue"
          },
          {
            "code": "44132006",
            "display": "Abscess"
          },
          {
            "code": "50916005",
            "display": "Sclerosing adenosis"
          },
          {
            "code": "79654002",
            "display": "Edema"
          },
          {
            "code": "22024005",
            "display": "Adenolipoma"
          },
          {
            "code": "51398009",
            "display": "Hamartoma"
          },
          {
            "code": "130963002",
            "display": "Asynchronous involution of breast"
          },
          {
            "code": "27431007",
            "display": "Fibrocystic disease of breast"
          },
          {
            "code": "22049009",
            "display": "Mammary duct ectasia"
          },
          {
            "code": "31186001",
            "display": "Chondroma"
          },
          {
            "code": "92248004",
            "display": "Benign neoplasm of nipple of female breast (Nipple adenoma)"
          }
        ]
      }
    ]
  },
  "meta": {
    "tag": [
      {
        "system": "https://mii-termserv.de/fhir/su-termserv/CodeSystem/mii-cs-suts-resource-tags-project",
        "code": "dicom",
        "display": "Digital Imaging and Communications in Medicine"
      },
      {
        "system": "https://mii-termserv.de/fhir/su-termserv/CodeSystem/mii-cs-suts-resource-tags-project",
        "code": "international",
        "display": "International standard terminology"
      },
      {
        "system": "https://mii-termserv.de/fhir/su-termserv/CodeSystem/mii-cs-suts-resource-tags-dataset",
        "code": "dicom",
        "display": "DICOM Terminology"
      },
      {
        "system": "https://mii-termserv.de/fhir/su-termserv/CodeSystem/mii-cs-suts-resource-tags-dataset",
        "code": "standard",
        "display": "International Standards"
      },
      {
        "system": "https://mii-termserv.de/fhir/su-termserv/CodeSystem/mii-cs-suts-resource-tags-license",
        "code": "https://mii-termserv.de/licenses#dicom",
        "display": "DICOM license"
      }
    ]
  },
  "title": "BenignPathologyCodefromBIRADS®",
  "text": {
    "status": "generated",
    "div": "<div xmlns=\"http://www.w3.org/1999/xhtml\"><h2>BenignPathologyCodefromBIRADS®</h2><tt>http://dicom.nema.org/medical/dicom/current/output/chtml/part16/sect_CID_6031.html</tt><p>Transitive closure of CID 6031 BenignPathologyCodefromBIRADS®</p><div><p><b>SU-TermServ Metadata</b></p><table><tbody><tr><td><b>Projects</b></td><td><ul><li>Digital Imaging and Communications in Medicine</li><li>International standard terminology</li></ul></td></tr><tr><td><b>Datasets</b></td><td><ul><li>DICOM Terminology</li><li>International Standards</li></ul></td></tr><tr><td><b>License</b></td><td><a href=\"https://mii-termserv.de/licenses#dicom\">DICOM license</a></td></tr><tr><td><b>Package Scope</b></td><td><a href=\"https://gitlab.com/groups/mii-termserv/fhir-resources/-/packages/?ForderBy%3Dversion%26sort%3Ddesc%26search%5B%5D%3D@mii-termserv/dicom.terminology\"><code>@mii-termserv/dicom.terminology</code></a></td></tr></tbody></table></div></div>"
  },
  "extension": [
    {
      "url": "http://hl7.org/fhir/StructureDefinition/cqf-scope",
      "valueString": "@mii-termserv/dicom.terminology"
    }
  ]
}