{
  "resourceType": "ValueSet",
  "id": "dicom-cid-3250-CatheterizationProcedurePhase",
  "url": "http://dicom.nema.org/medical/dicom/current/output/chtml/part16/sect_CID_3250.html",
  "identifier": [
    {
      "system": "urn:ietf:rfc:3986",
      "value": "urn:oid:1.2.840.10008.6.1.55"
    }
  ],
  "version": "20160314",
  "name": "CatheterizationProcedurePhase",
  "status": "active",
  "experimental": false,
  "date": "2024-06-17",
  "publisher": "NEMA MITA DICOM",
  "description": "Transitive closure of CID 3250 CatheterizationProcedurePhase",
  "copyright": "© 2024 NEMA",
  "compose": {
    "include": [
      {
        "system": "http://snomed.info/sct",
        "concept": [
          {
            "code": "128955008",
            "display": "Cardiac catheterization baseline phase"
          },
          {
            "code": "128956009",
            "display": "Cardiac catheterization image acquisition phase"
          },
          {
            "code": "128952006",
            "display": "Catheterization of both left and right heart with graft"
          },
          {
            "code": "67338003",
            "display": "Transseptal catheterization"
          },
          {
            "code": "133882006",
            "display": "Drug Infusion Challenge"
          },
          {
            "code": "128957000",
            "display": "Cardiac catheterization intervention phase"
          },
          {
            "code": "128959002",
            "display": "Cardiac catheterization therapy phase"
          },
          {
            "code": "128953001",
            "display": "Catheterization of both left and right heart without graft"
          },
          {
            "code": "129083002",
            "display": "Cardiac catheterization post contrast phase"
          },
          {
            "code": "128975004",
            "display": "Resting State"
          },
          {
            "code": "128958005",
            "display": "Cardiac catheterization pre-intervention phase"
          },
          {
            "code": "373105002",
            "display": "Cardiac catheterization test/challenge phase"
          },
          {
            "code": "67629009",
            "display": "Catheterization of left heart"
          },
          {
            "code": "128960007",
            "display": "Cardiac catheterization post-intervention phase"
          },
          {
            "code": "128961006",
            "display": "Cardiac catheterization bailout phase"
          },
          {
            "code": "40403005",
            "display": "Catheterization of right heart"
          },
          {
            "code": "128967005",
            "display": "Exercise challenge"
          }
        ]
      }
    ]
  },
  "meta": {
    "tag": [
      {
        "system": "https://mii-termserv.de/fhir/su-termserv/CodeSystem/mii-cs-suts-resource-tags-project",
        "code": "dicom",
        "display": "Digital Imaging and Communications in Medicine"
      },
      {
        "system": "https://mii-termserv.de/fhir/su-termserv/CodeSystem/mii-cs-suts-resource-tags-project",
        "code": "international",
        "display": "International standard terminology"
      },
      {
        "system": "https://mii-termserv.de/fhir/su-termserv/CodeSystem/mii-cs-suts-resource-tags-dataset",
        "code": "dicom",
        "display": "DICOM Terminology"
      },
      {
        "system": "https://mii-termserv.de/fhir/su-termserv/CodeSystem/mii-cs-suts-resource-tags-dataset",
        "code": "standard",
        "display": "International Standards"
      },
      {
        "system": "https://mii-termserv.de/fhir/su-termserv/CodeSystem/mii-cs-suts-resource-tags-license",
        "code": "https://mii-termserv.de/licenses#dicom",
        "display": "DICOM license"
      }
    ]
  },
  "title": "CatheterizationProcedurePhase",
  "text": {
    "status": "generated",
    "div": "<div xmlns=\"http://www.w3.org/1999/xhtml\"><h2>CatheterizationProcedurePhase</h2><tt>http://dicom.nema.org/medical/dicom/current/output/chtml/part16/sect_CID_3250.html</tt><p>Transitive closure of CID 3250 CatheterizationProcedurePhase</p><div><p><b>SU-TermServ Metadata</b></p><table><tbody><tr><td><b>Projects</b></td><td><ul><li>Digital Imaging and Communications in Medicine</li><li>International standard terminology</li></ul></td></tr><tr><td><b>Datasets</b></td><td><ul><li>DICOM Terminology</li><li>International Standards</li></ul></td></tr><tr><td><b>License</b></td><td><a href=\"https://mii-termserv.de/licenses#dicom\">DICOM license</a></td></tr><tr><td><b>Package Scope</b></td><td><a href=\"https://gitlab.com/groups/mii-termserv/fhir-resources/-/packages/?ForderBy%3Dversion%26sort%3Ddesc%26search%5B%5D%3D@mii-termserv/dicom.terminology\"><code>@mii-termserv/dicom.terminology</code></a></td></tr></tbody></table></div></div>"
  },
  "extension": [
    {
      "url": "http://hl7.org/fhir/StructureDefinition/cqf-scope",
      "valueString": "@mii-termserv/dicom.terminology"
    }
  ]
}