{
  "resourceType": "ValueSet",
  "id": "dicom-cid-7602-VertebralAnatomicStructure",
  "url": "http://dicom.nema.org/medical/dicom/current/output/chtml/part16/sect_CID_7602.html",
  "identifier": [
    {
      "system": "urn:ietf:rfc:3986",
      "value": "urn:oid:1.2.840.10008.6.1.1433"
    }
  ],
  "version": "20220115",
  "name": "VertebralAnatomicStructure",
  "status": "active",
  "experimental": false,
  "date": "2024-06-17",
  "publisher": "NEMA MITA DICOM",
  "description": "Transitive closure of CID 7602 VertebralAnatomicStructure",
  "copyright": "© 2024 NEMA",
  "compose": {
    "include": [
      {
        "system": "http://snomed.info/sct",
        "concept": [
          {
            "code": "66794005",
            "display": "L1 vertebra"
          },
          {
            "code": "2620004",
            "display": "T3/T4 disc"
          },
          {
            "code": "58820006",
            "display": "C3/C4 disc"
          },
          {
            "code": "62487009",
            "display": "T7 vertebra"
          },
          {
            "code": "1537001",
            "display": "T11/T12 disc"
          },
          {
            "code": "39976000",
            "display": "C2 vertebra"
          },
          {
            "code": "6004007",
            "display": "T2/T3 disc"
          },
          {
            "code": "73071006",
            "display": "T4 vertebra"
          },
          {
            "code": "14806007",
            "display": "C1 vertebra"
          },
          {
            "code": "11068009",
            "display": "T8 vertebra"
          },
          {
            "code": "113209001",
            "display": "T9/T10 disc"
          },
          {
            "code": "84020006",
            "display": "L4/L5 disc"
          },
          {
            "code": "82687006",
            "display": "T9 vertebra"
          },
          {
            "code": "7610001",
            "display": "T10 vertebra"
          },
          {
            "code": "1078209008",
            "display": "C2/C3 disc"
          },
          {
            "code": "36978003",
            "display": "C5 vertebra"
          },
          {
            "code": "62551000",
            "display": "L3/L4 disc"
          },
          {
            "code": "28693002",
            "display": "T7/T8 disc"
          },
          {
            "code": "23215003",
            "display": "T12 vertebra"
          },
          {
            "code": "113205007",
            "display": "C3 vertebra"
          },
          {
            "code": "72692000",
            "display": "T5/T6 disc"
          },
          {
            "code": "12989004",
            "display": "T11 vertebra"
          },
          {
            "code": "53733008",
            "display": "T2 vertebra"
          },
          {
            "code": "74401007",
            "display": "T6/T7 disc"
          },
          {
            "code": "67459009",
            "display": "L2/L3 disc"
          },
          {
            "code": "73959003",
            "display": "C5/C6 disc"
          },
          {
            "code": "76206002",
            "display": "T12/L1 disc"
          },
          {
            "code": "1626008",
            "display": "T3 vertebra"
          },
          {
            "code": "56401006",
            "display": "T5 vertebra"
          },
          {
            "code": "64864005",
            "display": "T1 vertebra"
          },
          {
            "code": "14293000",
            "display": "L2 vertebra"
          },
          {
            "code": "36470004",
            "display": "L3 vertebra"
          },
          {
            "code": "82965004",
            "display": "T4/T5 disc"
          },
          {
            "code": "80064006",
            "display": "L1/L2 disc"
          },
          {
            "code": "11994002",
            "display": "L4 vertebra"
          },
          {
            "code": "37414007",
            "display": "C7/T1 disc"
          },
          {
            "code": "87391001",
            "display": "C7 vertebra"
          },
          {
            "code": "34959001",
            "display": "T10/T11 disc"
          },
          {
            "code": "9188009",
            "display": "T8/T9 disc"
          },
          {
            "code": "36054005",
            "display": "C6 vertebra"
          },
          {
            "code": "45296009",
            "display": "T6 vertebra"
          },
          {
            "code": "40908007",
            "display": "T1/T2 disc"
          },
          {
            "code": "715056000",
            "display": "L5/S1 disc"
          },
          {
            "code": "75095006",
            "display": "C6/C7 disc"
          },
          {
            "code": "5329002",
            "display": "C4 vertebra"
          },
          {
            "code": "49668003",
            "display": "L5 vertebra"
          },
          {
            "code": "49400002",
            "display": "C4/C5 disc"
          }
        ]
      }
    ]
  },
  "meta": {
    "tag": [
      {
        "system": "https://mii-termserv.de/fhir/su-termserv/CodeSystem/mii-cs-suts-resource-tags-project",
        "code": "dicom",
        "display": "Digital Imaging and Communications in Medicine"
      },
      {
        "system": "https://mii-termserv.de/fhir/su-termserv/CodeSystem/mii-cs-suts-resource-tags-project",
        "code": "international",
        "display": "International standard terminology"
      },
      {
        "system": "https://mii-termserv.de/fhir/su-termserv/CodeSystem/mii-cs-suts-resource-tags-dataset",
        "code": "dicom",
        "display": "DICOM Terminology"
      },
      {
        "system": "https://mii-termserv.de/fhir/su-termserv/CodeSystem/mii-cs-suts-resource-tags-dataset",
        "code": "standard",
        "display": "International Standards"
      },
      {
        "system": "https://mii-termserv.de/fhir/su-termserv/CodeSystem/mii-cs-suts-resource-tags-license",
        "code": "https://mii-termserv.de/licenses#dicom",
        "display": "DICOM license"
      }
    ]
  },
  "title": "VertebralAnatomicStructure",
  "text": {
    "status": "generated",
    "div": "<div xmlns=\"http://www.w3.org/1999/xhtml\"><h2>VertebralAnatomicStructure</h2><tt>http://dicom.nema.org/medical/dicom/current/output/chtml/part16/sect_CID_7602.html</tt><p>Transitive closure of CID 7602 VertebralAnatomicStructure</p><div><p><b>SU-TermServ Metadata</b></p><table><tbody><tr><td><b>Projects</b></td><td><ul><li>Digital Imaging and Communications in Medicine</li><li>International standard terminology</li></ul></td></tr><tr><td><b>Datasets</b></td><td><ul><li>DICOM Terminology</li><li>International Standards</li></ul></td></tr><tr><td><b>License</b></td><td><a href=\"https://mii-termserv.de/licenses#dicom\">DICOM license</a></td></tr><tr><td><b>Package Scope</b></td><td><a href=\"https://gitlab.com/groups/mii-termserv/fhir-resources/-/packages/?ForderBy%3Dversion%26sort%3Ddesc%26search%5B%5D%3D@mii-termserv/dicom.terminology\"><code>@mii-termserv/dicom.terminology</code></a></td></tr></tbody></table></div></div>"
  },
  "extension": [
    {
      "url": "http://hl7.org/fhir/StructureDefinition/cqf-scope",
      "valueString": "@mii-termserv/dicom.terminology"
    }
  ]
}