{
  "resourceType": "ValueSet",
  "id": "dicom-cid-4020-PETRadionuclide",
  "url": "http://dicom.nema.org/medical/dicom/current/output/chtml/part16/sect_CID_4020.html",
  "identifier": [
    {
      "system": "urn:ietf:rfc:3986",
      "value": "urn:oid:1.2.840.10008.6.1.304"
    }
  ],
  "version": "20160119",
  "name": "PETRadionuclide",
  "status": "active",
  "experimental": false,
  "date": "2024-06-17",
  "publisher": "NEMA MITA DICOM",
  "description": "Transitive closure of CID 4020 PETRadionuclide",
  "copyright": "© 2024 NEMA",
  "compose": {
    "include": [
      {
        "system": "http://dicom.nema.org/resources/ontology/DCM",
        "concept": [
          {
            "code": "126601",
            "display": "^51^Manganese"
          },
          {
            "code": "126602",
            "display": "^70^Arsenic"
          },
          {
            "code": "126603",
            "display": "^90^Niobium"
          },
          {
            "code": "126605",
            "display": "^43^Scandium"
          },
          {
            "code": "126606",
            "display": "^152^Terbium"
          },
          {
            "code": "126607",
            "display": "^52m^Manganese"
          },
          {
            "code": "126600",
            "display": "^44^Scandium"
          }
        ]
      },
      {
        "system": "http://snomed.info/sct",
        "concept": [
          {
            "code": "71633006",
            "display": "^22^Sodium"
          },
          {
            "code": "87437000",
            "display": "^73^Selenium"
          },
          {
            "code": "425364008",
            "display": "^60^Copper"
          },
          {
            "code": "424875009",
            "display": "^14^Oxygen"
          },
          {
            "code": "79477007",
            "display": "^66^Gallium"
          },
          {
            "code": "79523006",
            "display": "^76^Bromine"
          },
          {
            "code": "75696008",
            "display": "^45^Titanium"
          },
          {
            "code": "53315004",
            "display": "^68^Germanium"
          },
          {
            "code": "63360001",
            "display": "^89^Zirconium"
          },
          {
            "code": "129504001",
            "display": "^15^Oxygen"
          },
          {
            "code": "79197006",
            "display": "^82^Rubidium"
          },
          {
            "code": "40565003",
            "display": "^11^Carbon"
          },
          {
            "code": "422934004",
            "display": "^62^Copper"
          },
          {
            "code": "35337001",
            "display": "^68^Gallium"
          },
          {
            "code": "17910003",
            "display": "^75^Bromine"
          },
          {
            "code": "77004003",
            "display": "^18^Fluorine"
          },
          {
            "code": "65054007",
            "display": "^62^Zinc"
          },
          {
            "code": "3932008",
            "display": "^64^Copper"
          },
          {
            "code": "86521004",
            "display": "^77^Bromine"
          },
          {
            "code": "424079002",
            "display": "^94m^Technetium"
          },
          {
            "code": "14691008",
            "display": "^90^Yttrium"
          },
          {
            "code": "40937006",
            "display": "^124^Iodine"
          },
          {
            "code": "423764008",
            "display": "^38^Potassium"
          },
          {
            "code": "10738001",
            "display": "^86^Yttrium"
          },
          {
            "code": "71425003",
            "display": "^61^Copper"
          },
          {
            "code": "69089000",
            "display": "^52^Iron"
          },
          {
            "code": "37225000",
            "display": "^52^Manganese"
          },
          {
            "code": "2705002",
            "display": "^72^Arsenic"
          },
          {
            "code": "21576001",
            "display": "^13^Nitrogen"
          }
        ]
      }
    ]
  },
  "meta": {
    "tag": [
      {
        "system": "https://mii-termserv.de/fhir/su-termserv/CodeSystem/mii-cs-suts-resource-tags-project",
        "code": "dicom",
        "display": "Digital Imaging and Communications in Medicine"
      },
      {
        "system": "https://mii-termserv.de/fhir/su-termserv/CodeSystem/mii-cs-suts-resource-tags-project",
        "code": "international",
        "display": "International standard terminology"
      },
      {
        "system": "https://mii-termserv.de/fhir/su-termserv/CodeSystem/mii-cs-suts-resource-tags-dataset",
        "code": "dicom",
        "display": "DICOM Terminology"
      },
      {
        "system": "https://mii-termserv.de/fhir/su-termserv/CodeSystem/mii-cs-suts-resource-tags-dataset",
        "code": "standard",
        "display": "International Standards"
      },
      {
        "system": "https://mii-termserv.de/fhir/su-termserv/CodeSystem/mii-cs-suts-resource-tags-license",
        "code": "https://mii-termserv.de/licenses#dicom",
        "display": "DICOM license"
      }
    ]
  },
  "title": "PETRadionuclide",
  "text": {
    "status": "generated",
    "div": "<div xmlns=\"http://www.w3.org/1999/xhtml\"><h2>PETRadionuclide</h2><tt>http://dicom.nema.org/medical/dicom/current/output/chtml/part16/sect_CID_4020.html</tt><p>Transitive closure of CID 4020 PETRadionuclide</p><div><p><b>SU-TermServ Metadata</b></p><table><tbody><tr><td><b>Projects</b></td><td><ul><li>Digital Imaging and Communications in Medicine</li><li>International standard terminology</li></ul></td></tr><tr><td><b>Datasets</b></td><td><ul><li>DICOM Terminology</li><li>International Standards</li></ul></td></tr><tr><td><b>License</b></td><td><a href=\"https://mii-termserv.de/licenses#dicom\">DICOM license</a></td></tr><tr><td><b>Package Scope</b></td><td><a href=\"https://gitlab.com/groups/mii-termserv/fhir-resources/-/packages/?ForderBy%3Dversion%26sort%3Ddesc%26search%5B%5D%3D@mii-termserv/dicom.terminology\"><code>@mii-termserv/dicom.terminology</code></a></td></tr></tbody></table></div></div>"
  },
  "extension": [
    {
      "url": "http://hl7.org/fhir/StructureDefinition/cqf-scope",
      "valueString": "@mii-termserv/dicom.terminology"
    }
  ]
}