{
  "resourceType": "ValueSet",
  "id": "dicom-cid-6204-AnatomicNoncolonFinding",
  "url": "http://dicom.nema.org/medical/dicom/current/output/chtml/part16/sect_CID_6204.html",
  "identifier": [
    {
      "system": "urn:ietf:rfc:3986",
      "value": "urn:oid:1.2.840.10008.6.1.791"
    }
  ],
  "version": "20090402",
  "name": "AnatomicNoncolonFinding",
  "status": "active",
  "experimental": false,
  "date": "2024-06-17",
  "publisher": "NEMA MITA DICOM",
  "description": "Transitive closure of CID 6204 AnatomicNoncolonFinding",
  "copyright": "© 2024 NEMA",
  "compose": {
    "include": [
      {
        "system": "http://snomed.info/sct",
        "concept": [
          {
            "code": "39607008",
            "display": "Lung"
          },
          {
            "code": "40689003",
            "display": "Testis"
          },
          {
            "code": "71252005",
            "display": "Cervix"
          },
          {
            "code": "89837001",
            "display": "Bladder"
          },
          {
            "code": "66754008",
            "display": "Appendix"
          },
          {
            "code": "59820001",
            "display": "Blood Vessel"
          },
          {
            "code": "15825003",
            "display": "Aorta"
          },
          {
            "code": "64131007",
            "display": "Inferior vena cava"
          },
          {
            "code": "64739004",
            "display": "Seminal Vesicle"
          },
          {
            "code": "34402009",
            "display": "Rectum"
          },
          {
            "code": "15497006",
            "display": "Ovary"
          },
          {
            "code": "441850003",
            "display": "Appendiceal stump"
          },
          {
            "code": "71616004",
            "display": "Muscle"
          },
          {
            "code": "272673000",
            "display": "Bone"
          },
          {
            "code": "10200004",
            "display": "Liver"
          },
          {
            "code": "41216001",
            "display": "Prostate"
          },
          {
            "code": "78961009",
            "display": "Spleen"
          },
          {
            "code": "64033007",
            "display": "Kidney"
          },
          {
            "code": "23451007",
            "display": "Adrenal gland"
          },
          {
            "code": "35039007",
            "display": "Uterus"
          }
        ]
      }
    ]
  },
  "meta": {
    "tag": [
      {
        "system": "https://mii-termserv.de/fhir/su-termserv/CodeSystem/mii-cs-suts-resource-tags-project",
        "code": "dicom",
        "display": "Digital Imaging and Communications in Medicine"
      },
      {
        "system": "https://mii-termserv.de/fhir/su-termserv/CodeSystem/mii-cs-suts-resource-tags-project",
        "code": "international",
        "display": "International standard terminology"
      },
      {
        "system": "https://mii-termserv.de/fhir/su-termserv/CodeSystem/mii-cs-suts-resource-tags-dataset",
        "code": "dicom",
        "display": "DICOM Terminology"
      },
      {
        "system": "https://mii-termserv.de/fhir/su-termserv/CodeSystem/mii-cs-suts-resource-tags-dataset",
        "code": "standard",
        "display": "International Standards"
      },
      {
        "system": "https://mii-termserv.de/fhir/su-termserv/CodeSystem/mii-cs-suts-resource-tags-license",
        "code": "https://mii-termserv.de/licenses#dicom",
        "display": "DICOM license"
      }
    ]
  },
  "title": "AnatomicNoncolonFinding",
  "text": {
    "status": "generated",
    "div": "<div xmlns=\"http://www.w3.org/1999/xhtml\"><h2>AnatomicNoncolonFinding</h2><tt>http://dicom.nema.org/medical/dicom/current/output/chtml/part16/sect_CID_6204.html</tt><p>Transitive closure of CID 6204 AnatomicNoncolonFinding</p><div><p><b>SU-TermServ Metadata</b></p><table><tbody><tr><td><b>Projects</b></td><td><ul><li>Digital Imaging and Communications in Medicine</li><li>International standard terminology</li></ul></td></tr><tr><td><b>Datasets</b></td><td><ul><li>DICOM Terminology</li><li>International Standards</li></ul></td></tr><tr><td><b>License</b></td><td><a href=\"https://mii-termserv.de/licenses#dicom\">DICOM license</a></td></tr><tr><td><b>Package Scope</b></td><td><a href=\"https://gitlab.com/groups/mii-termserv/fhir-resources/-/packages/?ForderBy%3Dversion%26sort%3Ddesc%26search%5B%5D%3D@mii-termserv/dicom.terminology\"><code>@mii-termserv/dicom.terminology</code></a></td></tr></tbody></table></div></div>"
  },
  "extension": [
    {
      "url": "http://hl7.org/fhir/StructureDefinition/cqf-scope",
      "valueString": "@mii-termserv/dicom.terminology"
    }
  ]
}