{
  "resourceType": "ValueSet",
  "id": "dicom-cid-1006-AnatomicalReferenceBasisExtremity",
  "url": "http://dicom.nema.org/medical/dicom/current/output/chtml/part16/sect_CID_1006.html",
  "identifier": [
    {
      "system": "urn:ietf:rfc:3986",
      "value": "urn:oid:1.2.840.10008.6.1.1127"
    }
  ],
  "version": "20160905",
  "name": "AnatomicalReferenceBasisExtremity",
  "status": "active",
  "experimental": false,
  "date": "2024-06-17",
  "publisher": "NEMA MITA DICOM",
  "description": "Transitive closure of CID 1006 AnatomicalReferenceBasisExtremity",
  "copyright": "© 2024 NEMA",
  "compose": {
    "include": [
      {
        "system": "http://snomed.info/sct",
        "concept": [
          {
            "code": "56459004",
            "display": "Foot"
          },
          {
            "code": "49076000",
            "display": "Knee joint"
          },
          {
            "code": "29707007",
            "display": "Toe"
          },
          {
            "code": "314796009",
            "display": "Malleolar structure of tibia"
          },
          {
            "code": "306783000",
            "display": "Tibial Plateau"
          },
          {
            "code": "16953009",
            "display": "Elbow joint"
          },
          {
            "code": "64234005",
            "display": "Patella"
          },
          {
            "code": "74670003",
            "display": "Wrist joint"
          },
          {
            "code": "70258002",
            "display": "Ankle joint"
          },
          {
            "code": "36455000",
            "display": "Metacarpal"
          },
          {
            "code": "30518006",
            "display": "Scaphoid"
          },
          {
            "code": "67453005",
            "display": "Talus"
          }
        ]
      }
    ]
  },
  "meta": {
    "tag": [
      {
        "system": "https://mii-termserv.de/fhir/su-termserv/CodeSystem/mii-cs-suts-resource-tags-project",
        "code": "dicom",
        "display": "Digital Imaging and Communications in Medicine"
      },
      {
        "system": "https://mii-termserv.de/fhir/su-termserv/CodeSystem/mii-cs-suts-resource-tags-project",
        "code": "international",
        "display": "International standard terminology"
      },
      {
        "system": "https://mii-termserv.de/fhir/su-termserv/CodeSystem/mii-cs-suts-resource-tags-dataset",
        "code": "dicom",
        "display": "DICOM Terminology"
      },
      {
        "system": "https://mii-termserv.de/fhir/su-termserv/CodeSystem/mii-cs-suts-resource-tags-dataset",
        "code": "standard",
        "display": "International Standards"
      },
      {
        "system": "https://mii-termserv.de/fhir/su-termserv/CodeSystem/mii-cs-suts-resource-tags-license",
        "code": "https://mii-termserv.de/licenses#dicom",
        "display": "DICOM license"
      }
    ]
  },
  "title": "AnatomicalReferenceBasisExtremity",
  "text": {
    "status": "generated",
    "div": "<div xmlns=\"http://www.w3.org/1999/xhtml\"><h2>AnatomicalReferenceBasisExtremity</h2><tt>http://dicom.nema.org/medical/dicom/current/output/chtml/part16/sect_CID_1006.html</tt><p>Transitive closure of CID 1006 AnatomicalReferenceBasisExtremity</p><div><p><b>SU-TermServ Metadata</b></p><table><tbody><tr><td><b>Projects</b></td><td><ul><li>Digital Imaging and Communications in Medicine</li><li>International standard terminology</li></ul></td></tr><tr><td><b>Datasets</b></td><td><ul><li>DICOM Terminology</li><li>International Standards</li></ul></td></tr><tr><td><b>License</b></td><td><a href=\"https://mii-termserv.de/licenses#dicom\">DICOM license</a></td></tr><tr><td><b>Package Scope</b></td><td><a href=\"https://gitlab.com/groups/mii-termserv/fhir-resources/-/packages/?ForderBy%3Dversion%26sort%3Ddesc%26search%5B%5D%3D@mii-termserv/dicom.terminology\"><code>@mii-termserv/dicom.terminology</code></a></td></tr></tbody></table></div></div>"
  },
  "extension": [
    {
      "url": "http://hl7.org/fhir/StructureDefinition/cqf-scope",
      "valueString": "@mii-termserv/dicom.terminology"
    }
  ]
}