{
  "resourceType": "ValueSet",
  "id": "dicom-cid-7469-GenericIntensityAndSizeMeasurement",
  "url": "http://dicom.nema.org/medical/dicom/current/output/chtml/part16/sect_CID_7469.html",
  "identifier": [
    {
      "system": "urn:ietf:rfc:3986",
      "value": "urn:oid:1.2.840.10008.6.1.1003"
    }
  ],
  "version": "20141110",
  "name": "GenericIntensityandSizeMeasurement",
  "status": "active",
  "experimental": false,
  "date": "2024-06-17",
  "publisher": "NEMA MITA DICOM",
  "description": "Transitive closure of CID 7469 GenericIntensityandSizeMeasurement",
  "copyright": "© 2024 NEMA",
  "compose": {
    "include": [
      {
        "system": "http://arxiv.org/abs/1612.07003",
        "concept": [
          {
            "code": "C0JK",
            "display": "Surface Area of Mesh"
          },
          {
            "code": "L0JK",
            "display": "Maximum 3D Diameter of a Mesh"
          },
          {
            "code": "RNU0",
            "display": "Volume of Mesh"
          },
          {
            "code": "7J51",
            "display": "Least Axis in 3D Length"
          },
          {
            "code": "P9VJ",
            "display": "Minor Axis in 3D Length"
          },
          {
            "code": "YEKZ",
            "display": "Volume from Voxel Summation"
          },
          {
            "code": "TDIC",
            "display": "Major Axis in 3D Length"
          }
        ]
      },
      {
        "system": "http://dicom.nema.org/resources/ontology/DCM",
        "concept": [
          {
            "code": "113041",
            "display": "Apparent Diffusion Coefficient"
          },
          {
            "code": "113043",
            "display": "Diffusion weighted"
          },
          {
            "code": "121227",
            "display": "Line segment length"
          },
          {
            "code": "113288",
            "display": "Volume Ratio"
          },
          {
            "code": "121222",
            "display": "Volume of sphere"
          },
          {
            "code": "113289",
            "display": "Diffusion Coefficient"
          },
          {
            "code": "129102",
            "display": "Water/fat out of phase"
          },
          {
            "code": "110855",
            "display": "Fractional Occupancy Segmentation"
          },
          {
            "code": "129101",
            "display": "Water/fat in phase"
          },
          {
            "code": "110854",
            "display": "Fractional Probabilistic Segmentation"
          },
          {
            "code": "110853",
            "display": "Binary Segmentation"
          },
          {
            "code": "129103",
            "display": "Water fraction"
          },
          {
            "code": "110852",
            "display": "MR signal intensity"
          },
          {
            "code": "110850",
            "display": "X-Ray Attenuation"
          },
          {
            "code": "121220",
            "display": "Volume of circumscribed sphere"
          },
          {
            "code": "121221",
            "display": "Volume of ellipsoid"
          },
          {
            "code": "129100",
            "display": "Fat fraction"
          },
          {
            "code": "121217",
            "display": "Volume estimated from three or more non-coplanar 2D regions"
          },
          {
            "code": "121218",
            "display": "Volume estimated from two non-coplanar 2D regions"
          },
          {
            "code": "121216",
            "display": "Volume estimated from single 2D region"
          },
          {
            "code": "121211",
            "display": "Path length"
          },
          {
            "code": "121219",
            "display": "Volume of bounding three dimensional region"
          },
          {
            "code": "110845",
            "display": "YBR ICT CR Component"
          },
          {
            "code": "126220",
            "display": "R2-Coefficient"
          },
          {
            "code": "110844",
            "display": "YBR ICT CB Component"
          },
          {
            "code": "126221",
            "display": "Chi-square"
          },
          {
            "code": "110843",
            "display": "YBR ICT Y Component"
          },
          {
            "code": "126222",
            "display": "D-W"
          },
          {
            "code": "110842",
            "display": "YBR PARTIAL CR Component"
          },
          {
            "code": "126223",
            "display": "AIC"
          },
          {
            "code": "110841",
            "display": "YBR PARTIAL CB Component"
          },
          {
            "code": "126224",
            "display": "BIC"
          },
          {
            "code": "110840",
            "display": "YBR PARTIAL Y Component"
          },
          {
            "code": "110849",
            "display": "Echogenicity"
          },
          {
            "code": "110848",
            "display": "YBR RCT CR Component"
          },
          {
            "code": "110847",
            "display": "YBR RCT CB Component"
          },
          {
            "code": "110846",
            "display": "YBR RCT Y Component"
          },
          {
            "code": "121206",
            "display": "Distance"
          },
          {
            "code": "121207",
            "display": "Height"
          },
          {
            "code": "130086",
            "display": "Relative Linear Stopping Power"
          },
          {
            "code": "110834",
            "display": "RGB R Component"
          },
          {
            "code": "110833",
            "display": "Ultrasound Attenuation"
          },
          {
            "code": "126330",
            "display": "tau_m"
          },
          {
            "code": "110832",
            "display": "Speed of sound"
          },
          {
            "code": "126331",
            "display": "vp"
          },
          {
            "code": "110831",
            "display": "Perfusion"
          },
          {
            "code": "110830",
            "display": "Elasticity"
          },
          {
            "code": "128512",
            "display": "Equivalent Dose"
          },
          {
            "code": "130403",
            "display": "Gradient-weighted class activation"
          },
          {
            "code": "130402",
            "display": "Class activation"
          },
          {
            "code": "128513",
            "display": "Absorbed Dose"
          },
          {
            "code": "110839",
            "display": "YBR FULL CR Component"
          },
          {
            "code": "130404",
            "display": "Saliency"
          },
          {
            "code": "110838",
            "display": "YBR FULL CB Component"
          },
          {
            "code": "110837",
            "display": "YBR FULL Y Component"
          },
          {
            "code": "110836",
            "display": "RGB B Component"
          },
          {
            "code": "110835",
            "display": "RGB G Component"
          },
          {
            "code": "113096",
            "display": "Creatine+Choline/Citrate Ratio"
          },
          {
            "code": "113098",
            "display": "Magnetization Transfer Ratio"
          },
          {
            "code": "126326",
            "display": "IAUC90BN"
          },
          {
            "code": "126327",
            "display": "IAUC180BN"
          },
          {
            "code": "113094",
            "display": "Creatine and Choline"
          },
          {
            "code": "113095",
            "display": "Lipid and Lactate"
          },
          {
            "code": "110823",
            "display": "Spatial Displacement Y Component"
          },
          {
            "code": "110822",
            "display": "Spatial Displacement X Component"
          },
          {
            "code": "110821",
            "display": "Nuclear Medicine Tomographic Activity"
          },
          {
            "code": "126320",
            "display": "IAUC"
          },
          {
            "code": "110820",
            "display": "Nuclear Medicine Projection Activity"
          },
          {
            "code": "126321",
            "display": "IAUC60"
          },
          {
            "code": "126322",
            "display": "IAUC90"
          },
          {
            "code": "126323",
            "display": "IAUC180"
          },
          {
            "code": "126324",
            "display": "IAUCBN"
          },
          {
            "code": "126325",
            "display": "IAUC60BN"
          },
          {
            "code": "110829",
            "display": "Flow Variance"
          },
          {
            "code": "110828",
            "display": "Flow Velocity"
          },
          {
            "code": "110827",
            "display": "Tissue Velocity"
          },
          {
            "code": "110826",
            "display": "Indexed Hemodynamic Resistance"
          },
          {
            "code": "110825",
            "display": "Hemodynamic Resistance"
          },
          {
            "code": "110824",
            "display": "Spatial Displacement Z Component"
          },
          {
            "code": "112031",
            "display": "Attenuation Coefficient"
          },
          {
            "code": "113080",
            "display": "Glutamate and glutamine"
          },
          {
            "code": "113081",
            "display": "Choline/Creatine Ratio"
          },
          {
            "code": "113082",
            "display": "N-acetylaspartate/Creatine Ratio"
          },
          {
            "code": "113083",
            "display": "N-acetylaspartate/Choline Ratio"
          },
          {
            "code": "113084",
            "display": "Tmax"
          },
          {
            "code": "126395",
            "display": "R2*"
          },
          {
            "code": "110812",
            "display": "Volumetric Diffusion Dxz Component"
          },
          {
            "code": "126396",
            "display": "Magnetic Susceptibility"
          },
          {
            "code": "110811",
            "display": "Volumetric Diffusion Dxy Component"
          },
          {
            "code": "110810",
            "display": "Volumetric Diffusion Dxx Component"
          },
          {
            "code": "126397",
            "display": "Relative Regional Blood Flow"
          },
          {
            "code": "126398",
            "display": "Relative Regional Blood Volume"
          },
          {
            "code": "126312",
            "display": "Ktrans"
          },
          {
            "code": "126313",
            "display": "kep"
          },
          {
            "code": "126314",
            "display": "ve"
          },
          {
            "code": "110819",
            "display": "Blood Oxygenation Level"
          },
          {
            "code": "110818",
            "display": "T2* Weighted Dynamic Contrast Enhanced MR Signal Intensity"
          },
          {
            "code": "110817",
            "display": "T2 Weighted Dynamic Contrast Enhanced MR Signal Intensity"
          },
          {
            "code": "126390",
            "display": "Absolute Regional Blood Flow"
          },
          {
            "code": "110816",
            "display": "T1 Weighted Dynamic Contrast Enhanced MR Signal Intensity"
          },
          {
            "code": "126391",
            "display": "Absolute Regional Blood Volume"
          },
          {
            "code": "110815",
            "display": "Volumetric Diffusion Dzz Component"
          },
          {
            "code": "126392",
            "display": "Oxygen Extraction Fraction"
          },
          {
            "code": "126393",
            "display": "R1"
          },
          {
            "code": "110814",
            "display": "Volumetric Diffusion Dyz Component"
          },
          {
            "code": "126394",
            "display": "R2"
          },
          {
            "code": "110813",
            "display": "Volumetric Diffusion Dyy Component"
          },
          {
            "code": "113070",
            "display": "Velocity encoded"
          },
          {
            "code": "113071",
            "display": "Z-score"
          },
          {
            "code": "110801",
            "display": "Contrast Agent Angio MR Signal Intensity"
          },
          {
            "code": "110800",
            "display": "Spin Tagging Perfusion MR Signal Intensity"
          },
          {
            "code": "110809",
            "display": "Relative Anisotropy"
          },
          {
            "code": "110808",
            "display": "Fractional Anisotropy"
          },
          {
            "code": "110807",
            "display": "Field Map MR Signal Intensity"
          },
          {
            "code": "110806",
            "display": "T2* Weighted MR Signal Intensity"
          },
          {
            "code": "110805",
            "display": "T2 Weighted MR Signal Intensity"
          },
          {
            "code": "110804",
            "display": "T1 Weighted MR Signal Intensity"
          },
          {
            "code": "110803",
            "display": "Proton Density Weighted MR Signal Intensity"
          },
          {
            "code": "110802",
            "display": "Time Of Flight Angio MR Signal Intensity"
          },
          {
            "code": "113063",
            "display": "T1"
          },
          {
            "code": "113064",
            "display": "T2*"
          },
          {
            "code": "113065",
            "display": "T2"
          },
          {
            "code": "113066",
            "display": "Time course of signal"
          },
          {
            "code": "113067",
            "display": "Temperature encoded"
          },
          {
            "code": "113068",
            "display": "Student's T-test"
          },
          {
            "code": "113069",
            "display": "Time To Peak"
          },
          {
            "code": "113060",
            "display": "Signal to noise"
          },
          {
            "code": "126374",
            "display": "Temporal Derivative Threshold"
          },
          {
            "code": "126375",
            "display": "Maximum Slope"
          },
          {
            "code": "126376",
            "display": "Maximum Difference"
          },
          {
            "code": "126377",
            "display": "Tracer Concentration"
          },
          {
            "code": "126370",
            "display": "Time of Peak Concentration"
          },
          {
            "code": "126371",
            "display": "Bolus Arrival Time"
          },
          {
            "code": "126372",
            "display": "Time of Leading Half-Peak Concentration"
          },
          {
            "code": "113052",
            "display": "Mean Transit Time"
          },
          {
            "code": "113294",
            "display": "Kurtosis Diffusion Coefficient"
          },
          {
            "code": "113295",
            "display": "Gamma Distribution Scale Parameter"
          },
          {
            "code": "113054",
            "display": "Negative enhancement integral"
          },
          {
            "code": "113296",
            "display": "Gamma Distribution Shape Parameter"
          },
          {
            "code": "113297",
            "display": "Gamma Distribution Mode"
          },
          {
            "code": "113298",
            "display": "Distributed Diffusion Coefficient"
          },
          {
            "code": "113057",
            "display": "R-Coefficient"
          },
          {
            "code": "113299",
            "display": "Anomalous Exponent Parameter"
          },
          {
            "code": "113058",
            "display": "Proton Density"
          },
          {
            "code": "113059",
            "display": "Signal change"
          },
          {
            "code": "126403",
            "display": "SUVbsa"
          },
          {
            "code": "126404",
            "display": "SUVibw"
          },
          {
            "code": "126405",
            "display": "SUVlbm(Janma)"
          },
          {
            "code": "126406",
            "display": "SUVlbm(James128)"
          },
          {
            "code": "113290",
            "display": "Mono-exponential Apparent Diffusion Coefficient"
          },
          {
            "code": "113291",
            "display": "Slow Diffusion Coefficient"
          },
          {
            "code": "113292",
            "display": "Fast Diffusion Coefficient"
          },
          {
            "code": "113293",
            "display": "Fast Diffusion Coefficient Fraction"
          },
          {
            "code": "126400",
            "display": "Standardized Uptake Value"
          },
          {
            "code": "126401",
            "display": "SUVbw"
          },
          {
            "code": "126402",
            "display": "SUVlbm"
          }
        ]
      },
      {
        "system": "http://snomed.info/sct",
        "concept": [
          {
            "code": "103355008",
            "display": "Width"
          },
          {
            "code": "118565006",
            "display": "Volume"
          },
          {
            "code": "256674009",
            "display": "Fat"
          },
          {
            "code": "42798000",
            "display": "Area"
          },
          {
            "code": "70106000",
            "display": "Lipid"
          },
          {
            "code": "131192006",
            "display": "Diameter of circumscribed circle"
          },
          {
            "code": "131197000",
            "display": "Depth"
          },
          {
            "code": "115391007",
            "display": "N-acetylaspartate"
          },
          {
            "code": "425704008",
            "display": "Power Doppler"
          },
          {
            "code": "131191004",
            "display": "Perimeter"
          },
          {
            "code": "14804005",
            "display": "Creatine"
          },
          {
            "code": "25761002",
            "display": "Glutamine"
          },
          {
            "code": "131188004",
            "display": "Minor Axis"
          },
          {
            "code": "81827009",
            "display": "Diameter"
          },
          {
            "code": "10944007",
            "display": "Tuarine"
          },
          {
            "code": "59351004",
            "display": "Citrate"
          },
          {
            "code": "131187009",
            "display": "Major Axis"
          },
          {
            "code": "83036002",
            "display": "Lactate"
          },
          {
            "code": "103339001",
            "display": "Long Axis"
          },
          {
            "code": "410668003",
            "display": "Length"
          },
          {
            "code": "74551000",
            "display": "Circumference"
          },
          {
            "code": "72164009",
            "display": "Inositol"
          },
          {
            "code": "131189007",
            "display": "Perpendicular Axis"
          },
          {
            "code": "11713004",
            "display": "Water"
          },
          {
            "code": "131190003",
            "display": "Radius"
          },
          {
            "code": "65123005",
            "display": "Choline"
          },
          {
            "code": "131184002",
            "display": "Area of defined region"
          },
          {
            "code": "103340004",
            "display": "Short Axis"
          }
        ]
      }
    ]
  },
  "meta": {
    "tag": [
      {
        "system": "https://mii-termserv.de/fhir/su-termserv/CodeSystem/mii-cs-suts-resource-tags-project",
        "code": "dicom",
        "display": "Digital Imaging and Communications in Medicine"
      },
      {
        "system": "https://mii-termserv.de/fhir/su-termserv/CodeSystem/mii-cs-suts-resource-tags-project",
        "code": "international",
        "display": "International standard terminology"
      },
      {
        "system": "https://mii-termserv.de/fhir/su-termserv/CodeSystem/mii-cs-suts-resource-tags-dataset",
        "code": "dicom",
        "display": "DICOM Terminology"
      },
      {
        "system": "https://mii-termserv.de/fhir/su-termserv/CodeSystem/mii-cs-suts-resource-tags-dataset",
        "code": "standard",
        "display": "International Standards"
      },
      {
        "system": "https://mii-termserv.de/fhir/su-termserv/CodeSystem/mii-cs-suts-resource-tags-license",
        "code": "https://mii-termserv.de/licenses#dicom",
        "display": "DICOM license"
      }
    ]
  },
  "title": "GenericIntensityandSizeMeasurement",
  "text": {
    "status": "generated",
    "div": "<div xmlns=\"http://www.w3.org/1999/xhtml\"><h2>GenericIntensityandSizeMeasurement</h2><tt>http://dicom.nema.org/medical/dicom/current/output/chtml/part16/sect_CID_7469.html</tt><p>Transitive closure of CID 7469 GenericIntensityandSizeMeasurement</p><div><p><b>SU-TermServ Metadata</b></p><table><tbody><tr><td><b>Projects</b></td><td><ul><li>Digital Imaging and Communications in Medicine</li><li>International standard terminology</li></ul></td></tr><tr><td><b>Datasets</b></td><td><ul><li>DICOM Terminology</li><li>International Standards</li></ul></td></tr><tr><td><b>License</b></td><td><a href=\"https://mii-termserv.de/licenses#dicom\">DICOM license</a></td></tr><tr><td><b>Package Scope</b></td><td><a href=\"https://gitlab.com/groups/mii-termserv/fhir-resources/-/packages/?ForderBy%3Dversion%26sort%3Ddesc%26search%5B%5D%3D@mii-termserv/dicom.terminology\"><code>@mii-termserv/dicom.terminology</code></a></td></tr></tbody></table></div></div>"
  },
  "extension": [
    {
      "url": "http://hl7.org/fhir/StructureDefinition/cqf-scope",
      "valueString": "@mii-termserv/dicom.terminology"
    }
  ]
}