{
  "resourceType": "ValueSet",
  "id": "dicom-cid-639-TumorGraftHistologicType",
  "url": "http://dicom.nema.org/medical/dicom/current/output/chtml/part16/sect_CID_639.html",
  "identifier": [
    {
      "system": "urn:ietf:rfc:3986",
      "value": "urn:oid:1.2.840.10008.6.1.1104"
    }
  ],
  "version": "20230630",
  "name": "TumorGraftHistologicType",
  "status": "active",
  "experimental": false,
  "date": "2024-06-17",
  "publisher": "NEMA MITA DICOM",
  "description": "Transitive closure of CID 639 TumorGraftHistologicType",
  "copyright": "© 2024 NEMA",
  "compose": {
    "include": [
      {
        "system": "http://dicom.nema.org/resources/ontology/DCM",
        "concept": [
          {
            "code": "130406",
            "display": "Non-uterine leiomyosarcoma"
          }
        ]
      },
      {
        "system": "http://ncit.nci.nih.gov",
        "concept": [
          {
            "code": "C2923",
            "display": "Bronchioloalveolar adenocarcinoma"
          },
          {
            "code": "C148457",
            "display": "Soft tissue sarcoma, excluding rhabdomyosarcoma"
          }
        ]
      },
      {
        "system": "http://snomed.info/sct",
        "concept": [
          {
            "code": "702369008",
            "display": "Carcinosarcoma of uterus"
          },
          {
            "code": "128632008",
            "display": "Non-small cell carcinoma"
          },
          {
            "code": "1163405004",
            "display": "Osteosarcoma"
          },
          {
            "code": "254634000",
            "display": "Squamous cell carcinoma of lung"
          },
          {
            "code": "70594002",
            "display": "Amelanotic melanoma"
          },
          {
            "code": "65692009",
            "display": "Spindle cell carcinoma"
          },
          {
            "code": "27090000",
            "display": "Transitional cell carcinoma"
          },
          {
            "code": "63264007",
            "display": "Carcinosarcoma"
          },
          {
            "code": "703707001",
            "display": "Ewing sarcoma / peripheral neuroectodermal tumor"
          },
          {
            "code": "399326009",
            "display": "Bladder cancer"
          },
          {
            "code": "363406005",
            "display": "Cancer of colon"
          },
          {
            "code": "363354003",
            "display": "Cancer of cervix"
          },
          {
            "code": "255046005",
            "display": "Neuroendocrine tumor"
          },
          {
            "code": "93880001",
            "display": "Lung cancer"
          },
          {
            "code": "702391001",
            "display": "Renal cell carcinoma"
          },
          {
            "code": "1187396000",
            "display": "Sarcoma"
          },
          {
            "code": "254582000",
            "display": "Adenocarcinoma of rectum"
          },
          {
            "code": "307502000",
            "display": "Squamous cell carcinoma of mouth"
          },
          {
            "code": "723265000",
            "display": "Squamous cell carcinoma of anus"
          },
          {
            "code": "255072001",
            "display": "Cancer of salivary gland"
          },
          {
            "code": "1187425009",
            "display": "Carcinoma"
          },
          {
            "code": "716659002",
            "display": "Squamous cell carcinoma of head and neck"
          },
          {
            "code": "408643008",
            "display": "Infiltrating ductal carcinoma of breast"
          },
          {
            "code": "62064005",
            "display": "Malignant mesothelioma"
          },
          {
            "code": "21008007",
            "display": "Cystadenocarcinoma"
          },
          {
            "code": "424952003",
            "display": "Sarcoma of soft tissue"
          },
          {
            "code": "254637007",
            "display": "Non-small cell lung cancer"
          },
          {
            "code": "74364000",
            "display": "Small cell carcinoma"
          },
          {
            "code": "408645001",
            "display": "Adenocarcinoma of large intestine"
          },
          {
            "code": "53654007",
            "display": "Fibrosarcoma"
          },
          {
            "code": "253001006",
            "display": "Merkel cell carcinoma"
          },
          {
            "code": "254938000",
            "display": "Astrocytoma"
          },
          {
            "code": "1187332001",
            "display": "Adenocarcinoma"
          },
          {
            "code": "21326004",
            "display": "Mixed small cell carcinoma"
          },
          {
            "code": "1163375002",
            "display": "Glioblastoma"
          },
          {
            "code": "254626006",
            "display": "Adenocarcinoma of lung"
          },
          {
            "code": "254651007",
            "display": "Squamous cell carcinoma of skin"
          },
          {
            "code": "1162635006",
            "display": "Malignant melanoma"
          },
          {
            "code": "22687000",
            "display": "Large cell carcinoma"
          },
          {
            "code": "1162767002",
            "display": "Squamous cell carcinoma"
          },
          {
            "code": "255029007",
            "display": "Papillary thyroid carcinoma"
          },
          {
            "code": "76909002",
            "display": "Ewing's sarcoma"
          },
          {
            "code": "19897006",
            "display": "Malignant peripheral nerve sheath tumor"
          },
          {
            "code": "363443007",
            "display": "Ovarian cancer"
          },
          {
            "code": "707357005",
            "display": "Squamous cell carcinoma of laryngeal cartilage"
          },
          {
            "code": "88195001",
            "display": "Alveolar soft part sarcoma"
          },
          {
            "code": "93143009",
            "display": "Leukemia"
          },
          {
            "code": "700423003",
            "display": "Adenocarcinoma of pancreas"
          }
        ]
      }
    ]
  },
  "meta": {
    "tag": [
      {
        "system": "https://mii-termserv.de/fhir/su-termserv/CodeSystem/mii-cs-suts-resource-tags-project",
        "code": "dicom",
        "display": "Digital Imaging and Communications in Medicine"
      },
      {
        "system": "https://mii-termserv.de/fhir/su-termserv/CodeSystem/mii-cs-suts-resource-tags-project",
        "code": "international",
        "display": "International standard terminology"
      },
      {
        "system": "https://mii-termserv.de/fhir/su-termserv/CodeSystem/mii-cs-suts-resource-tags-dataset",
        "code": "dicom",
        "display": "DICOM Terminology"
      },
      {
        "system": "https://mii-termserv.de/fhir/su-termserv/CodeSystem/mii-cs-suts-resource-tags-dataset",
        "code": "standard",
        "display": "International Standards"
      },
      {
        "system": "https://mii-termserv.de/fhir/su-termserv/CodeSystem/mii-cs-suts-resource-tags-license",
        "code": "https://mii-termserv.de/licenses#dicom",
        "display": "DICOM license"
      }
    ]
  },
  "title": "TumorGraftHistologicType",
  "text": {
    "status": "generated",
    "div": "<div xmlns=\"http://www.w3.org/1999/xhtml\"><h2>TumorGraftHistologicType</h2><tt>http://dicom.nema.org/medical/dicom/current/output/chtml/part16/sect_CID_639.html</tt><p>Transitive closure of CID 639 TumorGraftHistologicType</p><div><p><b>SU-TermServ Metadata</b></p><table><tbody><tr><td><b>Projects</b></td><td><ul><li>Digital Imaging and Communications in Medicine</li><li>International standard terminology</li></ul></td></tr><tr><td><b>Datasets</b></td><td><ul><li>DICOM Terminology</li><li>International Standards</li></ul></td></tr><tr><td><b>License</b></td><td><a href=\"https://mii-termserv.de/licenses#dicom\">DICOM license</a></td></tr><tr><td><b>Package Scope</b></td><td><a href=\"https://gitlab.com/groups/mii-termserv/fhir-resources/-/packages/?ForderBy%3Dversion%26sort%3Ddesc%26search%5B%5D%3D@mii-termserv/dicom.terminology\"><code>@mii-termserv/dicom.terminology</code></a></td></tr></tbody></table></div></div>"
  },
  "extension": [
    {
      "url": "http://hl7.org/fhir/StructureDefinition/cqf-scope",
      "valueString": "@mii-termserv/dicom.terminology"
    }
  ]
}