{
  "resourceType": "ValueSet",
  "id": "dicom-cid-8103-AnatomicPathologySpecimenType",
  "url": "http://dicom.nema.org/medical/dicom/current/output/chtml/part16/sect_CID_8103.html",
  "identifier": [
    {
      "system": "urn:ietf:rfc:3986",
      "value": "urn:oid:1.2.840.10008.6.1.1045"
    }
  ],
  "version": "20220115",
  "name": "AnatomicPathologySpecimenType",
  "status": "active",
  "experimental": false,
  "date": "2024-06-17",
  "publisher": "NEMA MITA DICOM",
  "description": "Transitive closure of CID 8103 AnatomicPathologySpecimenType",
  "copyright": "© 2024 NEMA",
  "compose": {
    "include": [
      {
        "system": "http://snomed.info/sct",
        "concept": [
          {
            "code": "397199005",
            "display": "specimen from breast obtained by excision"
          },
          {
            "code": "258433009",
            "display": "Smear sample"
          },
          {
            "code": "119295008",
            "display": "Aspirate"
          },
          {
            "code": "122595009",
            "display": "specimen from breast obtained by total mastectomy"
          },
          {
            "code": "309547008",
            "display": "segmentectomy breast sample"
          },
          {
            "code": "309058007",
            "display": "breast tru-cut biopsy sample"
          },
          {
            "code": "309050000",
            "display": "Body substance sample"
          },
          {
            "code": "430856003",
            "display": "Tissue section"
          },
          {
            "code": "373102004",
            "display": "specimen from breast obtained by image guided core biopsy"
          },
          {
            "code": "431196006",
            "display": "Tissue spot"
          },
          {
            "code": "309546004",
            "display": "lumpectomy breast sample"
          },
          {
            "code": "430346005",
            "display": "Liquid based cytologic material"
          },
          {
            "code": "309548003",
            "display": "breast duct sample"
          },
          {
            "code": "122738006",
            "display": "specimen from breast, stereotactically guided core needle biopsy"
          },
          {
            "code": "119376003",
            "display": "Tissue specimen"
          },
          {
            "code": "258562007",
            "display": "Genetic sample"
          },
          {
            "code": "122737001",
            "display": "specimen from breast obtained by core needle biopsy"
          },
          {
            "code": "430970004",
            "display": "Core sample of tissue block"
          },
          {
            "code": "1179252003",
            "display": "Slide"
          },
          {
            "code": "309051001",
            "display": "Body fluid sample"
          },
          {
            "code": "309059004",
            "display": "frozen section breast sample"
          },
          {
            "code": "430855004",
            "display": "Touch preparation cytologic material"
          },
          {
            "code": "38266002",
            "display": "Entire body"
          },
          {
            "code": "122739003",
            "display": "specimen from breast by incisional biopsy of breast mass"
          },
          {
            "code": "430861001",
            "display": "Gross specimen"
          }
        ]
      }
    ]
  },
  "meta": {
    "tag": [
      {
        "system": "https://mii-termserv.de/fhir/su-termserv/CodeSystem/mii-cs-suts-resource-tags-project",
        "code": "dicom",
        "display": "Digital Imaging and Communications in Medicine"
      },
      {
        "system": "https://mii-termserv.de/fhir/su-termserv/CodeSystem/mii-cs-suts-resource-tags-project",
        "code": "international",
        "display": "International standard terminology"
      },
      {
        "system": "https://mii-termserv.de/fhir/su-termserv/CodeSystem/mii-cs-suts-resource-tags-dataset",
        "code": "dicom",
        "display": "DICOM Terminology"
      },
      {
        "system": "https://mii-termserv.de/fhir/su-termserv/CodeSystem/mii-cs-suts-resource-tags-dataset",
        "code": "standard",
        "display": "International Standards"
      },
      {
        "system": "https://mii-termserv.de/fhir/su-termserv/CodeSystem/mii-cs-suts-resource-tags-license",
        "code": "https://mii-termserv.de/licenses#dicom",
        "display": "DICOM license"
      }
    ]
  },
  "title": "AnatomicPathologySpecimenType",
  "text": {
    "status": "generated",
    "div": "<div xmlns=\"http://www.w3.org/1999/xhtml\"><h2>AnatomicPathologySpecimenType</h2><tt>http://dicom.nema.org/medical/dicom/current/output/chtml/part16/sect_CID_8103.html</tt><p>Transitive closure of CID 8103 AnatomicPathologySpecimenType</p><div><p><b>SU-TermServ Metadata</b></p><table><tbody><tr><td><b>Projects</b></td><td><ul><li>Digital Imaging and Communications in Medicine</li><li>International standard terminology</li></ul></td></tr><tr><td><b>Datasets</b></td><td><ul><li>DICOM Terminology</li><li>International Standards</li></ul></td></tr><tr><td><b>License</b></td><td><a href=\"https://mii-termserv.de/licenses#dicom\">DICOM license</a></td></tr><tr><td><b>Package Scope</b></td><td><a href=\"https://gitlab.com/groups/mii-termserv/fhir-resources/-/packages/?ForderBy%3Dversion%26sort%3Ddesc%26search%5B%5D%3D@mii-termserv/dicom.terminology\"><code>@mii-termserv/dicom.terminology</code></a></td></tr></tbody></table></div></div>"
  },
  "extension": [
    {
      "url": "http://hl7.org/fhir/StructureDefinition/cqf-scope",
      "valueString": "@mii-termserv/dicom.terminology"
    }
  ]
}