{
  "resourceType": "ValueSet",
  "id": "dicom-cid-7449-ReaderSpecialty",
  "url": "http://dicom.nema.org/medical/dicom/current/output/chtml/part16/sect_CID_7449.html",
  "identifier": [
    {
      "system": "urn:ietf:rfc:3986",
      "value": "urn:oid:1.2.840.10008.6.1.1119"
    }
  ],
  "version": "20160601",
  "name": "ReaderSpecialty",
  "status": "active",
  "experimental": false,
  "date": "2024-06-17",
  "publisher": "NEMA MITA DICOM",
  "description": "Transitive closure of CID 7449 ReaderSpecialty",
  "copyright": "© 2024 NEMA",
  "compose": {
    "include": [
      {
        "system": "http://dicom.nema.org/resources/ontology/DCM",
        "concept": [
          {
            "code": "128013",
            "display": "Oncologic Imaging Specialty"
          },
          {
            "code": "128012",
            "display": "OB/Gyn Imaging Specialty"
          },
          {
            "code": "128015",
            "display": "Thoracic Imaging Specialty"
          },
          {
            "code": "128014",
            "display": "Oncology Specialty"
          },
          {
            "code": "128006",
            "display": "Abdominal Imaging Specialty"
          },
          {
            "code": "128017",
            "display": "Vascular Imaging Specialty"
          },
          {
            "code": "128016",
            "display": "Pediatric Imaging Specialty"
          },
          {
            "code": "128008",
            "display": "Head and Neck Imaging Specialty"
          },
          {
            "code": "128007",
            "display": "Cardiac Imaging Specialty"
          },
          {
            "code": "128009",
            "display": "Musculoskeletal Imaging Specialty"
          },
          {
            "code": "128011",
            "display": "Neuroradiology Imaging Specialty"
          },
          {
            "code": "128010",
            "display": "Neurology Specialty"
          }
        ]
      }
    ]
  },
  "meta": {
    "tag": [
      {
        "system": "https://mii-termserv.de/fhir/su-termserv/CodeSystem/mii-cs-suts-resource-tags-project",
        "code": "dicom",
        "display": "Digital Imaging and Communications in Medicine"
      },
      {
        "system": "https://mii-termserv.de/fhir/su-termserv/CodeSystem/mii-cs-suts-resource-tags-project",
        "code": "international",
        "display": "International standard terminology"
      },
      {
        "system": "https://mii-termserv.de/fhir/su-termserv/CodeSystem/mii-cs-suts-resource-tags-dataset",
        "code": "dicom",
        "display": "DICOM Terminology"
      },
      {
        "system": "https://mii-termserv.de/fhir/su-termserv/CodeSystem/mii-cs-suts-resource-tags-dataset",
        "code": "standard",
        "display": "International Standards"
      },
      {
        "system": "https://mii-termserv.de/fhir/su-termserv/CodeSystem/mii-cs-suts-resource-tags-license",
        "code": "https://mii-termserv.de/licenses#dicom",
        "display": "DICOM license"
      }
    ]
  },
  "title": "ReaderSpecialty",
  "text": {
    "status": "generated",
    "div": "<div xmlns=\"http://www.w3.org/1999/xhtml\"><h2>ReaderSpecialty</h2><tt>http://dicom.nema.org/medical/dicom/current/output/chtml/part16/sect_CID_7449.html</tt><p>Transitive closure of CID 7449 ReaderSpecialty</p><div><p><b>SU-TermServ Metadata</b></p><table><tbody><tr><td><b>Projects</b></td><td><ul><li>Digital Imaging and Communications in Medicine</li><li>International standard terminology</li></ul></td></tr><tr><td><b>Datasets</b></td><td><ul><li>DICOM Terminology</li><li>International Standards</li></ul></td></tr><tr><td><b>License</b></td><td><a href=\"https://mii-termserv.de/licenses#dicom\">DICOM license</a></td></tr><tr><td><b>Package Scope</b></td><td><a href=\"https://gitlab.com/groups/mii-termserv/fhir-resources/-/packages/?ForderBy%3Dversion%26sort%3Ddesc%26search%5B%5D%3D@mii-termserv/dicom.terminology\"><code>@mii-termserv/dicom.terminology</code></a></td></tr></tbody></table></div></div>"
  },
  "extension": [
    {
      "url": "http://hl7.org/fhir/StructureDefinition/cqf-scope",
      "valueString": "@mii-termserv/dicom.terminology"
    }
  ]
}