{
  "resourceType": "ValueSet",
  "id": "dicom-cid-6404-ChestNonLesionObjectTypePhysicalObject",
  "url": "http://dicom.nema.org/medical/dicom/current/output/chtml/part16/sect_CID_6404.html",
  "identifier": [
    {
      "system": "urn:ietf:rfc:3986",
      "value": "urn:oid:1.2.840.10008.6.1.1188"
    }
  ],
  "version": "20170914",
  "name": "ChestNonlesionObjectTypePhysicalObject",
  "status": "active",
  "experimental": false,
  "date": "2024-06-17",
  "publisher": "NEMA MITA DICOM",
  "description": "Transitive closure of CID 6404 ChestNonlesionObjectTypePhysicalObject",
  "copyright": "© 2024 NEMA",
  "compose": {
    "include": [
      {
        "system": "http://dicom.nema.org/resources/ontology/DCM",
        "concept": [
          {
            "code": "112172",
            "display": "Portacath"
          },
          {
            "code": "112173",
            "display": "Chest tube"
          },
          {
            "code": "112174",
            "display": "Central line"
          },
          {
            "code": "112175",
            "display": "Kidney stent"
          },
          {
            "code": "112176",
            "display": "Pancreatic stent"
          },
          {
            "code": "112177",
            "display": "Nipple ring"
          },
          {
            "code": "112178",
            "display": "Coin"
          },
          {
            "code": "112171",
            "display": "Fiducial mark"
          }
        ]
      },
      {
        "system": "http://snomed.info/sct",
        "concept": [
          {
            "code": "126065006",
            "display": "Jejunostomy tube"
          },
          {
            "code": "27065002",
            "display": "Suture"
          },
          {
            "code": "257409000",
            "display": "Vena cava filter"
          },
          {
            "code": "25510005",
            "display": "Heart valve prosthesis"
          },
          {
            "code": "79068005",
            "display": "Needle"
          },
          {
            "code": "80919006",
            "display": "Jewelry"
          },
          {
            "code": "53350007",
            "display": "Prosthesis"
          },
          {
            "code": "25062003",
            "display": "Feeding tube"
          },
          {
            "code": "19923001",
            "display": "Catheter"
          },
          {
            "code": "26412008",
            "display": "Endotracheal tube"
          },
          {
            "code": "48387007",
            "display": "Tracheotomy"
          },
          {
            "code": "56353002",
            "display": "Staple"
          },
          {
            "code": "286558002",
            "display": "Ureteric stent"
          },
          {
            "code": "86122002",
            "display": "Bullet"
          },
          {
            "code": "77444004",
            "display": "Pin"
          },
          {
            "code": "14106009",
            "display": "Cardiac Pacemaker"
          },
          {
            "code": "360129009",
            "display": "Cardiac pacemaker lead"
          },
          {
            "code": "63562005",
            "display": "Cervical collar"
          }
        ]
      }
    ]
  },
  "meta": {
    "tag": [
      {
        "system": "https://mii-termserv.de/fhir/su-termserv/CodeSystem/mii-cs-suts-resource-tags-project",
        "code": "dicom",
        "display": "Digital Imaging and Communications in Medicine"
      },
      {
        "system": "https://mii-termserv.de/fhir/su-termserv/CodeSystem/mii-cs-suts-resource-tags-project",
        "code": "international",
        "display": "International standard terminology"
      },
      {
        "system": "https://mii-termserv.de/fhir/su-termserv/CodeSystem/mii-cs-suts-resource-tags-dataset",
        "code": "dicom",
        "display": "DICOM Terminology"
      },
      {
        "system": "https://mii-termserv.de/fhir/su-termserv/CodeSystem/mii-cs-suts-resource-tags-dataset",
        "code": "standard",
        "display": "International Standards"
      },
      {
        "system": "https://mii-termserv.de/fhir/su-termserv/CodeSystem/mii-cs-suts-resource-tags-license",
        "code": "https://mii-termserv.de/licenses#dicom",
        "display": "DICOM license"
      }
    ]
  },
  "title": "ChestNonlesionObjectTypePhysicalObject",
  "text": {
    "status": "generated",
    "div": "<div xmlns=\"http://www.w3.org/1999/xhtml\"><h2>ChestNonlesionObjectTypePhysicalObject</h2><tt>http://dicom.nema.org/medical/dicom/current/output/chtml/part16/sect_CID_6404.html</tt><p>Transitive closure of CID 6404 ChestNonlesionObjectTypePhysicalObject</p><div><p><b>SU-TermServ Metadata</b></p><table><tbody><tr><td><b>Projects</b></td><td><ul><li>Digital Imaging and Communications in Medicine</li><li>International standard terminology</li></ul></td></tr><tr><td><b>Datasets</b></td><td><ul><li>DICOM Terminology</li><li>International Standards</li></ul></td></tr><tr><td><b>License</b></td><td><a href=\"https://mii-termserv.de/licenses#dicom\">DICOM license</a></td></tr><tr><td><b>Package Scope</b></td><td><a href=\"https://gitlab.com/groups/mii-termserv/fhir-resources/-/packages/?ForderBy%3Dversion%26sort%3Ddesc%26search%5B%5D%3D@mii-termserv/dicom.terminology\"><code>@mii-termserv/dicom.terminology</code></a></td></tr></tbody></table></div></div>"
  },
  "extension": [
    {
      "url": "http://hl7.org/fhir/StructureDefinition/cqf-scope",
      "valueString": "@mii-termserv/dicom.terminology"
    }
  ]
}