{
  "resourceType": "ValueSet",
  "id": "dicom-cid-10023-SizeSpecificDoseEstimationMethodForCT",
  "url": "http://dicom.nema.org/medical/dicom/current/output/chtml/part16/sect_CID_10023.html",
  "identifier": [
    {
      "system": "urn:ietf:rfc:3986",
      "value": "urn:oid:1.2.840.10008.6.1.947"
    }
  ],
  "version": "20200919",
  "name": "SizeSpecificDoseEstimationMethodforCT",
  "status": "active",
  "experimental": false,
  "date": "2024-06-17",
  "publisher": "NEMA MITA DICOM",
  "description": "Transitive closure of CID 10023 SizeSpecificDoseEstimationMethodforCT",
  "copyright": "© 2024 NEMA",
  "compose": {
    "include": [
      {
        "system": "http://dicom.nema.org/resources/ontology/DCM",
        "concept": [
          {
            "code": "113937",
            "display": "AAPM 204 Effective Diameter Estimated From Patient Age"
          },
          {
            "code": "113934",
            "display": "AAPM 204 Lateral Dimension"
          },
          {
            "code": "113989",
            "display": "Arithmetic Average of SSDE(z)"
          },
          {
            "code": "113988",
            "display": "Estimated from Water Equivalent Diameter"
          },
          {
            "code": "113936",
            "display": "AAPM 204 Sum of Lateral and AP Dimension"
          },
          {
            "code": "113935",
            "display": "AAPM 204 AP Dimension"
          }
        ]
      }
    ]
  },
  "meta": {
    "tag": [
      {
        "system": "https://mii-termserv.de/fhir/su-termserv/CodeSystem/mii-cs-suts-resource-tags-project",
        "code": "dicom",
        "display": "Digital Imaging and Communications in Medicine"
      },
      {
        "system": "https://mii-termserv.de/fhir/su-termserv/CodeSystem/mii-cs-suts-resource-tags-project",
        "code": "international",
        "display": "International standard terminology"
      },
      {
        "system": "https://mii-termserv.de/fhir/su-termserv/CodeSystem/mii-cs-suts-resource-tags-dataset",
        "code": "dicom",
        "display": "DICOM Terminology"
      },
      {
        "system": "https://mii-termserv.de/fhir/su-termserv/CodeSystem/mii-cs-suts-resource-tags-dataset",
        "code": "standard",
        "display": "International Standards"
      },
      {
        "system": "https://mii-termserv.de/fhir/su-termserv/CodeSystem/mii-cs-suts-resource-tags-license",
        "code": "https://mii-termserv.de/licenses#dicom",
        "display": "DICOM license"
      }
    ]
  },
  "title": "SizeSpecificDoseEstimationMethodforCT",
  "text": {
    "status": "generated",
    "div": "<div xmlns=\"http://www.w3.org/1999/xhtml\"><h2>SizeSpecificDoseEstimationMethodforCT</h2><tt>http://dicom.nema.org/medical/dicom/current/output/chtml/part16/sect_CID_10023.html</tt><p>Transitive closure of CID 10023 SizeSpecificDoseEstimationMethodforCT</p><div><p><b>SU-TermServ Metadata</b></p><table><tbody><tr><td><b>Projects</b></td><td><ul><li>Digital Imaging and Communications in Medicine</li><li>International standard terminology</li></ul></td></tr><tr><td><b>Datasets</b></td><td><ul><li>DICOM Terminology</li><li>International Standards</li></ul></td></tr><tr><td><b>License</b></td><td><a href=\"https://mii-termserv.de/licenses#dicom\">DICOM license</a></td></tr><tr><td><b>Package Scope</b></td><td><a href=\"https://gitlab.com/groups/mii-termserv/fhir-resources/-/packages/?ForderBy%3Dversion%26sort%3Ddesc%26search%5B%5D%3D@mii-termserv/dicom.terminology\"><code>@mii-termserv/dicom.terminology</code></a></td></tr></tbody></table></div></div>"
  },
  "extension": [
    {
      "url": "http://hl7.org/fhir/StructureDefinition/cqf-scope",
      "valueString": "@mii-termserv/dicom.terminology"
    }
  ]
}