{
  "resourceType": "ValueSet",
  "id": "dicom-cid-7307-ImplantComponentType",
  "url": "http://dicom.nema.org/medical/dicom/current/output/chtml/part16/sect_CID_7307.html",
  "identifier": [
    {
      "system": "urn:ietf:rfc:3986",
      "value": "urn:oid:1.2.840.10008.6.1.1038"
    }
  ],
  "version": "20101102",
  "name": "ImplantComponentType",
  "status": "active",
  "experimental": false,
  "date": "2024-06-17",
  "publisher": "NEMA MITA DICOM",
  "description": "Transitive closure of CID 7307 ImplantComponentType",
  "copyright": "© 2024 NEMA",
  "compose": {
    "include": [
      {
        "system": "http://dicom.nema.org/resources/ontology/DCM",
        "concept": [
          {
            "code": "112310",
            "display": "Femoral Stem"
          },
          {
            "code": "112311",
            "display": "Femoral Stem Distal Component"
          },
          {
            "code": "112309",
            "display": "Femoral Head Cone Taper Component"
          },
          {
            "code": "112312",
            "display": "Femoral Stem Proximal Component"
          },
          {
            "code": "112313",
            "display": "Femoral Stem Component"
          },
          {
            "code": "112314",
            "display": "Neck Component"
          },
          {
            "code": "112325",
            "display": "Distal Centralizer"
          },
          {
            "code": "112315",
            "display": "Monoblock Stem"
          },
          {
            "code": "112305",
            "display": "Acetabular Cup Shell"
          },
          {
            "code": "112316",
            "display": "Prosthetic Shaft Augment"
          },
          {
            "code": "112306",
            "display": "Acetabular Cup Insert"
          },
          {
            "code": "112317",
            "display": "Femoral Head Resurfacing Component"
          },
          {
            "code": "112307",
            "display": "Acetabular Cup Monoblock"
          },
          {
            "code": "112308",
            "display": "Femoral Head Ball Component"
          }
        ]
      },
      {
        "system": "http://snomed.info/sct",
        "concept": [
          {
            "code": "257327003",
            "display": "DHS Plate"
          },
          {
            "code": "304121006",
            "display": "Femoral Head Prosthesis"
          },
          {
            "code": "68183006",
            "display": "Screw"
          },
          {
            "code": "271003",
            "display": "Bone Plate"
          },
          {
            "code": "63289001",
            "display": "Bone Nail"
          }
        ]
      }
    ]
  },
  "meta": {
    "tag": [
      {
        "system": "https://mii-termserv.de/fhir/su-termserv/CodeSystem/mii-cs-suts-resource-tags-project",
        "code": "dicom",
        "display": "Digital Imaging and Communications in Medicine"
      },
      {
        "system": "https://mii-termserv.de/fhir/su-termserv/CodeSystem/mii-cs-suts-resource-tags-project",
        "code": "international",
        "display": "International standard terminology"
      },
      {
        "system": "https://mii-termserv.de/fhir/su-termserv/CodeSystem/mii-cs-suts-resource-tags-dataset",
        "code": "dicom",
        "display": "DICOM Terminology"
      },
      {
        "system": "https://mii-termserv.de/fhir/su-termserv/CodeSystem/mii-cs-suts-resource-tags-dataset",
        "code": "standard",
        "display": "International Standards"
      },
      {
        "system": "https://mii-termserv.de/fhir/su-termserv/CodeSystem/mii-cs-suts-resource-tags-license",
        "code": "https://mii-termserv.de/licenses#dicom",
        "display": "DICOM license"
      }
    ]
  },
  "title": "ImplantComponentType",
  "text": {
    "status": "generated",
    "div": "<div xmlns=\"http://www.w3.org/1999/xhtml\"><h2>ImplantComponentType</h2><tt>http://dicom.nema.org/medical/dicom/current/output/chtml/part16/sect_CID_7307.html</tt><p>Transitive closure of CID 7307 ImplantComponentType</p><div><p><b>SU-TermServ Metadata</b></p><table><tbody><tr><td><b>Projects</b></td><td><ul><li>Digital Imaging and Communications in Medicine</li><li>International standard terminology</li></ul></td></tr><tr><td><b>Datasets</b></td><td><ul><li>DICOM Terminology</li><li>International Standards</li></ul></td></tr><tr><td><b>License</b></td><td><a href=\"https://mii-termserv.de/licenses#dicom\">DICOM license</a></td></tr><tr><td><b>Package Scope</b></td><td><a href=\"https://gitlab.com/groups/mii-termserv/fhir-resources/-/packages/?ForderBy%3Dversion%26sort%3Ddesc%26search%5B%5D%3D@mii-termserv/dicom.terminology\"><code>@mii-termserv/dicom.terminology</code></a></td></tr></tbody></table></div></div>"
  },
  "extension": [
    {
      "url": "http://hl7.org/fhir/StructureDefinition/cqf-scope",
      "valueString": "@mii-termserv/dicom.terminology"
    }
  ]
}