{
  "resourceType": "ValueSet",
  "id": "dicom-cid-12014-OBFetalBodyWeightEquationTable",
  "url": "http://dicom.nema.org/medical/dicom/current/output/chtml/part16/sect_CID_12014.html",
  "identifier": [
    {
      "system": "urn:ietf:rfc:3986",
      "value": "urn:oid:1.2.840.10008.6.1.562"
    }
  ],
  "version": "20030130",
  "name": "OBFetalBodyWeightEquation/Table",
  "status": "active",
  "experimental": false,
  "date": "2024-06-17",
  "publisher": "NEMA MITA DICOM",
  "description": "Transitive closure of CID 12014 OBFetalBodyWeightEquation/Table",
  "copyright": "© 2024 NEMA",
  "compose": {
    "include": [
      {
        "system": "http://loinc.org",
        "concept": [
          {
            "code": "11754-9",
            "display": "EFW by AC, HC Hadlock 1984"
          },
          {
            "code": "11735-8",
            "display": "EFW by AC, BPD, FL, Hadlock 1985"
          },
          {
            "code": "33139-7",
            "display": "EFW by BPD, TTD, Hansmann 1986"
          },
          {
            "code": "11732-5",
            "display": "EFW by AC, BPD, FL, HC, Hadlock 1985"
          },
          {
            "code": "11746-5",
            "display": "EFW by AC, FL, HC, Hadlock 1985"
          },
          {
            "code": "11738-2",
            "display": "EFW by AC, BPD, Hadlock 1984"
          },
          {
            "code": "11756-4",
            "display": "EFW by AC, Campbell 1975"
          },
          {
            "code": "11739-0",
            "display": "EFW by AC and BPD, Shepard 1982"
          },
          {
            "code": "11750-7",
            "display": "EFW by AC, FL, Hadlock 1984"
          },
          {
            "code": "33143-9",
            "display": "EFW3 by Shinozuka 1996"
          },
          {
            "code": "33144-7",
            "display": "EFW by BPD, APAD, TAD, FL, Tokyo 1987"
          },
          {
            "code": "11734-1",
            "display": "EFW by AC, BPD, FL, Hadlock 1984"
          },
          {
            "code": "11751-5",
            "display": "EFW by AC, FL, Hadlock 1985"
          },
          {
            "code": "33140-5",
            "display": "EFW by BPD, FTA, FL, Osaka 1990"
          },
          {
            "code": "33141-3",
            "display": "EFW1 by Shinozuka 1996"
          },
          {
            "code": "33142-1",
            "display": "EFW2 by Shinozuka 1996"
          }
        ]
      }
    ]
  },
  "meta": {
    "tag": [
      {
        "system": "https://mii-termserv.de/fhir/su-termserv/CodeSystem/mii-cs-suts-resource-tags-project",
        "code": "dicom",
        "display": "Digital Imaging and Communications in Medicine"
      },
      {
        "system": "https://mii-termserv.de/fhir/su-termserv/CodeSystem/mii-cs-suts-resource-tags-project",
        "code": "international",
        "display": "International standard terminology"
      },
      {
        "system": "https://mii-termserv.de/fhir/su-termserv/CodeSystem/mii-cs-suts-resource-tags-dataset",
        "code": "dicom",
        "display": "DICOM Terminology"
      },
      {
        "system": "https://mii-termserv.de/fhir/su-termserv/CodeSystem/mii-cs-suts-resource-tags-dataset",
        "code": "standard",
        "display": "International Standards"
      },
      {
        "system": "https://mii-termserv.de/fhir/su-termserv/CodeSystem/mii-cs-suts-resource-tags-license",
        "code": "https://mii-termserv.de/licenses#dicom",
        "display": "DICOM license"
      }
    ]
  },
  "title": "OBFetalBodyWeightEquation/Table",
  "text": {
    "status": "generated",
    "div": "<div xmlns=\"http://www.w3.org/1999/xhtml\"><h2>OBFetalBodyWeightEquation/Table</h2><tt>http://dicom.nema.org/medical/dicom/current/output/chtml/part16/sect_CID_12014.html</tt><p>Transitive closure of CID 12014 OBFetalBodyWeightEquation/Table</p><div><p><b>SU-TermServ Metadata</b></p><table><tbody><tr><td><b>Projects</b></td><td><ul><li>Digital Imaging and Communications in Medicine</li><li>International standard terminology</li></ul></td></tr><tr><td><b>Datasets</b></td><td><ul><li>DICOM Terminology</li><li>International Standards</li></ul></td></tr><tr><td><b>License</b></td><td><a href=\"https://mii-termserv.de/licenses#dicom\">DICOM license</a></td></tr><tr><td><b>Package Scope</b></td><td><a href=\"https://gitlab.com/groups/mii-termserv/fhir-resources/-/packages/?ForderBy%3Dversion%26sort%3Ddesc%26search%5B%5D%3D@mii-termserv/dicom.terminology\"><code>@mii-termserv/dicom.terminology</code></a></td></tr></tbody></table></div></div>"
  },
  "extension": [
    {
      "url": "http://hl7.org/fhir/StructureDefinition/cqf-scope",
      "valueString": "@mii-termserv/dicom.terminology"
    }
  ]
}