{
  "resourceType": "ValueSet",
  "id": "dicom-cid-3011-ElectrophysiologyAnatomicLocation",
  "url": "http://dicom.nema.org/medical/dicom/current/output/chtml/part16/sect_CID_3011.html",
  "identifier": [
    {
      "system": "urn:ietf:rfc:3986",
      "value": "urn:oid:1.2.840.10008.6.1.46"
    }
  ],
  "version": "20170914",
  "name": "ElectrophysiologyAnatomicLocation",
  "status": "active",
  "experimental": false,
  "date": "2024-06-17",
  "publisher": "NEMA MITA DICOM",
  "description": "Transitive closure of CID 3011 ElectrophysiologyAnatomicLocation",
  "copyright": "© 2024 NEMA",
  "compose": {
    "include": [
      {
        "system": "http://snomed.info/sct",
        "concept": [
          {
            "code": "5928000",
            "display": "Great cardiac vein"
          },
          {
            "code": "128592001",
            "display": "Lateral high right atrium"
          },
          {
            "code": "128594000",
            "display": "Low right atrium"
          },
          {
            "code": "8017000",
            "display": "Right ventricle inflow"
          },
          {
            "code": "51249003",
            "display": "Inferior left pulmonary vein"
          },
          {
            "code": "128565007",
            "display": "Apex of right ventricle"
          },
          {
            "code": "8629005",
            "display": "Superior right pulmonary vein"
          },
          {
            "code": "13050003",
            "display": "Purkinje fibers"
          },
          {
            "code": "91085002",
            "display": "Left posterior division of left branch atrioventricular bundle"
          },
          {
            "code": "65197004",
            "display": "Mitral ring"
          },
          {
            "code": "73829009",
            "display": "Right Atrium"
          },
          {
            "code": "70238003",
            "display": "Left ventricle inflow"
          },
          {
            "code": "53085002",
            "display": "Right ventricle"
          },
          {
            "code": "87878005",
            "display": "Left ventricle"
          },
          {
            "code": "45503006",
            "display": "Common ventricle"
          },
          {
            "code": "73580002",
            "display": "Middle cardiac vein"
          },
          {
            "code": "90318009",
            "display": "Pulmonic ring"
          },
          {
            "code": "90219004",
            "display": "Coronary sinus"
          },
          {
            "code": "128591008",
            "display": "High right atrium"
          },
          {
            "code": "25943004",
            "display": "Atrioventricular node"
          },
          {
            "code": "13418002",
            "display": "Left ventricle outflow tract"
          },
          {
            "code": "128593006",
            "display": "Mid right atrium"
          },
          {
            "code": "113259005",
            "display": "Tricuspid ring"
          },
          {
            "code": "44627009",
            "display": "Right ventricle outflow tract"
          },
          {
            "code": "128595004",
            "display": "Tendon of Todaro"
          },
          {
            "code": "43863001",
            "display": "Superior left pulmonary vein"
          },
          {
            "code": "33626005",
            "display": "Left auricular appendage"
          },
          {
            "code": "6871001",
            "display": "Epicardium"
          },
          {
            "code": "57383004",
            "display": "Right branch of Atrioventricular bundle"
          },
          {
            "code": "8225009",
            "display": "Accessory atrioventricular bundle"
          },
          {
            "code": "128564006",
            "display": "Apex of left ventricle"
          },
          {
            "code": "71271007",
            "display": "Ostium of coronary sinus"
          },
          {
            "code": "90561006",
            "display": "Right atrioventricular ostium"
          },
          {
            "code": "84654008",
            "display": "Left anterior division of left branch atrioventricular bundle"
          },
          {
            "code": "82471001",
            "display": "Left Atrium"
          },
          {
            "code": "122972007",
            "display": "Pulmonary vein"
          },
          {
            "code": "113273001",
            "display": "Inferior right pulmonary vein"
          },
          {
            "code": "74031005",
            "display": "Left branch of atrioventricular bundle"
          },
          {
            "code": "68300000",
            "display": "Right auricular appendage"
          },
          {
            "code": "345000",
            "display": "Atrioventricular bundle"
          },
          {
            "code": "88210001",
            "display": "Sino-atrial node"
          }
        ]
      }
    ]
  },
  "meta": {
    "tag": [
      {
        "system": "https://mii-termserv.de/fhir/su-termserv/CodeSystem/mii-cs-suts-resource-tags-project",
        "code": "dicom",
        "display": "Digital Imaging and Communications in Medicine"
      },
      {
        "system": "https://mii-termserv.de/fhir/su-termserv/CodeSystem/mii-cs-suts-resource-tags-project",
        "code": "international",
        "display": "International standard terminology"
      },
      {
        "system": "https://mii-termserv.de/fhir/su-termserv/CodeSystem/mii-cs-suts-resource-tags-dataset",
        "code": "dicom",
        "display": "DICOM Terminology"
      },
      {
        "system": "https://mii-termserv.de/fhir/su-termserv/CodeSystem/mii-cs-suts-resource-tags-dataset",
        "code": "standard",
        "display": "International Standards"
      },
      {
        "system": "https://mii-termserv.de/fhir/su-termserv/CodeSystem/mii-cs-suts-resource-tags-license",
        "code": "https://mii-termserv.de/licenses#dicom",
        "display": "DICOM license"
      }
    ]
  },
  "title": "ElectrophysiologyAnatomicLocation",
  "text": {
    "status": "generated",
    "div": "<div xmlns=\"http://www.w3.org/1999/xhtml\"><h2>ElectrophysiologyAnatomicLocation</h2><tt>http://dicom.nema.org/medical/dicom/current/output/chtml/part16/sect_CID_3011.html</tt><p>Transitive closure of CID 3011 ElectrophysiologyAnatomicLocation</p><div><p><b>SU-TermServ Metadata</b></p><table><tbody><tr><td><b>Projects</b></td><td><ul><li>Digital Imaging and Communications in Medicine</li><li>International standard terminology</li></ul></td></tr><tr><td><b>Datasets</b></td><td><ul><li>DICOM Terminology</li><li>International Standards</li></ul></td></tr><tr><td><b>License</b></td><td><a href=\"https://mii-termserv.de/licenses#dicom\">DICOM license</a></td></tr><tr><td><b>Package Scope</b></td><td><a href=\"https://gitlab.com/groups/mii-termserv/fhir-resources/-/packages/?ForderBy%3Dversion%26sort%3Ddesc%26search%5B%5D%3D@mii-termserv/dicom.terminology\"><code>@mii-termserv/dicom.terminology</code></a></td></tr></tbody></table></div></div>"
  },
  "extension": [
    {
      "url": "http://hl7.org/fhir/StructureDefinition/cqf-scope",
      "valueString": "@mii-termserv/dicom.terminology"
    }
  ]
}