{
  "resourceType": "ValueSet",
  "id": "dicom-cid-501-VolumetricViewDescription",
  "url": "http://dicom.nema.org/medical/dicom/current/output/chtml/part16/sect_CID_501.html",
  "identifier": [
    {
      "system": "urn:ietf:rfc:3986",
      "value": "urn:oid:1.2.840.10008.6.1.1057"
    }
  ],
  "version": "20150915",
  "name": "VolumetricViewDescription",
  "status": "active",
  "experimental": false,
  "date": "2024-06-17",
  "publisher": "NEMA MITA DICOM",
  "description": "Transitive closure of CID 501 VolumetricViewDescription",
  "copyright": "© 2024 NEMA",
  "compose": {
    "include": [
      {
        "system": "http://dicom.nema.org/resources/ontology/DCM",
        "concept": [
          {
            "code": "130681",
            "display": "Apical four chamber RV Focused"
          },
          {
            "code": "130682",
            "display": "Apical four chamber RV Modified"
          }
        ]
      },
      {
        "system": "http://snomed.info/sct",
        "concept": [
          {
            "code": "399038007",
            "display": "right posterior oblique"
          },
          {
            "code": "399118008",
            "display": "Left lateral projection"
          },
          {
            "code": "443083000",
            "display": "Parasternal long axis view of the RV outflow tract"
          },
          {
            "code": "399271003",
            "display": "Parasternal short axis at the Papillary Muscle level"
          },
          {
            "code": "399110001",
            "display": "tangential"
          },
          {
            "code": "399162004",
            "display": "cranio-caudal"
          },
          {
            "code": "399099002",
            "display": "latero-medial oblique"
          },
          {
            "code": "399242004",
            "display": "acanthioparietal"
          },
          {
            "code": "443163004",
            "display": "Suprasternal sagittal view"
          },
          {
            "code": "399351005",
            "display": "orbitoparietal"
          },
          {
            "code": "399001007",
            "display": "Posterior projection"
          },
          {
            "code": "398994001",
            "display": "Five chamber"
          },
          {
            "code": "399288005",
            "display": "oblique cranio-caudal"
          },
          {
            "code": "103341000",
            "display": "Off axis"
          },
          {
            "code": "260427002",
            "display": "lateral oblique"
          },
          {
            "code": "399236003",
            "display": "right oblique"
          },
          {
            "code": "49370004",
            "display": "Lateral"
          },
          {
            "code": "399368009",
            "display": "medio-lateral oblique"
          },
          {
            "code": "399360002",
            "display": "verticosubmental"
          },
          {
            "code": "399012007",
            "display": "Medial-lateral"
          },
          {
            "code": "399033003",
            "display": "frontal"
          },
          {
            "code": "131186000",
            "display": "Horizontal Long Axis"
          },
          {
            "code": "399316002",
            "display": "parieto-orbital"
          },
          {
            "code": "399239005",
            "display": "Parasternal short axis at the aortic valve level"
          },
          {
            "code": "443160001",
            "display": "Subcostal short axis view at papillary muscle level"
          },
          {
            "code": "399348003",
            "display": "antero-posterior"
          },
          {
            "code": "443500008",
            "display": "Subcostal short axis view at venous inflow level"
          },
          {
            "code": "399136008",
            "display": "Left posterior oblique"
          },
          {
            "code": "399371001",
            "display": "Parasternal short axis at the level of the mitral chords"
          },
          {
            "code": "399006002",
            "display": "left posterior oblique"
          },
          {
            "code": "399139001",
            "display": "Parasternal long axis"
          },
          {
            "code": "399225005",
            "display": "oblique caudo-cranial"
          },
          {
            "code": "399145009",
            "display": "Suprasternal short axis"
          },
          {
            "code": "399273000",
            "display": "Sagittal-oblique axial"
          },
          {
            "code": "131185001",
            "display": "Vertical Long Axis"
          },
          {
            "code": "30730003",
            "display": "sagittal"
          },
          {
            "code": "399074003",
            "display": "Left anterior oblique"
          },
          {
            "code": "399106004",
            "display": "Suprasternal long axis"
          },
          {
            "code": "443698002",
            "display": "Transesophageal short axis view"
          },
          {
            "code": "24422004",
            "display": "Axial"
          },
          {
            "code": "399071006",
            "display": "plantodorsal"
          },
          {
            "code": "399297009",
            "display": "Right lateral projection"
          },
          {
            "code": "443562002",
            "display": "Suprasternal long axis view of aortic arch"
          },
          {
            "code": "399196006",
            "display": "caudo-cranial"
          },
          {
            "code": "119376003",
            "display": "tissue specimen"
          },
          {
            "code": "399310008",
            "display": "Subcostal long axis"
          },
          {
            "code": "399173006",
            "display": "left lateral"
          },
          {
            "code": "399352003",
            "display": "lateral-medial"
          },
          {
            "code": "399335002",
            "display": "dorsoplantar"
          },
          {
            "code": "399182000",
            "display": "oblique"
          },
          {
            "code": "399321004",
            "display": "Anterior projection"
          },
          {
            "code": "399159002",
            "display": "Latero-medial oblique"
          },
          {
            "code": "399004004",
            "display": "oblique axial"
          },
          {
            "code": "81654009",
            "display": "Coronal"
          },
          {
            "code": "399200001",
            "display": "Subcostal short axis"
          },
          {
            "code": "103339001",
            "display": "Long axis"
          },
          {
            "code": "399108003",
            "display": "Right anterior oblique"
          },
          {
            "code": "398998003",
            "display": "Right Ventricular Inflow Tract View"
          },
          {
            "code": "399232001",
            "display": "Two chamber"
          },
          {
            "code": "399198007",
            "display": "right lateral"
          },
          {
            "code": "399089007",
            "display": "Oblique axial"
          },
          {
            "code": "443640005",
            "display": "Subcostal oblique coronal view"
          },
          {
            "code": "399272005",
            "display": "parietoacanthial"
          },
          {
            "code": "272479007",
            "display": "postero-anterior"
          },
          {
            "code": "399255003",
            "display": "submentovertical"
          },
          {
            "code": "399312000",
            "display": "antero-posterior oblique"
          },
          {
            "code": "399075002",
            "display": "Right posterior oblique"
          },
          {
            "code": "399184004",
            "display": "left oblique"
          },
          {
            "code": "443499004",
            "display": "Subcostal short axis view at mitral valve level"
          },
          {
            "code": "260426006",
            "display": "medial oblique"
          },
          {
            "code": "399132005",
            "display": "frontal-oblique axial"
          },
          {
            "code": "399160007",
            "display": "frontal oblique"
          },
          {
            "code": "399214001",
            "display": "Four chamber"
          },
          {
            "code": "399195005",
            "display": "Right Ventricular Outflow Tract View"
          },
          {
            "code": "399306005",
            "display": "Parasternal short axis"
          },
          {
            "code": "399036006",
            "display": "Parasternal short axis at the Mitral Valve level"
          },
          {
            "code": "443100003",
            "display": "Subcostal view of cardiac outlets directed anteriorly"
          },
          {
            "code": "399059000",
            "display": "postero-anterior oblique"
          },
          {
            "code": "399061009",
            "display": "axial"
          },
          {
            "code": "260499007",
            "display": "Occlusal projection"
          },
          {
            "code": "443162009",
            "display": "Suprasternal coronal view"
          },
          {
            "code": "103343002",
            "display": "Parasagittal"
          },
          {
            "code": "399135007",
            "display": "left anterior oblique"
          },
          {
            "code": "443082005",
            "display": "Parasternal long axis view of the RV inflow tract"
          },
          {
            "code": "21114003",
            "display": "Oblique"
          },
          {
            "code": "62824007",
            "display": "Transverse"
          },
          {
            "code": "399356000",
            "display": "right anterior oblique"
          },
          {
            "code": "399339008",
            "display": "Apical long axis"
          },
          {
            "code": "443609003",
            "display": "Subcostal short axis view at aortic valve level"
          },
          {
            "code": "399325008",
            "display": "sagittal-oblique axial"
          },
          {
            "code": "399300004",
            "display": "Lateral-medial"
          },
          {
            "code": "399260004",
            "display": "medial-lateral"
          },
          {
            "code": "103340004",
            "display": "Short Axis"
          },
          {
            "code": "399268006",
            "display": "Medio-lateral oblique"
          },
          {
            "code": "399067008",
            "display": "lateral"
          },
          {
            "code": "38717003",
            "display": "Longitudinal"
          }
        ]
      }
    ]
  },
  "meta": {
    "tag": [
      {
        "system": "https://mii-termserv.de/fhir/su-termserv/CodeSystem/mii-cs-suts-resource-tags-project",
        "code": "dicom",
        "display": "Digital Imaging and Communications in Medicine"
      },
      {
        "system": "https://mii-termserv.de/fhir/su-termserv/CodeSystem/mii-cs-suts-resource-tags-project",
        "code": "international",
        "display": "International standard terminology"
      },
      {
        "system": "https://mii-termserv.de/fhir/su-termserv/CodeSystem/mii-cs-suts-resource-tags-dataset",
        "code": "dicom",
        "display": "DICOM Terminology"
      },
      {
        "system": "https://mii-termserv.de/fhir/su-termserv/CodeSystem/mii-cs-suts-resource-tags-dataset",
        "code": "standard",
        "display": "International Standards"
      },
      {
        "system": "https://mii-termserv.de/fhir/su-termserv/CodeSystem/mii-cs-suts-resource-tags-license",
        "code": "https://mii-termserv.de/licenses#dicom",
        "display": "DICOM license"
      }
    ]
  },
  "title": "VolumetricViewDescription",
  "text": {
    "status": "generated",
    "div": "<div xmlns=\"http://www.w3.org/1999/xhtml\"><h2>VolumetricViewDescription</h2><tt>http://dicom.nema.org/medical/dicom/current/output/chtml/part16/sect_CID_501.html</tt><p>Transitive closure of CID 501 VolumetricViewDescription</p><div><p><b>SU-TermServ Metadata</b></p><table><tbody><tr><td><b>Projects</b></td><td><ul><li>Digital Imaging and Communications in Medicine</li><li>International standard terminology</li></ul></td></tr><tr><td><b>Datasets</b></td><td><ul><li>DICOM Terminology</li><li>International Standards</li></ul></td></tr><tr><td><b>License</b></td><td><a href=\"https://mii-termserv.de/licenses#dicom\">DICOM license</a></td></tr><tr><td><b>Package Scope</b></td><td><a href=\"https://gitlab.com/groups/mii-termserv/fhir-resources/-/packages/?ForderBy%3Dversion%26sort%3Ddesc%26search%5B%5D%3D@mii-termserv/dicom.terminology\"><code>@mii-termserv/dicom.terminology</code></a></td></tr></tbody></table></div></div>"
  },
  "extension": [
    {
      "url": "http://hl7.org/fhir/StructureDefinition/cqf-scope",
      "valueString": "@mii-termserv/dicom.terminology"
    }
  ]
}