{
  "resourceType": "ValueSet",
  "id": "dicom-cid-9505-FixationOrPositioningDevice",
  "url": "http://dicom.nema.org/medical/dicom/current/output/chtml/part16/sect_CID_9505.html",
  "identifier": [
    {
      "system": "urn:ietf:rfc:3986",
      "value": "urn:oid:1.2.840.10008.6.1.1215"
    }
  ],
  "version": "20181112",
  "name": "FixationorPositioningDevice",
  "status": "active",
  "experimental": false,
  "date": "2024-06-17",
  "publisher": "NEMA MITA DICOM",
  "description": "Transitive closure of CID 9505 FixationorPositioningDevice",
  "copyright": "© 2024 NEMA",
  "compose": {
    "include": [
      {
        "system": "http://dicom.nema.org/resources/ontology/DCM",
        "concept": [
          {
            "code": "130120",
            "display": "Rectal Balloon"
          },
          {
            "code": "130121",
            "display": "Vaginal Cylinder"
          },
          {
            "code": "130113",
            "display": "Mold"
          },
          {
            "code": "130112",
            "display": "Head and Neck Mask"
          },
          {
            "code": "130111",
            "display": "Head Mask"
          },
          {
            "code": "130110",
            "display": "Headframe"
          },
          {
            "code": "130117",
            "display": "Body Frame"
          },
          {
            "code": "130656",
            "display": "Head Fixation Board"
          },
          {
            "code": "130854",
            "display": "Hand Grips"
          },
          {
            "code": "130116",
            "display": "Breast Board"
          },
          {
            "code": "130655",
            "display": "Abdominal Compression Arch"
          },
          {
            "code": "130853",
            "display": "Heel Stop"
          },
          {
            "code": "130654",
            "display": "Abdominal Compression Belt"
          },
          {
            "code": "130852",
            "display": "Shin Rest"
          },
          {
            "code": "130114",
            "display": "Cast"
          },
          {
            "code": "130653",
            "display": "Breast Bridge"
          },
          {
            "code": "130119",
            "display": "Whole Body Pod"
          },
          {
            "code": "130118",
            "display": "Vacuum Mold"
          },
          {
            "code": "130855",
            "display": "Seat Pan"
          }
        ]
      },
      {
        "system": "http://snomed.info/sct",
        "concept": [
          {
            "code": "706699008",
            "display": "Chair"
          },
          {
            "code": "468115008",
            "display": "Backrest"
          },
          {
            "code": "86407004",
            "display": "Table"
          },
          {
            "code": "89149003",
            "display": "Stretcher"
          },
          {
            "code": "20406008",
            "display": "Backrest"
          },
          {
            "code": "224727009",
            "display": "Wall"
          },
          {
            "code": "706683002",
            "display": "Headrest"
          },
          {
            "code": "228745001",
            "display": "Bite block"
          },
          {
            "code": "709280007",
            "display": "Floor"
          }
        ]
      }
    ]
  },
  "meta": {
    "tag": [
      {
        "system": "https://mii-termserv.de/fhir/su-termserv/CodeSystem/mii-cs-suts-resource-tags-project",
        "code": "dicom",
        "display": "Digital Imaging and Communications in Medicine"
      },
      {
        "system": "https://mii-termserv.de/fhir/su-termserv/CodeSystem/mii-cs-suts-resource-tags-project",
        "code": "international",
        "display": "International standard terminology"
      },
      {
        "system": "https://mii-termserv.de/fhir/su-termserv/CodeSystem/mii-cs-suts-resource-tags-dataset",
        "code": "dicom",
        "display": "DICOM Terminology"
      },
      {
        "system": "https://mii-termserv.de/fhir/su-termserv/CodeSystem/mii-cs-suts-resource-tags-dataset",
        "code": "standard",
        "display": "International Standards"
      },
      {
        "system": "https://mii-termserv.de/fhir/su-termserv/CodeSystem/mii-cs-suts-resource-tags-license",
        "code": "https://mii-termserv.de/licenses#dicom",
        "display": "DICOM license"
      }
    ]
  },
  "title": "FixationorPositioningDevice",
  "text": {
    "status": "generated",
    "div": "<div xmlns=\"http://www.w3.org/1999/xhtml\"><h2>FixationorPositioningDevice</h2><tt>http://dicom.nema.org/medical/dicom/current/output/chtml/part16/sect_CID_9505.html</tt><p>Transitive closure of CID 9505 FixationorPositioningDevice</p><div><p><b>SU-TermServ Metadata</b></p><table><tbody><tr><td><b>Projects</b></td><td><ul><li>Digital Imaging and Communications in Medicine</li><li>International standard terminology</li></ul></td></tr><tr><td><b>Datasets</b></td><td><ul><li>DICOM Terminology</li><li>International Standards</li></ul></td></tr><tr><td><b>License</b></td><td><a href=\"https://mii-termserv.de/licenses#dicom\">DICOM license</a></td></tr><tr><td><b>Package Scope</b></td><td><a href=\"https://gitlab.com/groups/mii-termserv/fhir-resources/-/packages/?ForderBy%3Dversion%26sort%3Ddesc%26search%5B%5D%3D@mii-termserv/dicom.terminology\"><code>@mii-termserv/dicom.terminology</code></a></td></tr></tbody></table></div></div>"
  },
  "extension": [
    {
      "url": "http://hl7.org/fhir/StructureDefinition/cqf-scope",
      "valueString": "@mii-termserv/dicom.terminology"
    }
  ]
}