{
  "resourceType": "ValueSet",
  "id": "dicom-cid-6330-PIRADSv2T2WITZLesionAssessmentCategory",
  "url": "http://dicom.nema.org/medical/dicom/current/output/chtml/part16/sect_CID_6330.html",
  "identifier": [
    {
      "system": "urn:ietf:rfc:3986",
      "value": "urn:oid:1.2.840.10008.6.1.1387"
    }
  ],
  "version": "20210714",
  "name": "PIRADS®v2T2WITZLesionAssessmentCategory",
  "status": "active",
  "experimental": false,
  "date": "2024-06-17",
  "publisher": "NEMA MITA DICOM",
  "description": "Transitive closure of CID 6330 PIRADS®v2T2WITZLesionAssessmentCategory",
  "copyright": "© 2024 NEMA",
  "compose": {
    "include": [
      {
        "system": "http://www.radlex.org",
        "concept": [
          {
            "code": "RID50312",
            "display": "PI-RADS 5 - T2WI TZ Very high"
          },
          {
            "code": "RID50311",
            "display": "PI-RADS 4 - T2WI TZ High"
          },
          {
            "code": "RID50310",
            "display": "PI-RADS 3 - T2WI TZ Intermediate"
          },
          {
            "code": "RID50325",
            "display": "PI-RADS X - T2WI TZ Inadequate or absent"
          },
          {
            "code": "RID50309",
            "display": "PI-RADS 2 - T2WI TZ Low"
          },
          {
            "code": "RID50308",
            "display": "PI-RADS 1 - T2WI TZ Very low"
          }
        ]
      }
    ]
  },
  "meta": {
    "tag": [
      {
        "system": "https://mii-termserv.de/fhir/su-termserv/CodeSystem/mii-cs-suts-resource-tags-project",
        "code": "dicom",
        "display": "Digital Imaging and Communications in Medicine"
      },
      {
        "system": "https://mii-termserv.de/fhir/su-termserv/CodeSystem/mii-cs-suts-resource-tags-project",
        "code": "international",
        "display": "International standard terminology"
      },
      {
        "system": "https://mii-termserv.de/fhir/su-termserv/CodeSystem/mii-cs-suts-resource-tags-dataset",
        "code": "dicom",
        "display": "DICOM Terminology"
      },
      {
        "system": "https://mii-termserv.de/fhir/su-termserv/CodeSystem/mii-cs-suts-resource-tags-dataset",
        "code": "standard",
        "display": "International Standards"
      },
      {
        "system": "https://mii-termserv.de/fhir/su-termserv/CodeSystem/mii-cs-suts-resource-tags-license",
        "code": "https://mii-termserv.de/licenses#dicom",
        "display": "DICOM license"
      }
    ]
  },
  "title": "PIRADS®v2T2WITZLesionAssessmentCategory",
  "text": {
    "status": "generated",
    "div": "<div xmlns=\"http://www.w3.org/1999/xhtml\"><h2>PIRADS®v2T2WITZLesionAssessmentCategory</h2><tt>http://dicom.nema.org/medical/dicom/current/output/chtml/part16/sect_CID_6330.html</tt><p>Transitive closure of CID 6330 PIRADS®v2T2WITZLesionAssessmentCategory</p><div><p><b>SU-TermServ Metadata</b></p><table><tbody><tr><td><b>Projects</b></td><td><ul><li>Digital Imaging and Communications in Medicine</li><li>International standard terminology</li></ul></td></tr><tr><td><b>Datasets</b></td><td><ul><li>DICOM Terminology</li><li>International Standards</li></ul></td></tr><tr><td><b>License</b></td><td><a href=\"https://mii-termserv.de/licenses#dicom\">DICOM license</a></td></tr><tr><td><b>Package Scope</b></td><td><a href=\"https://gitlab.com/groups/mii-termserv/fhir-resources/-/packages/?ForderBy%3Dversion%26sort%3Ddesc%26search%5B%5D%3D@mii-termserv/dicom.terminology\"><code>@mii-termserv/dicom.terminology</code></a></td></tr></tbody></table></div></div>"
  },
  "extension": [
    {
      "url": "http://hl7.org/fhir/StructureDefinition/cqf-scope",
      "valueString": "@mii-termserv/dicom.terminology"
    }
  ]
}