{
  "resourceType": "ValueSet",
  "id": "dicom-cid-7193-PhysicalObjectSegmentationPropertyType",
  "url": "http://dicom.nema.org/medical/dicom/current/output/chtml/part16/sect_CID_7193.html",
  "identifier": [
    {
      "system": "urn:ietf:rfc:3986",
      "value": "urn:oid:1.2.840.10008.6.1.1192"
    }
  ],
  "version": "20170914",
  "name": "PhysicalObjectSegmentationPropertyType",
  "status": "active",
  "experimental": false,
  "date": "2024-06-17",
  "publisher": "NEMA MITA DICOM",
  "description": "Transitive closure of CID 7193 PhysicalObjectSegmentationPropertyType",
  "copyright": "© 2024 NEMA",
  "compose": {
    "include": [
      {
        "system": "http://dicom.nema.org/resources/ontology/DCM",
        "concept": [
          {
            "code": "130113",
            "display": "Mold"
          },
          {
            "code": "130079",
            "display": "Brachytherapy channel shield"
          },
          {
            "code": "130112",
            "display": "Head and Neck Mask"
          },
          {
            "code": "130078",
            "display": "Brachytherapy source applicator"
          },
          {
            "code": "130111",
            "display": "Head Mask"
          },
          {
            "code": "130110",
            "display": "Headframe"
          },
          {
            "code": "130117",
            "display": "Body Frame"
          },
          {
            "code": "130116",
            "display": "Breast Board"
          },
          {
            "code": "130114",
            "display": "Cast"
          },
          {
            "code": "130119",
            "display": "Whole Body Pod"
          },
          {
            "code": "130118",
            "display": "Vacuum Mold"
          },
          {
            "code": "112172",
            "display": "Portacath"
          },
          {
            "code": "112173",
            "display": "Chest tube"
          },
          {
            "code": "112174",
            "display": "Central line"
          },
          {
            "code": "112175",
            "display": "Kidney stent"
          },
          {
            "code": "112176",
            "display": "Pancreatic stent"
          },
          {
            "code": "112177",
            "display": "Nipple ring"
          },
          {
            "code": "112178",
            "display": "Coin"
          },
          {
            "code": "130080",
            "display": "Brachytherapy channel"
          },
          {
            "code": "130120",
            "display": "Rectal Balloon"
          },
          {
            "code": "112171",
            "display": "Fiducial mark"
          },
          {
            "code": "130121",
            "display": "Vaginal Cylinder"
          },
          {
            "code": "130656",
            "display": "Head Fixation Board"
          },
          {
            "code": "130655",
            "display": "Abdominal Compression Arch"
          },
          {
            "code": "130654",
            "display": "Abdominal Compression Belt"
          },
          {
            "code": "130653",
            "display": "Breast Bridge"
          },
          {
            "code": "122485",
            "display": "Sphere"
          },
          {
            "code": "111175",
            "display": "Other Marker"
          },
          {
            "code": "128703",
            "display": "Ion Chamber Array"
          },
          {
            "code": "128702",
            "display": "Diode Array"
          },
          {
            "code": "128705",
            "display": "Liquid Ion Chamber"
          },
          {
            "code": "128704",
            "display": "Diode"
          },
          {
            "code": "128707",
            "display": "Ion Chamber"
          },
          {
            "code": "128706",
            "display": "OSLD"
          },
          {
            "code": "128709",
            "display": "RPLGD"
          },
          {
            "code": "128708",
            "display": "Diamond Detector"
          },
          {
            "code": "130854",
            "display": "Hand Grips"
          },
          {
            "code": "130853",
            "display": "Heel Stop"
          },
          {
            "code": "130852",
            "display": "Shin Rest"
          },
          {
            "code": "130855",
            "display": "Seat Pan"
          }
        ]
      },
      {
        "system": "http://snomed.info/sct",
        "concept": [
          {
            "code": "27065002",
            "display": "Suture"
          },
          {
            "code": "80919006",
            "display": "Jewelry"
          },
          {
            "code": "53350007",
            "display": "Prosthesis"
          },
          {
            "code": "26412008",
            "display": "Endotracheal tube"
          },
          {
            "code": "102304005",
            "display": "Measuring ruler"
          },
          {
            "code": "228761004",
            "display": "Collimator"
          },
          {
            "code": "20406008",
            "display": "Backrest"
          },
          {
            "code": "102313007",
            "display": "Rotational atherectomy device"
          },
          {
            "code": "224727009",
            "display": "Wall"
          },
          {
            "code": "27606000",
            "display": "Dental Prosthesis"
          },
          {
            "code": "63562005",
            "display": "Cervical collar"
          },
          {
            "code": "25510005",
            "display": "Heart valve prosthesis"
          },
          {
            "code": "102316004",
            "display": "Embolization particulate"
          },
          {
            "code": "468115008",
            "display": "Backrest"
          },
          {
            "code": "25062003",
            "display": "Feeding tube"
          },
          {
            "code": "89149003",
            "display": "Stretcher"
          },
          {
            "code": "48387007",
            "display": "Tracheotomy"
          },
          {
            "code": "56353002",
            "display": "Staple"
          },
          {
            "code": "102319006",
            "display": "Percutaneous transluminal angioplasty balloon"
          },
          {
            "code": "77444004",
            "display": "Bone Pin"
          },
          {
            "code": "102378009",
            "display": "BB shot (Lead Pellet)"
          },
          {
            "code": "72506001",
            "display": "Defibrillator"
          },
          {
            "code": "706683002",
            "display": "Headrest"
          },
          {
            "code": "468440006",
            "display": "Digital imager"
          },
          {
            "code": "129467007",
            "display": "ID Plate"
          },
          {
            "code": "65818007",
            "display": "Stent"
          },
          {
            "code": "709280007",
            "display": "Floor"
          },
          {
            "code": "40388003",
            "display": "Implant"
          },
          {
            "code": "706699008",
            "display": "Chair"
          },
          {
            "code": "19227008",
            "display": "Foreign body"
          },
          {
            "code": "57126000",
            "display": "Glue"
          },
          {
            "code": "272287005",
            "display": "Inlay Dental Restoration"
          },
          {
            "code": "102314001",
            "display": "Embolization coil"
          },
          {
            "code": "701933006",
            "display": "MOSFET radiation therapy dosimetry system dosimeter"
          },
          {
            "code": "19923001",
            "display": "Catheter"
          },
          {
            "code": "86122002",
            "display": "Bullet"
          },
          {
            "code": "102317008",
            "display": "Guiding catheter"
          },
          {
            "code": "464983000",
            "display": "Thermoluminescent radiation dosimeter"
          },
          {
            "code": "262301009",
            "display": "Opaque Marker"
          },
          {
            "code": "228745001",
            "display": "Bite block"
          },
          {
            "code": "360129009",
            "display": "Cardiac pacemaker lead"
          },
          {
            "code": "77720000",
            "display": "Clip"
          },
          {
            "code": "68183006",
            "display": "Bone Screw"
          },
          {
            "code": "102320000",
            "display": "Detachable balloon"
          },
          {
            "code": "126065006",
            "display": "Jejunostomy tube"
          },
          {
            "code": "19443004",
            "display": "Radioactive implant"
          },
          {
            "code": "118378005",
            "display": "Cardiac Pacemaker"
          },
          {
            "code": "129463006",
            "display": "J Wire"
          },
          {
            "code": "257409000",
            "display": "Vena cava filter"
          },
          {
            "code": "79068005",
            "display": "Needle"
          },
          {
            "code": "102312002",
            "display": "Atherectomy device"
          },
          {
            "code": "38586004",
            "display": "Laser"
          },
          {
            "code": "86407004",
            "display": "Table"
          },
          {
            "code": "129460009",
            "display": "Compression paddle"
          },
          {
            "code": "286558002",
            "display": "Ureteric stent"
          },
          {
            "code": "102315000",
            "display": "Embolization ball"
          },
          {
            "code": "14106009",
            "display": "Cardiac Pacemaker"
          },
          {
            "code": "272180002",
            "display": "Clothing"
          },
          {
            "code": "360066001",
            "display": "Left ventricular assist device"
          }
        ]
      }
    ]
  },
  "meta": {
    "tag": [
      {
        "system": "https://mii-termserv.de/fhir/su-termserv/CodeSystem/mii-cs-suts-resource-tags-project",
        "code": "dicom",
        "display": "Digital Imaging and Communications in Medicine"
      },
      {
        "system": "https://mii-termserv.de/fhir/su-termserv/CodeSystem/mii-cs-suts-resource-tags-project",
        "code": "international",
        "display": "International standard terminology"
      },
      {
        "system": "https://mii-termserv.de/fhir/su-termserv/CodeSystem/mii-cs-suts-resource-tags-dataset",
        "code": "dicom",
        "display": "DICOM Terminology"
      },
      {
        "system": "https://mii-termserv.de/fhir/su-termserv/CodeSystem/mii-cs-suts-resource-tags-dataset",
        "code": "standard",
        "display": "International Standards"
      },
      {
        "system": "https://mii-termserv.de/fhir/su-termserv/CodeSystem/mii-cs-suts-resource-tags-license",
        "code": "https://mii-termserv.de/licenses#dicom",
        "display": "DICOM license"
      }
    ]
  },
  "title": "PhysicalObjectSegmentationPropertyType",
  "text": {
    "status": "generated",
    "div": "<div xmlns=\"http://www.w3.org/1999/xhtml\"><h2>PhysicalObjectSegmentationPropertyType</h2><tt>http://dicom.nema.org/medical/dicom/current/output/chtml/part16/sect_CID_7193.html</tt><p>Transitive closure of CID 7193 PhysicalObjectSegmentationPropertyType</p><div><p><b>SU-TermServ Metadata</b></p><table><tbody><tr><td><b>Projects</b></td><td><ul><li>Digital Imaging and Communications in Medicine</li><li>International standard terminology</li></ul></td></tr><tr><td><b>Datasets</b></td><td><ul><li>DICOM Terminology</li><li>International Standards</li></ul></td></tr><tr><td><b>License</b></td><td><a href=\"https://mii-termserv.de/licenses#dicom\">DICOM license</a></td></tr><tr><td><b>Package Scope</b></td><td><a href=\"https://gitlab.com/groups/mii-termserv/fhir-resources/-/packages/?ForderBy%3Dversion%26sort%3Ddesc%26search%5B%5D%3D@mii-termserv/dicom.terminology\"><code>@mii-termserv/dicom.terminology</code></a></td></tr></tbody></table></div></div>"
  },
  "extension": [
    {
      "url": "http://hl7.org/fhir/StructureDefinition/cqf-scope",
      "valueString": "@mii-termserv/dicom.terminology"
    }
  ]
}