{
  "resourceType": "ValueSet",
  "id": "dicom-cid-7026-RadiotherapeuticDoseMeasurementDevice",
  "url": "http://dicom.nema.org/medical/dicom/current/output/chtml/part16/sect_CID_7026.html",
  "identifier": [
    {
      "system": "urn:ietf:rfc:3986",
      "value": "urn:oid:1.2.840.10008.6.1.1177"
    }
  ],
  "version": "20221201",
  "name": "RadiotherapeuticDoseMeasurementDevice",
  "status": "active",
  "experimental": false,
  "date": "2024-06-17",
  "publisher": "NEMA MITA DICOM",
  "description": "Transitive closure of CID 7026 RadiotherapeuticDoseMeasurementDevice",
  "copyright": "© 2024 NEMA",
  "compose": {
    "include": [
      {
        "system": "http://dicom.nema.org/resources/ontology/DCM",
        "concept": [
          {
            "code": "128703",
            "display": "Ion Chamber Array"
          },
          {
            "code": "128702",
            "display": "Diode Array"
          },
          {
            "code": "128705",
            "display": "Liquid Ion Chamber"
          },
          {
            "code": "128704",
            "display": "Diode"
          },
          {
            "code": "128707",
            "display": "Ion Chamber"
          },
          {
            "code": "128706",
            "display": "OSLD"
          },
          {
            "code": "128709",
            "display": "RPLGD"
          },
          {
            "code": "128708",
            "display": "Diamond Detector"
          },
          {
            "code": "128701",
            "display": "3D Gel"
          }
        ]
      },
      {
        "system": "http://snomed.info/sct",
        "concept": [
          {
            "code": "464983000",
            "display": "Thermoluminescent radiation dosimeter"
          },
          {
            "code": "701933006",
            "display": "MOSFET radiation therapy dosimetry system dosimeter"
          },
          {
            "code": "468440006",
            "display": "Digital imager"
          },
          {
            "code": "706247001",
            "display": "Medical X-Ray film"
          }
        ]
      }
    ]
  },
  "meta": {
    "tag": [
      {
        "system": "https://mii-termserv.de/fhir/su-termserv/CodeSystem/mii-cs-suts-resource-tags-project",
        "code": "dicom",
        "display": "Digital Imaging and Communications in Medicine"
      },
      {
        "system": "https://mii-termserv.de/fhir/su-termserv/CodeSystem/mii-cs-suts-resource-tags-project",
        "code": "international",
        "display": "International standard terminology"
      },
      {
        "system": "https://mii-termserv.de/fhir/su-termserv/CodeSystem/mii-cs-suts-resource-tags-dataset",
        "code": "dicom",
        "display": "DICOM Terminology"
      },
      {
        "system": "https://mii-termserv.de/fhir/su-termserv/CodeSystem/mii-cs-suts-resource-tags-dataset",
        "code": "standard",
        "display": "International Standards"
      },
      {
        "system": "https://mii-termserv.de/fhir/su-termserv/CodeSystem/mii-cs-suts-resource-tags-license",
        "code": "https://mii-termserv.de/licenses#dicom",
        "display": "DICOM license"
      }
    ]
  },
  "title": "RadiotherapeuticDoseMeasurementDevice",
  "text": {
    "status": "generated",
    "div": "<div xmlns=\"http://www.w3.org/1999/xhtml\"><h2>RadiotherapeuticDoseMeasurementDevice</h2><tt>http://dicom.nema.org/medical/dicom/current/output/chtml/part16/sect_CID_7026.html</tt><p>Transitive closure of CID 7026 RadiotherapeuticDoseMeasurementDevice</p><div><p><b>SU-TermServ Metadata</b></p><table><tbody><tr><td><b>Projects</b></td><td><ul><li>Digital Imaging and Communications in Medicine</li><li>International standard terminology</li></ul></td></tr><tr><td><b>Datasets</b></td><td><ul><li>DICOM Terminology</li><li>International Standards</li></ul></td></tr><tr><td><b>License</b></td><td><a href=\"https://mii-termserv.de/licenses#dicom\">DICOM license</a></td></tr><tr><td><b>Package Scope</b></td><td><a href=\"https://gitlab.com/groups/mii-termserv/fhir-resources/-/packages/?ForderBy%3Dversion%26sort%3Ddesc%26search%5B%5D%3D@mii-termserv/dicom.terminology\"><code>@mii-termserv/dicom.terminology</code></a></td></tr></tbody></table></div></div>"
  },
  "extension": [
    {
      "url": "http://hl7.org/fhir/StructureDefinition/cqf-scope",
      "valueString": "@mii-termserv/dicom.terminology"
    }
  ]
}