{
  "resourceType": "ValueSet",
  "id": "dicom-cid-502-VolumetricViewModifier",
  "url": "http://dicom.nema.org/medical/dicom/current/output/chtml/part16/sect_CID_502.html",
  "identifier": [
    {
      "system": "urn:ietf:rfc:3986",
      "value": "urn:oid:1.2.840.10008.6.1.1058"
    }
  ],
  "version": "20150915",
  "name": "VolumetricViewModifier",
  "status": "active",
  "experimental": false,
  "date": "2024-06-17",
  "publisher": "NEMA MITA DICOM",
  "description": "Transitive closure of CID 502 VolumetricViewModifier",
  "copyright": "© 2024 NEMA",
  "compose": {
    "include": [
      {
        "system": "http://dicom.nema.org/resources/ontology/DCM",
        "concept": [
          {
            "code": "111069",
            "display": "Crosstable"
          }
        ]
      },
      {
        "system": "http://snomed.info/sct",
        "concept": [
          {
            "code": "118438002",
            "display": "transoral"
          },
          {
            "code": "3583002",
            "display": "Caudal"
          },
          {
            "code": "30730003",
            "display": "Sagittal"
          },
          {
            "code": "399162004",
            "display": "caudad"
          },
          {
            "code": "398994001",
            "display": "Five chamber"
          },
          {
            "code": "103339001",
            "display": "Long axis"
          },
          {
            "code": "103341000",
            "display": "Off axis"
          },
          {
            "code": "103343002",
            "display": "Parasagittal"
          },
          {
            "code": "272466003",
            "display": "transforamenal"
          },
          {
            "code": "399214001",
            "display": "Four chamber"
          },
          {
            "code": "103340004",
            "display": "Short axis"
          },
          {
            "code": "399232001",
            "display": "Two chamber"
          },
          {
            "code": "21114003",
            "display": "Oblique"
          },
          {
            "code": "399196006",
            "display": "cephalad"
          },
          {
            "code": "81654009",
            "display": "Coronal"
          },
          {
            "code": "272476000",
            "display": "transthoracic"
          },
          {
            "code": "62824007",
            "display": "Transverse"
          },
          {
            "code": "278318001",
            "display": "transorbital"
          },
          {
            "code": "286866000",
            "display": "Mouth closed"
          },
          {
            "code": "66787007",
            "display": "Cephalic"
          },
          {
            "code": "38717003",
            "display": "Longitudinal"
          }
        ]
      }
    ]
  },
  "meta": {
    "tag": [
      {
        "system": "https://mii-termserv.de/fhir/su-termserv/CodeSystem/mii-cs-suts-resource-tags-project",
        "code": "dicom",
        "display": "Digital Imaging and Communications in Medicine"
      },
      {
        "system": "https://mii-termserv.de/fhir/su-termserv/CodeSystem/mii-cs-suts-resource-tags-project",
        "code": "international",
        "display": "International standard terminology"
      },
      {
        "system": "https://mii-termserv.de/fhir/su-termserv/CodeSystem/mii-cs-suts-resource-tags-dataset",
        "code": "dicom",
        "display": "DICOM Terminology"
      },
      {
        "system": "https://mii-termserv.de/fhir/su-termserv/CodeSystem/mii-cs-suts-resource-tags-dataset",
        "code": "standard",
        "display": "International Standards"
      },
      {
        "system": "https://mii-termserv.de/fhir/su-termserv/CodeSystem/mii-cs-suts-resource-tags-license",
        "code": "https://mii-termserv.de/licenses#dicom",
        "display": "DICOM license"
      }
    ]
  },
  "title": "VolumetricViewModifier",
  "text": {
    "status": "generated",
    "div": "<div xmlns=\"http://www.w3.org/1999/xhtml\"><h2>VolumetricViewModifier</h2><tt>http://dicom.nema.org/medical/dicom/current/output/chtml/part16/sect_CID_502.html</tt><p>Transitive closure of CID 502 VolumetricViewModifier</p><div><p><b>SU-TermServ Metadata</b></p><table><tbody><tr><td><b>Projects</b></td><td><ul><li>Digital Imaging and Communications in Medicine</li><li>International standard terminology</li></ul></td></tr><tr><td><b>Datasets</b></td><td><ul><li>DICOM Terminology</li><li>International Standards</li></ul></td></tr><tr><td><b>License</b></td><td><a href=\"https://mii-termserv.de/licenses#dicom\">DICOM license</a></td></tr><tr><td><b>Package Scope</b></td><td><a href=\"https://gitlab.com/groups/mii-termserv/fhir-resources/-/packages/?ForderBy%3Dversion%26sort%3Ddesc%26search%5B%5D%3D@mii-termserv/dicom.terminology\"><code>@mii-termserv/dicom.terminology</code></a></td></tr></tbody></table></div></div>"
  },
  "extension": [
    {
      "url": "http://hl7.org/fhir/StructureDefinition/cqf-scope",
      "valueString": "@mii-termserv/dicom.terminology"
    }
  ]
}