{
  "resourceType": "ValueSet",
  "id": "dicom-cid-7468-TextureMeasurement",
  "url": "http://dicom.nema.org/medical/dicom/current/output/chtml/part16/sect_CID_7468.html",
  "identifier": [
    {
      "system": "urn:ietf:rfc:3986",
      "value": "urn:oid:1.2.840.10008.6.1.1001"
    }
  ],
  "version": "20190121",
  "name": "TextureMeasurement",
  "status": "active",
  "experimental": false,
  "date": "2024-06-17",
  "publisher": "NEMA MITA DICOM",
  "description": "Transitive closure of CID 7468 TextureMeasurement",
  "copyright": "© 2024 NEMA",
  "compose": {
    "include": [
      {
        "system": "http://arxiv.org/abs/1612.07003",
        "concept": [
          {
            "code": "XMSY",
            "display": "Low Gray Level Zone Emphasis"
          },
          {
            "code": "3NSA",
            "display": "Zone Size Variance"
          },
          {
            "code": "VB3A",
            "display": "Normalized Zone Size Nonuniformity"
          },
          {
            "code": "5Z3W",
            "display": "Intensity Histogram Range"
          },
          {
            "code": "3KUM",
            "display": "Long Run High Gray Level Emphasis"
          },
          {
            "code": "WIFQ",
            "display": "Intensity Histogram Median"
          },
          {
            "code": "VFT7",
            "display": "Grey Level Non-uniformity of Distance Zone Counts"
          },
          {
            "code": "E8JP",
            "display": "Inverse Variance of GLCM"
          },
          {
            "code": "QCDE",
            "display": "Coarseness of NGTDM"
          },
          {
            "code": "EQ3F",
            "display": "Low dependence low grey level emphasis"
          },
          {
            "code": "OKJI",
            "display": "Dependence count non-uniformity normalized"
          },
          {
            "code": "6XV8",
            "display": "Dependence count percentage"
          },
          {
            "code": "R8DG",
            "display": "First Measure of Information Correlation of GLCM"
          },
          {
            "code": "65HE",
            "display": "Contrast of NGTDM"
          },
          {
            "code": "BYLV",
            "display": "Gray Level Variance in Size Zones"
          },
          {
            "code": "VQB3",
            "display": "Intensity Histogram Minimum Gradient"
          },
          {
            "code": "7NFM",
            "display": "Cluster Shade of GLCM"
          },
          {
            "code": "AE86",
            "display": "Cluster Prominence of GLCM"
          },
          {
            "code": "4JP3",
            "display": "Zone Size Nonuniformity"
          },
          {
            "code": "CAS9",
            "display": "Dependence count energy"
          },
          {
            "code": "CH89",
            "display": "Intensity Histogram Variance"
          },
          {
            "code": "IB1Z",
            "display": "Inverse Difference of GLCM"
          },
          {
            "code": "D2ZX",
            "display": "Intensity Histogram Mean Absolute Deviation"
          },
          {
            "code": "60VM",
            "display": "Joint Average of GLCM"
          },
          {
            "code": "WF0Z",
            "display": "Inverse Difference Moment of GLCM"
          },
          {
            "code": "WR0O",
            "display": "Intensity Histogram Interquartile Range"
          },
          {
            "code": "ACUI",
            "display": "Contrast of GLCM"
          },
          {
            "code": "5QRC",
            "display": "Small Zone Emphasis"
          },
          {
            "code": "OZ0C",
            "display": "Intensity Histogram 90th Percentile"
          },
          {
            "code": "RUVG",
            "display": "Small Distance Low Grey Level Emphasis"
          },
          {
            "code": "Y1RO",
            "display": "Normalized Gray Level Nonuniformity of Size Zone Counts"
          },
          {
            "code": "JA6D",
            "display": "Low dependence high grey level emphasis"
          },
          {
            "code": "4RNL",
            "display": "Intensity Histogram Median Absolute Deviation"
          },
          {
            "code": "HTZT",
            "display": "Short Run Low Gray Level Emphasis"
          },
          {
            "code": "P30P",
            "display": "Size Zone Percentage"
          },
          {
            "code": "8CE5",
            "display": "Gray Level Variance in Runs"
          },
          {
            "code": "5GN9",
            "display": "High Gray Level Zone Emphasis"
          },
          {
            "code": "WRZB",
            "display": "Intensity Histogram Robust Mean Absolute Deviation"
          },
          {
            "code": "9QMG",
            "display": "High dependence high grey level emphasis"
          },
          {
            "code": "GPMT",
            "display": "Intensity Histogram 10th Percentile"
          },
          {
            "code": "FCBV",
            "display": "Dependence count entropy"
          },
          {
            "code": "RHQZ",
            "display": "Intensity Histogram Minimum Gradient Gray Level"
          },
          {
            "code": "9ZK5",
            "display": "Run Percentage"
          },
          {
            "code": "1PFV",
            "display": "Grey level variance of NGLDM"
          },
          {
            "code": "VIWW",
            "display": "Distance Zone Percentage"
          },
          {
            "code": "88K1",
            "display": "Intensity Histogram Skewness"
          },
          {
            "code": "12CE",
            "display": "Intensity Histogram Maximum Gradient"
          },
          {
            "code": "QWB0",
            "display": "Autocorrelation of GLCM"
          },
          {
            "code": "W4KF",
            "display": "Long Runs Emphasis"
          },
          {
            "code": "IC23",
            "display": "Normalized Run Length Nonuniformity"
          },
          {
            "code": "YH51",
            "display": "Large Zone Low Gray Level Emphasis"
          },
          {
            "code": "DNX2",
            "display": "Dependence count variance"
          },
          {
            "code": "DG8W",
            "display": "Cluster Tendency of GLCM"
          },
          {
            "code": "S1RA",
            "display": "Low Grey Level Zone Emphasis"
          },
          {
            "code": "OAE7",
            "display": "High grey level count emphasis"
          },
          {
            "code": "NBZI",
            "display": "High dependence low grey level emphasis"
          },
          {
            "code": "TF7R",
            "display": "Difference Average of GLCM"
          },
          {
            "code": "3NCY",
            "display": "Intensity Histogram Maximum Gray Level"
          },
          {
            "code": "ZGXS",
            "display": "Sum Average of GLCM"
          },
          {
            "code": "SODN",
            "display": "Low dependence emphasis"
          },
          {
            "code": "SLWD",
            "display": "Intensity Histogram Quartile Coefficient of Dispersion"
          },
          {
            "code": "IVPO",
            "display": "Long Run Low Gray Level Emphasis"
          },
          {
            "code": "MB4I",
            "display": "Large Distance Emphasis"
          },
          {
            "code": "5SPA",
            "display": "Normalized grey level non-uniformity of NGLDM"
          },
          {
            "code": "OEEB",
            "display": "Sum Variance of GLCM"
          },
          {
            "code": "G3QZ",
            "display": "High Gray Level Run Emphasis"
          },
          {
            "code": "TLU2",
            "display": "Intensity Histogram Entropy"
          },
          {
            "code": "22OV",
            "display": "Short Runs Emphasis"
          },
          {
            "code": "IMOQ",
            "display": "High dependence emphasis"
          },
          {
            "code": "BJ5W",
            "display": "Intensity Histogram Uniformity"
          },
          {
            "code": "GD3A",
            "display": "Short Run High Gray Level Emphasis"
          },
          {
            "code": "KLTH",
            "display": "Large Distance High Grey Level Emphasis"
          },
          {
            "code": "JNSA",
            "display": "Gray Level Nonuniformity of Size Zone Counts"
          },
          {
            "code": "HW1V",
            "display": "Small Zone High Gray Level Emphasis"
          },
          {
            "code": "8S9J",
            "display": "Dissimilarity of GLCM"
          },
          {
            "code": "W92Y",
            "display": "Run Length Nonuniformity"
          },
          {
            "code": "X6K6",
            "display": "Intensity Histogram Mean"
          },
          {
            "code": "SXLW",
            "display": "Run Length Variance"
          },
          {
            "code": "GBDU",
            "display": "Zone Distance Entropy"
          },
          {
            "code": "TL9H",
            "display": "Low grey level count emphasis"
          },
          {
            "code": "48P8",
            "display": "Large Zone Emphasis"
          },
          {
            "code": "HJ9O",
            "display": "Run Entropy"
          },
          {
            "code": "HDEZ",
            "display": "Complexity of NGTDM"
          },
          {
            "code": "QK93",
            "display": "Grey Level Variance in Distance Zones"
          },
          {
            "code": "V294",
            "display": "Zone Distance Non-uniformity"
          },
          {
            "code": "7WT1",
            "display": "Zone Distance Variance"
          },
          {
            "code": "AMMC",
            "display": "Intensity Histogram Mode"
          },
          {
            "code": "V3SW",
            "display": "Low Gray Level Run Emphasis"
          },
          {
            "code": "GYBY",
            "display": "Joint Maximum of GLCM"
          },
          {
            "code": "D3YU",
            "display": "Difference Variance of GLCM"
          },
          {
            "code": "NI2N",
            "display": "Correlation of GLCM"
          },
          {
            "code": "K26C",
            "display": "High Grey Level Zone Emphasis"
          },
          {
            "code": "NQ30",
            "display": "Busyness of NGTDM"
          },
          {
            "code": "C3I7",
            "display": "Intensity Histogram Kurtosis"
          },
          {
            "code": "1X9X",
            "display": "Strength of NGTDM"
          },
          {
            "code": "FP8K",
            "display": "Grey level non-uniformity of NGLDM"
          },
          {
            "code": "TU9B",
            "display": "Joint Entropy of GLCM"
          },
          {
            "code": "J17V",
            "display": "Large Zone High Gray Level Emphasis"
          },
          {
            "code": "8ZQL",
            "display": "Angular Second Moment of GLCM"
          },
          {
            "code": "A7WM",
            "display": "Large Distance Low Grey Level Emphasis"
          },
          {
            "code": "1QCO",
            "display": "Normalized Inverse Difference Moment of GLCM"
          },
          {
            "code": "UR99",
            "display": "Joint Variance of GLCM"
          },
          {
            "code": "OVBL",
            "display": "Normalized Gray Level Nonuniformity in Runs"
          },
          {
            "code": "JN9H",
            "display": "Second Measure of Information Correlation of GLCM"
          },
          {
            "code": "8E6O",
            "display": "Intensity Histogram Maximum Gradient Gray Level"
          },
          {
            "code": "1PR8",
            "display": "Intensity Histogram Minimum Gray Level"
          },
          {
            "code": "NDRX",
            "display": "Normalized Inverse Difference of GLCM"
          },
          {
            "code": "R5YN",
            "display": "Gray Level Nonuniformity in Runs"
          },
          {
            "code": "5RAI",
            "display": "Small Zone Low Gray Level Emphasis"
          },
          {
            "code": "GU8N",
            "display": "Zone Size Entropy"
          },
          {
            "code": "DKNJ",
            "display": "Small Distance High Grey Level Emphasis"
          },
          {
            "code": "NTRS",
            "display": "Difference Entropy of GLCM"
          },
          {
            "code": "0GBI",
            "display": "Small Distance Emphasis"
          },
          {
            "code": "CWYJ",
            "display": "Intensity Histogram Coefficient of Variation"
          },
          {
            "code": "Z87G",
            "display": "Dependence count non-uniformity"
          },
          {
            "code": "P6QZ",
            "display": "Sum Entropy of GLCM"
          },
          {
            "code": "7HP3",
            "display": "Normalized Grey Level Non-uniformity of Distance Zone Counts"
          },
          {
            "code": "IATH",
            "display": "Normalized Zone Distance Non-uniformity"
          }
        ]
      },
      {
        "system": "http://dicom.nema.org/resources/ontology/DCM",
        "concept": [
          {
            "code": "126061",
            "display": "Root Angular Second Moment of GLCM"
          },
          {
            "code": "126050",
            "display": "Fractal Dimension"
          }
        ]
      }
    ]
  },
  "meta": {
    "tag": [
      {
        "system": "https://mii-termserv.de/fhir/su-termserv/CodeSystem/mii-cs-suts-resource-tags-project",
        "code": "dicom",
        "display": "Digital Imaging and Communications in Medicine"
      },
      {
        "system": "https://mii-termserv.de/fhir/su-termserv/CodeSystem/mii-cs-suts-resource-tags-project",
        "code": "international",
        "display": "International standard terminology"
      },
      {
        "system": "https://mii-termserv.de/fhir/su-termserv/CodeSystem/mii-cs-suts-resource-tags-dataset",
        "code": "dicom",
        "display": "DICOM Terminology"
      },
      {
        "system": "https://mii-termserv.de/fhir/su-termserv/CodeSystem/mii-cs-suts-resource-tags-dataset",
        "code": "standard",
        "display": "International Standards"
      },
      {
        "system": "https://mii-termserv.de/fhir/su-termserv/CodeSystem/mii-cs-suts-resource-tags-license",
        "code": "https://mii-termserv.de/licenses#dicom",
        "display": "DICOM license"
      }
    ]
  },
  "title": "TextureMeasurement",
  "text": {
    "status": "generated",
    "div": "<div xmlns=\"http://www.w3.org/1999/xhtml\"><h2>TextureMeasurement</h2><tt>http://dicom.nema.org/medical/dicom/current/output/chtml/part16/sect_CID_7468.html</tt><p>Transitive closure of CID 7468 TextureMeasurement</p><div><p><b>SU-TermServ Metadata</b></p><table><tbody><tr><td><b>Projects</b></td><td><ul><li>Digital Imaging and Communications in Medicine</li><li>International standard terminology</li></ul></td></tr><tr><td><b>Datasets</b></td><td><ul><li>DICOM Terminology</li><li>International Standards</li></ul></td></tr><tr><td><b>License</b></td><td><a href=\"https://mii-termserv.de/licenses#dicom\">DICOM license</a></td></tr><tr><td><b>Package Scope</b></td><td><a href=\"https://gitlab.com/groups/mii-termserv/fhir-resources/-/packages/?ForderBy%3Dversion%26sort%3Ddesc%26search%5B%5D%3D@mii-termserv/dicom.terminology\"><code>@mii-termserv/dicom.terminology</code></a></td></tr></tbody></table></div></div>"
  },
  "extension": [
    {
      "url": "http://hl7.org/fhir/StructureDefinition/cqf-scope",
      "valueString": "@mii-termserv/dicom.terminology"
    }
  ]
}