{
  "resourceType": "ValueSet",
  "id": "dicom-cid-6051-BreastProcedureReason",
  "url": "http://dicom.nema.org/medical/dicom/current/output/chtml/part16/sect_CID_6051.html",
  "identifier": [
    {
      "system": "urn:ietf:rfc:3986",
      "value": "urn:oid:1.2.840.10008.6.1.380"
    }
  ],
  "version": "20230630",
  "name": "BreastProcedureReason",
  "status": "active",
  "experimental": false,
  "date": "2024-06-17",
  "publisher": "NEMA MITA DICOM",
  "description": "Transitive closure of CID 6051 BreastProcedureReason",
  "copyright": "© 2024 NEMA",
  "compose": {
    "include": [
      {
        "system": "http://dicom.nema.org/resources/ontology/DCM",
        "concept": [
          {
            "code": "111144",
            "display": "Needle localization and biopsy"
          },
          {
            "code": "111420",
            "display": "History of benign breast biopsy"
          },
          {
            "code": "111123",
            "display": "Marker placement"
          },
          {
            "code": "111421",
            "display": "Personal history of breast cancer with breast conservation therapy"
          },
          {
            "code": "111124",
            "display": "Personal history of breast cancer with mastectomy"
          },
          {
            "code": "111125",
            "display": "Known biopsy proven malignancy"
          },
          {
            "code": "111402",
            "display": "Clinical finding"
          },
          {
            "code": "111127",
            "display": "Targeted"
          },
          {
            "code": "111128",
            "display": "Survey"
          },
          {
            "code": "111590",
            "display": "Recall for technical reasons"
          },
          {
            "code": "122505",
            "display": "Calibration"
          },
          {
            "code": "111591",
            "display": "Recall for imaging findings"
          },
          {
            "code": "111592",
            "display": "Recall for patient symptoms/ clinical findings"
          },
          {
            "code": "111418",
            "display": "Review of an outside study"
          },
          {
            "code": "111419",
            "display": "Additional evaluation requested from abnormal screening study"
          },
          {
            "code": "110002",
            "display": "Quality Control"
          },
          {
            "code": "111415",
            "display": "Additional evaluation requested from prior study"
          },
          {
            "code": "111416",
            "display": "Follow-up at short interval from prior study"
          },
          {
            "code": "111417",
            "display": "History of breast augmentation, asymptomatic"
          }
        ]
      },
      {
        "system": "http://snomed.info/sct",
        "concept": [
          {
            "code": "59214008",
            "display": "Reduction mammoplasty"
          },
          {
            "code": "261004008",
            "display": "Diagnostic"
          },
          {
            "code": "429479009",
            "display": "History of radiation therapy"
          },
          {
            "code": "415076002",
            "display": "Personal history of breast cancer"
          },
          {
            "code": "22890008",
            "display": "Augmentation mammoplasty"
          },
          {
            "code": "384692006",
            "display": "Brachytherapy"
          },
          {
            "code": "360156006",
            "display": "Screening"
          }
        ]
      }
    ]
  },
  "meta": {
    "tag": [
      {
        "system": "https://mii-termserv.de/fhir/su-termserv/CodeSystem/mii-cs-suts-resource-tags-project",
        "code": "dicom",
        "display": "Digital Imaging and Communications in Medicine"
      },
      {
        "system": "https://mii-termserv.de/fhir/su-termserv/CodeSystem/mii-cs-suts-resource-tags-project",
        "code": "international",
        "display": "International standard terminology"
      },
      {
        "system": "https://mii-termserv.de/fhir/su-termserv/CodeSystem/mii-cs-suts-resource-tags-dataset",
        "code": "dicom",
        "display": "DICOM Terminology"
      },
      {
        "system": "https://mii-termserv.de/fhir/su-termserv/CodeSystem/mii-cs-suts-resource-tags-dataset",
        "code": "standard",
        "display": "International Standards"
      },
      {
        "system": "https://mii-termserv.de/fhir/su-termserv/CodeSystem/mii-cs-suts-resource-tags-license",
        "code": "https://mii-termserv.de/licenses#dicom",
        "display": "DICOM license"
      }
    ]
  },
  "title": "BreastProcedureReason",
  "text": {
    "status": "generated",
    "div": "<div xmlns=\"http://www.w3.org/1999/xhtml\"><h2>BreastProcedureReason</h2><tt>http://dicom.nema.org/medical/dicom/current/output/chtml/part16/sect_CID_6051.html</tt><p>Transitive closure of CID 6051 BreastProcedureReason</p><div><p><b>SU-TermServ Metadata</b></p><table><tbody><tr><td><b>Projects</b></td><td><ul><li>Digital Imaging and Communications in Medicine</li><li>International standard terminology</li></ul></td></tr><tr><td><b>Datasets</b></td><td><ul><li>DICOM Terminology</li><li>International Standards</li></ul></td></tr><tr><td><b>License</b></td><td><a href=\"https://mii-termserv.de/licenses#dicom\">DICOM license</a></td></tr><tr><td><b>Package Scope</b></td><td><a href=\"https://gitlab.com/groups/mii-termserv/fhir-resources/-/packages/?ForderBy%3Dversion%26sort%3Ddesc%26search%5B%5D%3D@mii-termserv/dicom.terminology\"><code>@mii-termserv/dicom.terminology</code></a></td></tr></tbody></table></div></div>"
  },
  "extension": [
    {
      "url": "http://hl7.org/fhir/StructureDefinition/cqf-scope",
      "valueString": "@mii-termserv/dicom.terminology"
    }
  ]
}