{
  "resourceType": "ValueSet",
  "id": "dicom-cid-6054-BreastImagingFinding",
  "url": "http://dicom.nema.org/medical/dicom/current/output/chtml/part16/sect_CID_6054.html",
  "identifier": [
    {
      "system": "urn:ietf:rfc:3986",
      "value": "urn:oid:1.2.840.10008.6.1.383"
    }
  ],
  "version": "20050110",
  "name": "BreastImagingFinding",
  "status": "active",
  "experimental": false,
  "date": "2024-06-17",
  "publisher": "NEMA MITA DICOM",
  "description": "Transitive closure of CID 6054 BreastImagingFinding",
  "copyright": "© 2024 NEMA",
  "compose": {
    "include": [
      {
        "system": "http://dicom.nema.org/resources/ontology/DCM",
        "concept": [
          {
            "code": "111460",
            "display": "Complex cyst"
          },
          {
            "code": "111461",
            "display": "Intracystic lesion"
          },
          {
            "code": "111462",
            "display": "Solid mass"
          },
          {
            "code": "111287",
            "display": "Normal breast tissue"
          },
          {
            "code": "111100",
            "display": "Breast geometry"
          },
          {
            "code": "111101",
            "display": "Image Quality"
          },
          {
            "code": "111429",
            "display": "Duct narrowing"
          },
          {
            "code": "111102",
            "display": "Non-lesion"
          },
          {
            "code": "111425",
            "display": "Intraluminal filling defect"
          },
          {
            "code": "111129",
            "display": "Clustered microcysts"
          },
          {
            "code": "111426",
            "display": "Multiple filling defect"
          },
          {
            "code": "111427",
            "display": "Abrupt duct termination"
          },
          {
            "code": "111428",
            "display": "Extravasation"
          },
          {
            "code": "111130",
            "display": "Complicated cyst"
          },
          {
            "code": "111430",
            "display": "Cyst fill"
          },
          {
            "code": "111111",
            "display": "Cooper's ligament changes"
          },
          {
            "code": "111112",
            "display": "Mass in the skin"
          },
          {
            "code": "111099",
            "display": "Selected region"
          },
          {
            "code": "111113",
            "display": "Mass on the skin"
          },
          {
            "code": "111459",
            "display": "Mass with calcifications"
          }
        ]
      },
      {
        "system": "http://snomed.info/sct",
        "concept": [
          {
            "code": "309587003",
            "display": "Calcification of breast"
          },
          {
            "code": "129715009",
            "display": "Breast composition"
          },
          {
            "code": "19227008",
            "display": "Foreign body"
          },
          {
            "code": "399294002",
            "display": "Cyst of breast"
          },
          {
            "code": "169254007",
            "display": "Ultrasound scan normal"
          },
          {
            "code": "68171009",
            "display": "Axillary lymph node"
          },
          {
            "code": "129790003",
            "display": "Asymmetric breast tissue"
          },
          {
            "code": "129796009",
            "display": "Skin retraction of breast"
          },
          {
            "code": "129792006",
            "display": "Architectural distortion of breast"
          },
          {
            "code": "129794007",
            "display": "Tubular density"
          },
          {
            "code": "129793001",
            "display": "Mammography breast density"
          },
          {
            "code": "95324001",
            "display": "Skin lesion"
          },
          {
            "code": "290084006",
            "display": "Breast normal"
          },
          {
            "code": "129797000",
            "display": "Skin thickening of breast"
          },
          {
            "code": "129789007",
            "display": "Focal asymmetric breast tissue"
          },
          {
            "code": "59441001",
            "display": "Lymph node"
          },
          {
            "code": "127189005",
            "display": "Axillary adenopathy"
          },
          {
            "code": "79654002",
            "display": "Edema"
          },
          {
            "code": "129795008",
            "display": "Trabecular thickening of breast"
          },
          {
            "code": "76649007",
            "display": "Sebaceous cyst of skin of breast"
          },
          {
            "code": "129770007",
            "display": "Individual Calcification"
          },
          {
            "code": "24142002",
            "display": "Nipple"
          },
          {
            "code": "22049009",
            "display": "Mammary duct ectasia"
          },
          {
            "code": "129788004",
            "display": "Mammographic breast mass"
          },
          {
            "code": "129769006",
            "display": "Calcification Cluster"
          },
          {
            "code": "40388003",
            "display": "Implant"
          },
          {
            "code": "443808008",
            "display": "Intramammary lymph node"
          }
        ]
      }
    ]
  },
  "meta": {
    "tag": [
      {
        "system": "https://mii-termserv.de/fhir/su-termserv/CodeSystem/mii-cs-suts-resource-tags-project",
        "code": "dicom",
        "display": "Digital Imaging and Communications in Medicine"
      },
      {
        "system": "https://mii-termserv.de/fhir/su-termserv/CodeSystem/mii-cs-suts-resource-tags-project",
        "code": "international",
        "display": "International standard terminology"
      },
      {
        "system": "https://mii-termserv.de/fhir/su-termserv/CodeSystem/mii-cs-suts-resource-tags-dataset",
        "code": "dicom",
        "display": "DICOM Terminology"
      },
      {
        "system": "https://mii-termserv.de/fhir/su-termserv/CodeSystem/mii-cs-suts-resource-tags-dataset",
        "code": "standard",
        "display": "International Standards"
      },
      {
        "system": "https://mii-termserv.de/fhir/su-termserv/CodeSystem/mii-cs-suts-resource-tags-license",
        "code": "https://mii-termserv.de/licenses#dicom",
        "display": "DICOM license"
      }
    ]
  },
  "title": "BreastImagingFinding",
  "text": {
    "status": "generated",
    "div": "<div xmlns=\"http://www.w3.org/1999/xhtml\"><h2>BreastImagingFinding</h2><tt>http://dicom.nema.org/medical/dicom/current/output/chtml/part16/sect_CID_6054.html</tt><p>Transitive closure of CID 6054 BreastImagingFinding</p><div><p><b>SU-TermServ Metadata</b></p><table><tbody><tr><td><b>Projects</b></td><td><ul><li>Digital Imaging and Communications in Medicine</li><li>International standard terminology</li></ul></td></tr><tr><td><b>Datasets</b></td><td><ul><li>DICOM Terminology</li><li>International Standards</li></ul></td></tr><tr><td><b>License</b></td><td><a href=\"https://mii-termserv.de/licenses#dicom\">DICOM license</a></td></tr><tr><td><b>Package Scope</b></td><td><a href=\"https://gitlab.com/groups/mii-termserv/fhir-resources/-/packages/?ForderBy%3Dversion%26sort%3Ddesc%26search%5B%5D%3D@mii-termserv/dicom.terminology\"><code>@mii-termserv/dicom.terminology</code></a></td></tr></tbody></table></div></div>"
  },
  "extension": [
    {
      "url": "http://hl7.org/fhir/StructureDefinition/cqf-scope",
      "valueString": "@mii-termserv/dicom.terminology"
    }
  ]
}