{
  "resourceType": "ValueSet",
  "id": "dicom-cid-3010-CardiovascularAnatomicStructure",
  "url": "http://dicom.nema.org/medical/dicom/current/output/chtml/part16/sect_CID_3010.html",
  "identifier": [
    {
      "system": "urn:ietf:rfc:3986",
      "value": "urn:oid:1.2.840.10008.6.1.45"
    }
  ],
  "version": "20200309",
  "name": "CardiovascularAnatomicStructure",
  "status": "active",
  "experimental": false,
  "date": "2024-06-17",
  "publisher": "NEMA MITA DICOM",
  "description": "Transitive closure of CID 3010 CardiovascularAnatomicStructure",
  "copyright": "© 2024 NEMA",
  "compose": {
    "include": [
      {
        "system": "http://snomed.info/sct",
        "concept": [
          {
            "code": "86117002",
            "display": "Internal carotid artery"
          },
          {
            "code": "9454009",
            "display": "Subclavian vein"
          },
          {
            "code": "113269004",
            "display": "External iliac artery"
          },
          {
            "code": "57850000",
            "display": "Truncus coeliacus"
          },
          {
            "code": "59011009",
            "display": "Basilar artery"
          },
          {
            "code": "128565007",
            "display": "Apex of right ventricle"
          },
          {
            "code": "8629005",
            "display": "Superior right pulmonary vein"
          },
          {
            "code": "64131007",
            "display": "Inferior vena cava"
          },
          {
            "code": "78480002",
            "display": "Right pulmonary artery"
          },
          {
            "code": "128559007",
            "display": "Genicular artery"
          },
          {
            "code": "70238003",
            "display": "Left ventricle inflow"
          },
          {
            "code": "34340008",
            "display": "Venous network"
          },
          {
            "code": "69105007",
            "display": "Carotid Artery"
          },
          {
            "code": "253276007",
            "display": "Common atrium"
          },
          {
            "code": "50536004",
            "display": "Umbilical artery"
          },
          {
            "code": "14944004",
            "display": "Primitive aorta"
          },
          {
            "code": "128551005",
            "display": "Aortic fistula"
          },
          {
            "code": "13418002",
            "display": "Left ventricle outflow tract"
          },
          {
            "code": "45631007",
            "display": "Radial artery"
          },
          {
            "code": "69833005",
            "display": "Right femoral artery"
          },
          {
            "code": "72021004",
            "display": "Superior thyroid artery"
          },
          {
            "code": "10293006",
            "display": "Iliac artery"
          },
          {
            "code": "113270003",
            "display": "Left femoral artery"
          },
          {
            "code": "68053000",
            "display": "Anterior tibial artery"
          },
          {
            "code": "61959006",
            "display": "Truncus arteriosus communis"
          },
          {
            "code": "51114001",
            "display": "Artery"
          },
          {
            "code": "128553008",
            "display": "Antecubital vein"
          },
          {
            "code": "32062004",
            "display": "Common carotid artery"
          },
          {
            "code": "15825003",
            "display": "Aorta"
          },
          {
            "code": "83330001",
            "display": "Patent ductus arteriosus"
          },
          {
            "code": "15672000",
            "display": "Superficial temporal artery"
          },
          {
            "code": "128583004",
            "display": "Mesenteric vein"
          },
          {
            "code": "29092000",
            "display": "Vein"
          },
          {
            "code": "128556000",
            "display": "Congenital coronary artery fistula to left ventricle"
          },
          {
            "code": "122972007",
            "display": "Pulmonary vein"
          },
          {
            "code": "113273001",
            "display": "Inferior right pulmonary vein"
          },
          {
            "code": "41801008",
            "display": "Coronary artery"
          },
          {
            "code": "63507001",
            "display": "External iliac vein"
          },
          {
            "code": "111289009",
            "display": "Pulmonary arteriovenous fistula"
          },
          {
            "code": "32672002",
            "display": "Descending aorta"
          },
          {
            "code": "36765005",
            "display": "Subclavian artery"
          },
          {
            "code": "91830000",
            "display": "Body conduit"
          },
          {
            "code": "53549008",
            "display": "Ophthalmic artery"
          },
          {
            "code": "8017000",
            "display": "Right ventricle inflow"
          },
          {
            "code": "86570000",
            "display": "Mesenteric artery"
          },
          {
            "code": "43899006",
            "display": "Popliteal artery"
          },
          {
            "code": "128567004",
            "display": "Pulmonary venous atrium"
          },
          {
            "code": "20115005",
            "display": "Brachial vein"
          },
          {
            "code": "90024005",
            "display": "Internal iliac artery"
          },
          {
            "code": "128586007",
            "display": "Pulmonary chamber of cor triatriatum"
          },
          {
            "code": "48345005",
            "display": "Superior vena cava"
          },
          {
            "code": "44984001",
            "display": "Ulnar artery"
          },
          {
            "code": "87878005",
            "display": "Left ventricle"
          },
          {
            "code": "17388009",
            "display": "Anterior spinal artery"
          },
          {
            "code": "76015000",
            "display": "Hepatic artery"
          },
          {
            "code": "35819009",
            "display": "Splenic vein"
          },
          {
            "code": "8821006",
            "display": "Peroneal artery"
          },
          {
            "code": "44627009",
            "display": "Right ventricle outflow tract"
          },
          {
            "code": "362072009",
            "display": "Saphenous vein"
          },
          {
            "code": "12691009",
            "display": "Innominate artery"
          },
          {
            "code": "22083002",
            "display": "Splenic artery"
          },
          {
            "code": "2841007",
            "display": "Renal artery"
          },
          {
            "code": "43863001",
            "display": "Superior left pulmonary vein"
          },
          {
            "code": "128589000",
            "display": "Systemic collateral artery to lung"
          },
          {
            "code": "23074001",
            "display": "Facial artery"
          },
          {
            "code": "34635009",
            "display": "Lumbar artery"
          },
          {
            "code": "128564006",
            "display": "Apex of left ventricle"
          },
          {
            "code": "72107004",
            "display": "Azygos vein"
          },
          {
            "code": "7657000",
            "display": "Femoral artery"
          },
          {
            "code": "81040000",
            "display": "Pulmonary artery"
          },
          {
            "code": "17137000",
            "display": "Brachial artery"
          },
          {
            "code": "244411005",
            "display": "Iliac vein"
          },
          {
            "code": "128558004",
            "display": "Congenital coronary artery fistula to right ventricle"
          },
          {
            "code": "128569001",
            "display": "Posterior medial tributary"
          },
          {
            "code": "181347005",
            "display": "Common Femoral Artery"
          },
          {
            "code": "128584005",
            "display": "Pulmonary artery conduit"
          },
          {
            "code": "73829009",
            "display": "Right atrium"
          },
          {
            "code": "8012006",
            "display": "Anterior communicating artery"
          },
          {
            "code": "128555001",
            "display": "Congenital coronary artery fistula to left atrium"
          },
          {
            "code": "53085002",
            "display": "Right ventricle"
          },
          {
            "code": "113262008",
            "display": "Thoracic aorta"
          },
          {
            "code": "45503006",
            "display": "Common ventricle"
          },
          {
            "code": "35532006",
            "display": "Vena cava"
          },
          {
            "code": "90219004",
            "display": "Coronary sinus"
          },
          {
            "code": "67937003",
            "display": "Axillary Artery"
          },
          {
            "code": "50408007",
            "display": "Left pulmonary artery"
          },
          {
            "code": "8993003",
            "display": "Hepatic vein"
          },
          {
            "code": "69327007",
            "display": "Internal mammary artery"
          },
          {
            "code": "85234005",
            "display": "Vertebral artery"
          },
          {
            "code": "128566008",
            "display": "Pulmonary vein confluence"
          },
          {
            "code": "128587003",
            "display": "Saphenofemoral junction"
          },
          {
            "code": "12123001",
            "display": "Internal jugular vein"
          },
          {
            "code": "128979005",
            "display": "Lacrimal artery of right eye"
          },
          {
            "code": "22286001",
            "display": "External carotid artery"
          },
          {
            "code": "42258001",
            "display": "Superior mesenteric artery"
          },
          {
            "code": "284639000",
            "display": "Umbilical vein"
          },
          {
            "code": "46027005",
            "display": "Common iliac vein"
          },
          {
            "code": "13363002",
            "display": "Posterior tibial artery"
          },
          {
            "code": "83419000",
            "display": "Femoral vein"
          },
          {
            "code": "68300000",
            "display": "Right auricular appendage"
          },
          {
            "code": "5928000",
            "display": "Great cardiac vein"
          },
          {
            "code": "8887007",
            "display": "Innominate vein"
          },
          {
            "code": "91707000",
            "display": "Primitive pulmonary artery"
          },
          {
            "code": "181349008",
            "display": "Superficial Femoral Artery"
          },
          {
            "code": "32764006",
            "display": "Portal vein"
          },
          {
            "code": "51249003",
            "display": "Inferior left pulmonary vein"
          },
          {
            "code": "43119007",
            "display": "Posterior communication artery"
          },
          {
            "code": "128563000",
            "display": "Juxtaposed atrial appendage"
          },
          {
            "code": "57034009",
            "display": "Aortic arch"
          },
          {
            "code": "56400007",
            "display": "Renal vein"
          },
          {
            "code": "128548003",
            "display": "Boyd's perforating vein"
          },
          {
            "code": "7832008",
            "display": "Abdominal aorta"
          },
          {
            "code": "73634005",
            "display": "Common iliac artery"
          },
          {
            "code": "20699002",
            "display": "Cephalic vein"
          },
          {
            "code": "113264009",
            "display": "Lingual artery"
          },
          {
            "code": "110568007",
            "display": "Gastric vein"
          },
          {
            "code": "128557009",
            "display": "Congenital coronary artery fistula to right atrium"
          },
          {
            "code": "195416006",
            "display": "Inferior cardiac vein"
          },
          {
            "code": "128981007",
            "display": "Baffle"
          },
          {
            "code": "33626005",
            "display": "Left auricular appendage"
          },
          {
            "code": "59749000",
            "display": "Lacrimal artery"
          },
          {
            "code": "31145008",
            "display": "Occipital artery"
          },
          {
            "code": "128568009",
            "display": "Systemic venous atrium"
          },
          {
            "code": "54247002",
            "display": "Ascending aorta"
          },
          {
            "code": "128560002",
            "display": "Hunterian perforating vein"
          },
          {
            "code": "128585006",
            "display": "Anomalous pulmonary vein"
          },
          {
            "code": "194996006",
            "display": "Anterior cardiac vein"
          },
          {
            "code": "31677005",
            "display": "Profunda Femoris Artery"
          },
          {
            "code": "82471001",
            "display": "Left atrium"
          },
          {
            "code": "88556005",
            "display": "Cerebral artery"
          },
          {
            "code": "68705008",
            "display": "Axillary vein"
          },
          {
            "code": "33795007",
            "display": "Inferior mesenteric artery"
          },
          {
            "code": "60734001",
            "display": "Great saphenous vein"
          },
          {
            "code": "32114007",
            "display": "Occipital vein"
          },
          {
            "code": "128554002",
            "display": "Dodd's perforating vein"
          }
        ]
      }
    ]
  },
  "meta": {
    "tag": [
      {
        "system": "https://mii-termserv.de/fhir/su-termserv/CodeSystem/mii-cs-suts-resource-tags-project",
        "code": "dicom",
        "display": "Digital Imaging and Communications in Medicine"
      },
      {
        "system": "https://mii-termserv.de/fhir/su-termserv/CodeSystem/mii-cs-suts-resource-tags-project",
        "code": "international",
        "display": "International standard terminology"
      },
      {
        "system": "https://mii-termserv.de/fhir/su-termserv/CodeSystem/mii-cs-suts-resource-tags-dataset",
        "code": "dicom",
        "display": "DICOM Terminology"
      },
      {
        "system": "https://mii-termserv.de/fhir/su-termserv/CodeSystem/mii-cs-suts-resource-tags-dataset",
        "code": "standard",
        "display": "International Standards"
      },
      {
        "system": "https://mii-termserv.de/fhir/su-termserv/CodeSystem/mii-cs-suts-resource-tags-license",
        "code": "https://mii-termserv.de/licenses#dicom",
        "display": "DICOM license"
      }
    ]
  },
  "title": "CardiovascularAnatomicStructure",
  "text": {
    "status": "generated",
    "div": "<div xmlns=\"http://www.w3.org/1999/xhtml\"><h2>CardiovascularAnatomicStructure</h2><tt>http://dicom.nema.org/medical/dicom/current/output/chtml/part16/sect_CID_3010.html</tt><p>Transitive closure of CID 3010 CardiovascularAnatomicStructure</p><div><p><b>SU-TermServ Metadata</b></p><table><tbody><tr><td><b>Projects</b></td><td><ul><li>Digital Imaging and Communications in Medicine</li><li>International standard terminology</li></ul></td></tr><tr><td><b>Datasets</b></td><td><ul><li>DICOM Terminology</li><li>International Standards</li></ul></td></tr><tr><td><b>License</b></td><td><a href=\"https://mii-termserv.de/licenses#dicom\">DICOM license</a></td></tr><tr><td><b>Package Scope</b></td><td><a href=\"https://gitlab.com/groups/mii-termserv/fhir-resources/-/packages/?ForderBy%3Dversion%26sort%3Ddesc%26search%5B%5D%3D@mii-termserv/dicom.terminology\"><code>@mii-termserv/dicom.terminology</code></a></td></tr></tbody></table></div></div>"
  },
  "extension": [
    {
      "url": "http://hl7.org/fhir/StructureDefinition/cqf-scope",
      "valueString": "@mii-termserv/dicom.terminology"
    }
  ]
}