{
  "resourceType": "ValueSet",
  "id": "dicom-cid-3032-LeadLocationNearPeripheralNerve",
  "url": "http://dicom.nema.org/medical/dicom/current/output/chtml/part16/sect_CID_3032.html",
  "identifier": [
    {
      "system": "urn:ietf:rfc:3986",
      "value": "urn:oid:1.2.840.10008.6.1.1330"
    }
  ],
  "version": "20200623",
  "name": "LeadLocationNearPeripheralNerve",
  "status": "active",
  "experimental": false,
  "date": "2024-06-17",
  "publisher": "NEMA MITA DICOM",
  "description": "Transitive closure of CID 3032 LeadLocationNearPeripheralNerve",
  "copyright": "© 2024 NEMA",
  "compose": {
    "include": [
      {
        "system": "urn:iso:std:iso:11073:10101",
        "concept": [
          {
            "code": "7:37",
            "display": "Nervus maxillaris, left"
          },
          {
            "code": "7:36",
            "display": "Nervus maxillaris"
          },
          {
            "code": "7:34",
            "display": "Nervus supraorbitalis, right"
          },
          {
            "code": "7:38",
            "display": "Nervus maxillaris, right"
          },
          {
            "code": "7:33",
            "display": "Nervus supraorbitalis, left"
          },
          {
            "code": "7:141",
            "display": "Ramus palmaris nervi ulnaris, left"
          },
          {
            "code": "7:32",
            "display": "Nervus supraorbitalis"
          },
          {
            "code": "7:140",
            "display": "Ramus palmaris nervi ulnaris"
          },
          {
            "code": "7:30",
            "display": "Nervus ophtalmicus, right"
          },
          {
            "code": "7:145",
            "display": "Nervus ulnaris, Nervi digitales palmares proprii, left"
          },
          {
            "code": "7:144",
            "display": "Nervus ulnaris, Nervi digitales palmares proprii"
          },
          {
            "code": "7:142",
            "display": "Ramus palmaris nervi ulnaris, right"
          },
          {
            "code": "7:149",
            "display": "Nervus radialis, left"
          },
          {
            "code": "7:148",
            "display": "Nervus radialis"
          },
          {
            "code": "7:146",
            "display": "Nervus ulnaris, Nervi digitales palmares proprii, right"
          },
          {
            "code": "7:129",
            "display": "Nervus medianus, Nervi digitales palmares proprii, left"
          },
          {
            "code": "7:128",
            "display": "Nervus medianus, Nervi digitales palmares proprii"
          },
          {
            "code": "7:48",
            "display": "Nervus abducens (VI)"
          },
          {
            "code": "7:46",
            "display": "Nervus mandibularis, right"
          },
          {
            "code": "7:45",
            "display": "Nervus mandibularis, left"
          },
          {
            "code": "7:49",
            "display": "Nervus abducens (VI), left"
          },
          {
            "code": "7:40",
            "display": "Nervus infraorbitalis"
          },
          {
            "code": "7:44",
            "display": "Nervus mandibularis"
          },
          {
            "code": "7:130",
            "display": "Nervus medianus, Nervi digitales palmares proprii, right"
          },
          {
            "code": "7:42",
            "display": "Nervus infraorbitalis, right"
          },
          {
            "code": "7:41",
            "display": "Nervus infraorbitalis, left"
          },
          {
            "code": "7:134",
            "display": "Nervus ulnaris, right"
          },
          {
            "code": "7:133",
            "display": "Nervus ulnaris, left"
          },
          {
            "code": "7:132",
            "display": "Nervus ulnaris"
          },
          {
            "code": "7:138",
            "display": "Ramus dorsalis nervi ulnaris, right"
          },
          {
            "code": "7:137",
            "display": "Ramus dorsalis nervi ulnaris, left"
          },
          {
            "code": "7:136",
            "display": "Ramus dorsalis nervi ulnaris"
          },
          {
            "code": "7:8",
            "display": "Nervi craniales"
          },
          {
            "code": "7:9",
            "display": "Nervi craniales, left"
          },
          {
            "code": "7:58",
            "display": "Nervus vestibulocochlearis (VIII), right"
          },
          {
            "code": "7:57",
            "display": "Nervus vestibulocochlearis (VIII), left"
          },
          {
            "code": "7:56",
            "display": "Nervus vestibulocochlearis (VIII)"
          },
          {
            "code": "7:50",
            "display": "Nervus abducens (VI), right"
          },
          {
            "code": "7:54",
            "display": "Nervus facialis (VII), right"
          },
          {
            "code": "7:162",
            "display": "Nervus axillaris, right"
          },
          {
            "code": "7:53",
            "display": "Nervus facialis (VII), left"
          },
          {
            "code": "7:161",
            "display": "Nervus axillaris, left"
          },
          {
            "code": "7:52",
            "display": "Nervus facialis (VII)"
          },
          {
            "code": "7:160",
            "display": "Nervus axillaris"
          },
          {
            "code": "7:200",
            "display": "Nervus saphenus"
          },
          {
            "code": "7:166",
            "display": "Nervi thoracici, right"
          },
          {
            "code": "7:165",
            "display": "Nervi thoracici, left"
          },
          {
            "code": "7:164",
            "display": "Nervi thoracici"
          },
          {
            "code": "7:204",
            "display": "Nervi sacrales at Nervus coccygeus"
          },
          {
            "code": "7:169",
            "display": "Nervi lumbales, left"
          },
          {
            "code": "7:202",
            "display": "Nervus saphenus, right"
          },
          {
            "code": "7:168",
            "display": "Nervi lumbales"
          },
          {
            "code": "7:201",
            "display": "Nervus saphenus, left"
          },
          {
            "code": "7:69",
            "display": "Nervus glossopharingeus (IX), left"
          },
          {
            "code": "7:68",
            "display": "Nervus glossopharingeus (IX)"
          },
          {
            "code": "7:62",
            "display": "Nervus vestibularis, right"
          },
          {
            "code": "7:61",
            "display": "Nervus vestibularis, left"
          },
          {
            "code": "7:60",
            "display": "Nervus vestibularis"
          },
          {
            "code": "7:66",
            "display": "Nervus cochlearis, right"
          },
          {
            "code": "7:152",
            "display": "Nervus radialis Ramus superficialis"
          },
          {
            "code": "7:65",
            "display": "Nervus cochlearis, left"
          },
          {
            "code": "7:64",
            "display": "Nervus cochlearis"
          },
          {
            "code": "7:150",
            "display": "Nervus radialis, right"
          },
          {
            "code": "7:156",
            "display": "Nervi subscapulares"
          },
          {
            "code": "7:154",
            "display": "Nervus radialis Ramus superficialis, right"
          },
          {
            "code": "7:153",
            "display": "Nervus radialis Ramus superficialis, left"
          },
          {
            "code": "7:158",
            "display": "Nervi subscapulares, right"
          },
          {
            "code": "7:157",
            "display": "Nervi subscapulares, left"
          },
          {
            "code": "7:218",
            "display": "Nervus fibularis communis, right"
          },
          {
            "code": "7:217",
            "display": "Nervus fibularis communis, left"
          },
          {
            "code": "7:216",
            "display": "Nervus fibularis communis"
          },
          {
            "code": "7:78",
            "display": "Nervus acessorius (XI), Radices craniales, right"
          },
          {
            "code": "7:73",
            "display": "Nervus vagus (X), left"
          },
          {
            "code": "7:181",
            "display": "Nervus iliohypogastricus, left"
          },
          {
            "code": "7:72",
            "display": "Nervus vagus (X)"
          },
          {
            "code": "7:180",
            "display": "Nervus iliohypogastricus"
          },
          {
            "code": "7:70",
            "display": "Nervus glossopharingeus (IX), right"
          },
          {
            "code": "7:77",
            "display": "Nervus acessorius (XI), Radices craniales, left"
          },
          {
            "code": "7:185",
            "display": "Nervus ilio-inguinalis, left"
          },
          {
            "code": "7:76",
            "display": "Nervus acessorius (XI), Radices craniales"
          },
          {
            "code": "7:184",
            "display": "Nervus ilio-inguinalis"
          },
          {
            "code": "7:74",
            "display": "Nervus vagus (X), right"
          },
          {
            "code": "7:182",
            "display": "Nervus iliohypogastricus, right"
          },
          {
            "code": "7:101",
            "display": "Plexus brachialis, left"
          },
          {
            "code": "7:189",
            "display": "Nervus cutaneus femoris lateralis, left"
          },
          {
            "code": "7:222",
            "display": "Nervus fibularis profundus, right"
          },
          {
            "code": "7:100",
            "display": "Plexus brachialis"
          },
          {
            "code": "7:188",
            "display": "Nervus cutaneus femoris lateralis"
          },
          {
            "code": "7:221",
            "display": "Nervus fibularis profundus, left"
          },
          {
            "code": "7:220",
            "display": "Nervus fibularis profundus"
          },
          {
            "code": "7:186",
            "display": "Nervus ilio-inguinalis, right"
          },
          {
            "code": "7:105",
            "display": "Nervus thoracicus longus, left"
          },
          {
            "code": "7:226",
            "display": "Nervus fibularis superficialis, right"
          },
          {
            "code": "7:104",
            "display": "Nervus thoracicus longus"
          },
          {
            "code": "7:225",
            "display": "Nervus fibularis superficialis, left"
          },
          {
            "code": "7:224",
            "display": "Nervus fibularis superficialis"
          },
          {
            "code": "7:102",
            "display": "Plexus brachialis, right"
          },
          {
            "code": "7:208",
            "display": "Plexus sacralis"
          },
          {
            "code": "7:206",
            "display": "Nervi sacrales at Nervus coccygeus, right"
          },
          {
            "code": "7:205",
            "display": "Nervi sacrales at Nervus coccygeus, left"
          },
          {
            "code": "7:209",
            "display": "Plexus sacralis, left"
          },
          {
            "code": "7:89",
            "display": "Nervi spinales, left"
          },
          {
            "code": "7:84",
            "display": "Nervus hypoglossus (XII)"
          },
          {
            "code": "7:170",
            "display": "Nervi lumbales, right"
          },
          {
            "code": "7:82",
            "display": "Nervus acessorius (XI), Radices spinales, right"
          },
          {
            "code": "7:81",
            "display": "Nervus acessorius (XI), Radices spinales, left"
          },
          {
            "code": "7:88",
            "display": "Nervi spinales"
          },
          {
            "code": "7:174",
            "display": "Plexus lumbosacralis, right"
          },
          {
            "code": "7:173",
            "display": "Plexus lumbosacralis, left"
          },
          {
            "code": "7:86",
            "display": "Nervus hypoglossus (XII), right"
          },
          {
            "code": "7:172",
            "display": "Plexus lumbosacralis"
          },
          {
            "code": "7:85",
            "display": "Nervus hypoglossus (XII), left"
          },
          {
            "code": "7:178",
            "display": "Plexus lumbalis, right"
          },
          {
            "code": "7:177",
            "display": "Plexus lumbalis, left"
          },
          {
            "code": "7:210",
            "display": "Plexus sacralis, right"
          },
          {
            "code": "7:176",
            "display": "Plexus lumbalis"
          },
          {
            "code": "7:80",
            "display": "Nervus acessorius (XI), Radices spinales"
          },
          {
            "code": "7:214",
            "display": "Nervus ischiadicus, right"
          },
          {
            "code": "7:213",
            "display": "Nervus ischiadicus, left"
          },
          {
            "code": "7:212",
            "display": "Nervus ischiadicus"
          },
          {
            "code": "7:118",
            "display": "Nervus cutaneus antebrachii medialis, right"
          },
          {
            "code": "7:117",
            "display": "Nervus cutaneus antebrachii medialis, left"
          },
          {
            "code": "7:238",
            "display": "Nervus plantaris medialis, right"
          },
          {
            "code": "7:14",
            "display": "Nervus opticus (II), right"
          },
          {
            "code": "7:13",
            "display": "Nervus opticus (II), left"
          },
          {
            "code": "7:12",
            "display": "Nervus opticus (II)"
          },
          {
            "code": "7:18",
            "display": "Nervus oculomotorius (III), right"
          },
          {
            "code": "7:17",
            "display": "Nervus oculomotorius (III), left"
          },
          {
            "code": "7:16",
            "display": "Nervus oculomotorius (III)"
          },
          {
            "code": "7:94",
            "display": "Nervi cervicales, right"
          },
          {
            "code": "7:93",
            "display": "Nervi cervicales, left"
          },
          {
            "code": "7:92",
            "display": "Nervi cervicales"
          },
          {
            "code": "7:240",
            "display": "Nervus plantaris lateralis"
          },
          {
            "code": "7:10",
            "display": "Nervi craniales, right"
          },
          {
            "code": "7:98",
            "display": "Nervus phrenicus, right"
          },
          {
            "code": "7:97",
            "display": "Nervus phrenicus, left"
          },
          {
            "code": "7:96",
            "display": "Nervus phrenicus"
          },
          {
            "code": "7:244",
            "display": "Nervus pudendus"
          },
          {
            "code": "7:122",
            "display": "Nervus medianus, right"
          },
          {
            "code": "7:121",
            "display": "Nervus medianus, left"
          },
          {
            "code": "7:242",
            "display": "Nervus plantaris lateralis, right"
          },
          {
            "code": "7:120",
            "display": "Nervus medianus"
          },
          {
            "code": "7:241",
            "display": "Nervus plantaris lateralis, left"
          },
          {
            "code": "7:90",
            "display": "Nervi spinales, right"
          },
          {
            "code": "7:126",
            "display": "Ramus palmaris nervi mediani, right"
          },
          {
            "code": "7:125",
            "display": "Ramus palmaris nervi mediani, left"
          },
          {
            "code": "7:246",
            "display": "Nervus pudendus, right"
          },
          {
            "code": "7:124",
            "display": "Ramus palmaris nervi mediani"
          },
          {
            "code": "7:245",
            "display": "Nervus pudendus, left"
          },
          {
            "code": "7:109",
            "display": "Nervus musculocutaneus, left"
          },
          {
            "code": "7:108",
            "display": "Nervus musculocutaneus"
          },
          {
            "code": "7:229",
            "display": "Nervus tibialis, left"
          },
          {
            "code": "7:228",
            "display": "Nervus tibialis"
          },
          {
            "code": "7:106",
            "display": "Nervus thoracicus longus, right"
          },
          {
            "code": "7:26",
            "display": "Nervus trigeminus (V), right"
          },
          {
            "code": "7:25",
            "display": "Nervus trigeminus (V), left"
          },
          {
            "code": "7:24",
            "display": "Nervus trigeminus (V)"
          },
          {
            "code": "7:29",
            "display": "Nervus ophtalmicus, left"
          },
          {
            "code": "7:28",
            "display": "Nervus ophtalmicus"
          },
          {
            "code": "7:192",
            "display": "Nervus obturatorius"
          },
          {
            "code": "7:190",
            "display": "Nervus cutaneus femoris lateralis, right"
          },
          {
            "code": "7:22",
            "display": "Nervus trochlearis (IV), right"
          },
          {
            "code": "7:196",
            "display": "Nervus femoralis"
          },
          {
            "code": "7:21",
            "display": "Nervus trochlearis (IV), left"
          },
          {
            "code": "7:20",
            "display": "Nervus trochlearis (IV)"
          },
          {
            "code": "7:194",
            "display": "Nervus obturatorius, right"
          },
          {
            "code": "7:193",
            "display": "Nervus obturatorius, left"
          },
          {
            "code": "7:112",
            "display": "Nervus cutaneus antebrachii lateralis"
          },
          {
            "code": "7:233",
            "display": "Nervus surealis, left"
          },
          {
            "code": "7:232",
            "display": "Nervus surealis"
          },
          {
            "code": "7:110",
            "display": "Nervus musculocutaneus, right"
          },
          {
            "code": "7:198",
            "display": "Nervus femoralis, right"
          },
          {
            "code": "7:197",
            "display": "Nervus femoralis, left"
          },
          {
            "code": "7:230",
            "display": "Nervus tibialis, right"
          },
          {
            "code": "7:116",
            "display": "Nervus cutaneus antebrachii medialis"
          },
          {
            "code": "7:237",
            "display": "Nervus plantaris medialis, left"
          },
          {
            "code": "7:236",
            "display": "Nervus plantaris medialis"
          },
          {
            "code": "7:114",
            "display": "Nervus cutaneus antebrachii lateralis, right"
          },
          {
            "code": "7:113",
            "display": "Nervus cutaneus antebrachii lateralis, left"
          },
          {
            "code": "7:234",
            "display": "Nervus surealis, right"
          }
        ]
      }
    ]
  },
  "meta": {
    "tag": [
      {
        "system": "https://mii-termserv.de/fhir/su-termserv/CodeSystem/mii-cs-suts-resource-tags-project",
        "code": "dicom",
        "display": "Digital Imaging and Communications in Medicine"
      },
      {
        "system": "https://mii-termserv.de/fhir/su-termserv/CodeSystem/mii-cs-suts-resource-tags-project",
        "code": "international",
        "display": "International standard terminology"
      },
      {
        "system": "https://mii-termserv.de/fhir/su-termserv/CodeSystem/mii-cs-suts-resource-tags-dataset",
        "code": "dicom",
        "display": "DICOM Terminology"
      },
      {
        "system": "https://mii-termserv.de/fhir/su-termserv/CodeSystem/mii-cs-suts-resource-tags-dataset",
        "code": "standard",
        "display": "International Standards"
      },
      {
        "system": "https://mii-termserv.de/fhir/su-termserv/CodeSystem/mii-cs-suts-resource-tags-license",
        "code": "https://mii-termserv.de/licenses#dicom",
        "display": "DICOM license"
      }
    ]
  },
  "title": "LeadLocationNearPeripheralNerve",
  "text": {
    "status": "generated",
    "div": "<div xmlns=\"http://www.w3.org/1999/xhtml\"><h2>LeadLocationNearPeripheralNerve</h2><tt>http://dicom.nema.org/medical/dicom/current/output/chtml/part16/sect_CID_3032.html</tt><p>Transitive closure of CID 3032 LeadLocationNearPeripheralNerve</p><div><p><b>SU-TermServ Metadata</b></p><table><tbody><tr><td><b>Projects</b></td><td><ul><li>Digital Imaging and Communications in Medicine</li><li>International standard terminology</li></ul></td></tr><tr><td><b>Datasets</b></td><td><ul><li>DICOM Terminology</li><li>International Standards</li></ul></td></tr><tr><td><b>License</b></td><td><a href=\"https://mii-termserv.de/licenses#dicom\">DICOM license</a></td></tr><tr><td><b>Package Scope</b></td><td><a href=\"https://gitlab.com/groups/mii-termserv/fhir-resources/-/packages/?ForderBy%3Dversion%26sort%3Ddesc%26search%5B%5D%3D@mii-termserv/dicom.terminology\"><code>@mii-termserv/dicom.terminology</code></a></td></tr></tbody></table></div></div>"
  },
  "extension": [
    {
      "url": "http://hl7.org/fhir/StructureDefinition/cqf-scope",
      "valueString": "@mii-termserv/dicom.terminology"
    }
  ]
}