{
  "resourceType": "ValueSet",
  "id": "dicom-cid-3781-LeftVentricleMyocardialWall18SegmentModel",
  "url": "http://dicom.nema.org/medical/dicom/current/output/chtml/part16/sect_CID_3781.html",
  "identifier": [
    {
      "system": "urn:ietf:rfc:3986",
      "value": "urn:oid:1.2.840.10008.6.1.1413"
    }
  ],
  "version": "20210904",
  "name": "LeftVentricleMyocardialWall18SegmentModel",
  "status": "active",
  "experimental": false,
  "date": "2024-06-17",
  "publisher": "NEMA MITA DICOM",
  "description": "Transitive closure of CID 3781 LeftVentricleMyocardialWall18SegmentModel",
  "copyright": "© 2024 NEMA",
  "compose": {
    "include": [
      {
        "system": "http://dicom.nema.org/resources/ontology/DCM",
        "concept": [
          {
            "code": "130623",
            "display": "left ventricle apical anterolateral segment"
          },
          {
            "code": "130622",
            "display": "left ventricle apical inferolateral segment"
          },
          {
            "code": "130621",
            "display": "left ventricle apical inferoseptal segment"
          },
          {
            "code": "130620",
            "display": "left ventricle apical anteroseptal segment"
          }
        ]
      },
      {
        "system": "http://snomed.info/sct",
        "concept": [
          {
            "code": "264848000",
            "display": "left ventricle mid anterior segment"
          },
          {
            "code": "396482007",
            "display": "left ventricle basal anteroseptal segment"
          },
          {
            "code": "396652009",
            "display": "left ventricle basal inferolateral segment"
          },
          {
            "code": "396646008",
            "display": "left ventricle basal inferoseptal segment"
          },
          {
            "code": "264847005",
            "display": "left ventricle mid inferior segment"
          },
          {
            "code": "264849008",
            "display": "left ventricle apical inferior segment"
          },
          {
            "code": "264844003",
            "display": "left ventricle apical anterior segment"
          },
          {
            "code": "264850008",
            "display": "left ventricle basal anterior segment"
          },
          {
            "code": "396654005",
            "display": "left ventricle basal anterolateral segment"
          },
          {
            "code": "264846001",
            "display": "left ventricle basal inferior segment"
          },
          {
            "code": "396655006",
            "display": "left ventricle mid inferolateral segment"
          },
          {
            "code": "396656007",
            "display": "left ventricle mid anterolateral segment"
          },
          {
            "code": "396649001",
            "display": "left ventricle mid inferoseptal segment"
          },
          {
            "code": "396647004",
            "display": "left ventricle mid anteroseptal segment"
          }
        ]
      }
    ]
  },
  "meta": {
    "tag": [
      {
        "system": "https://mii-termserv.de/fhir/su-termserv/CodeSystem/mii-cs-suts-resource-tags-project",
        "code": "dicom",
        "display": "Digital Imaging and Communications in Medicine"
      },
      {
        "system": "https://mii-termserv.de/fhir/su-termserv/CodeSystem/mii-cs-suts-resource-tags-project",
        "code": "international",
        "display": "International standard terminology"
      },
      {
        "system": "https://mii-termserv.de/fhir/su-termserv/CodeSystem/mii-cs-suts-resource-tags-dataset",
        "code": "dicom",
        "display": "DICOM Terminology"
      },
      {
        "system": "https://mii-termserv.de/fhir/su-termserv/CodeSystem/mii-cs-suts-resource-tags-dataset",
        "code": "standard",
        "display": "International Standards"
      },
      {
        "system": "https://mii-termserv.de/fhir/su-termserv/CodeSystem/mii-cs-suts-resource-tags-license",
        "code": "https://mii-termserv.de/licenses#dicom",
        "display": "DICOM license"
      }
    ]
  },
  "title": "LeftVentricleMyocardialWall18SegmentModel",
  "text": {
    "status": "generated",
    "div": "<div xmlns=\"http://www.w3.org/1999/xhtml\"><h2>LeftVentricleMyocardialWall18SegmentModel</h2><tt>http://dicom.nema.org/medical/dicom/current/output/chtml/part16/sect_CID_3781.html</tt><p>Transitive closure of CID 3781 LeftVentricleMyocardialWall18SegmentModel</p><div><p><b>SU-TermServ Metadata</b></p><table><tbody><tr><td><b>Projects</b></td><td><ul><li>Digital Imaging and Communications in Medicine</li><li>International standard terminology</li></ul></td></tr><tr><td><b>Datasets</b></td><td><ul><li>DICOM Terminology</li><li>International Standards</li></ul></td></tr><tr><td><b>License</b></td><td><a href=\"https://mii-termserv.de/licenses#dicom\">DICOM license</a></td></tr><tr><td><b>Package Scope</b></td><td><a href=\"https://gitlab.com/groups/mii-termserv/fhir-resources/-/packages/?ForderBy%3Dversion%26sort%3Ddesc%26search%5B%5D%3D@mii-termserv/dicom.terminology\"><code>@mii-termserv/dicom.terminology</code></a></td></tr></tbody></table></div></div>"
  },
  "extension": [
    {
      "url": "http://hl7.org/fhir/StructureDefinition/cqf-scope",
      "valueString": "@mii-termserv/dicom.terminology"
    }
  ]
}