{
  "resourceType": "ValueSet",
  "id": "dicom-cid-3001-ECGLead",
  "url": "http://dicom.nema.org/medical/dicom/current/output/chtml/part16/sect_CID_3001.html",
  "identifier": [
    {
      "system": "urn:ietf:rfc:3986",
      "value": "urn:oid:1.2.840.10008.6.1.43"
    }
  ],
  "version": "20130613",
  "name": "ECGLead",
  "status": "active",
  "experimental": false,
  "date": "2024-06-17",
  "publisher": "NEMA MITA DICOM",
  "description": "Transitive closure of CID 3001 ECGLead",
  "copyright": "© 2024 NEMA",
  "compose": {
    "include": [
      {
        "system": "urn:iso:std:iso:11073:10101",
        "concept": [
          {
            "code": "2:26",
            "display": "Frank Lead C"
          },
          {
            "code": "2:27",
            "display": "Frank Lead A"
          },
          {
            "code": "2:28",
            "display": "Frank Lead M"
          },
          {
            "code": "2:29",
            "display": "Frank Lead F"
          },
          {
            "code": "2:20",
            "display": "Chest-manubrium lead per V5 placement"
          },
          {
            "code": "2:21",
            "display": "Left Arm Lead"
          },
          {
            "code": "2:150",
            "display": "Canine, sixth left intercostal space at costochondral junction"
          },
          {
            "code": "2:22",
            "display": "Right Arm Lead"
          },
          {
            "code": "2:23",
            "display": "Left Leg Lead"
          },
          {
            "code": "2:151",
            "display": "Canine, over dorsal spinous process of 7th thoracic vertebra"
          },
          {
            "code": "2:24",
            "display": "Frank Lead I"
          },
          {
            "code": "2:25",
            "display": "Frank Lead E"
          },
          {
            "code": "2:37",
            "display": "Derived Lead V5"
          },
          {
            "code": "2:38",
            "display": "Derived Lead V6"
          },
          {
            "code": "2:30",
            "display": "Frank Lead H"
          },
          {
            "code": "2:31",
            "display": "Derived Lead I"
          },
          {
            "code": "2:32",
            "display": "Derived Lead II"
          },
          {
            "code": "2:33",
            "display": "Derived Lead V1"
          },
          {
            "code": "2:34",
            "display": "Derived Lead V2"
          },
          {
            "code": "2:35",
            "display": "Derived Lead V3"
          },
          {
            "code": "2:36",
            "display": "Derived Lead V4"
          },
          {
            "code": "2:132",
            "display": "EASI Lead AS"
          },
          {
            "code": "2:133",
            "display": "EASI Lead AI"
          },
          {
            "code": "2:134",
            "display": "EASI upper sternum lead"
          },
          {
            "code": "2:130",
            "display": "Auxiliary bipolar lead 4"
          },
          {
            "code": "2:131",
            "display": "EASI Lead ES"
          },
          {
            "code": "2:147",
            "display": "Right Leg Lead"
          },
          {
            "code": "2:148",
            "display": "Canine, fifth right intercostal space near edge of sternum"
          },
          {
            "code": "2:149",
            "display": "Canine, sixth left intercostal space near edge of sternum"
          },
          {
            "code": "2:1",
            "display": "Lead I"
          },
          {
            "code": "2:0",
            "display": "Unspecified lead"
          },
          {
            "code": "2:3",
            "display": "Lead V1"
          },
          {
            "code": "2:2",
            "display": "Lead II"
          },
          {
            "code": "2:5",
            "display": "Lead V3"
          },
          {
            "code": "2:4",
            "display": "Lead V2"
          },
          {
            "code": "2:7",
            "display": "Lead V5"
          },
          {
            "code": "2:6",
            "display": "Lead V4"
          },
          {
            "code": "2:9",
            "display": "Lead V7"
          },
          {
            "code": "2:8",
            "display": "Lead V6"
          },
          {
            "code": "2:114",
            "display": "Derived Lead aVF"
          },
          {
            "code": "2:62",
            "display": "aVR, augmented voltage, right"
          },
          {
            "code": "2:110",
            "display": "Chest-manubrium lead per V6 placement"
          },
          {
            "code": "2:63",
            "display": "aVL, augmented voltage, left"
          },
          {
            "code": "2:111",
            "display": "Derived Lead III"
          },
          {
            "code": "2:64",
            "display": "aVF, augmented voltage, foot"
          },
          {
            "code": "2:112",
            "display": "Derived Lead aVR"
          },
          {
            "code": "2:65",
            "display": "−aVR"
          },
          {
            "code": "2:113",
            "display": "Derived Lead aVL"
          },
          {
            "code": "2:66",
            "display": "Lead V8"
          },
          {
            "code": "2:67",
            "display": "Lead V9"
          },
          {
            "code": "2:68",
            "display": "Lead V8R"
          },
          {
            "code": "2:69",
            "display": "Lead V9R"
          },
          {
            "code": "2:61",
            "display": "Lead III"
          },
          {
            "code": "2:129",
            "display": "Auxiliary bipolar lead 3"
          },
          {
            "code": "2:125",
            "display": "Lead CR5"
          },
          {
            "code": "2:126",
            "display": "Modified limb lead"
          },
          {
            "code": "2:127",
            "display": "Auxiliary bipolar lead 1"
          },
          {
            "code": "2:128",
            "display": "Auxiliary bipolar lead 2"
          },
          {
            "code": "2:121",
            "display": "Chest-manubrium lead per V7 placement"
          },
          {
            "code": "2:73",
            "display": "Defibrillator lead: anterior-lateral"
          },
          {
            "code": "2:122",
            "display": "Lead CH5"
          },
          {
            "code": "2:74",
            "display": "External pacing lead: anterior-posterior"
          },
          {
            "code": "2:75",
            "display": "Auxiliary unipolar lead 1"
          },
          {
            "code": "2:123",
            "display": "negative: right infraclavicular fossa"
          },
          {
            "code": "2:76",
            "display": "Auxiliary unipolar lead 2"
          },
          {
            "code": "2:124",
            "display": "negative: low right scapula Lead"
          },
          {
            "code": "2:77",
            "display": "Auxiliary unipolar lead 3"
          },
          {
            "code": "2:78",
            "display": "Auxiliary unipolar lead 4"
          },
          {
            "code": "2:70",
            "display": "Lead D (Nehb - Dorsal)"
          },
          {
            "code": "2:71",
            "display": "Lead A (Nehb - Anterior)"
          },
          {
            "code": "2:72",
            "display": "Lead J (Nehb - Inferior)"
          },
          {
            "code": "2:86",
            "display": "Chest lead"
          },
          {
            "code": "2:87",
            "display": "Precordial lead"
          },
          {
            "code": "2:88",
            "display": "Lead VR, nonaugmented voltage, vector of RA"
          },
          {
            "code": "2:89",
            "display": "Lead VL, nonaugmented voltage, vector of LA"
          },
          {
            "code": "2:107",
            "display": "Chest-manubrium lead per V2 placement"
          },
          {
            "code": "2:15",
            "display": "Lead V7R"
          },
          {
            "code": "2:108",
            "display": "Chest-manubrium lead per V3 placement"
          },
          {
            "code": "2:16",
            "display": "Lead X"
          },
          {
            "code": "2:109",
            "display": "Chest-manubrium lead per V4 placement"
          },
          {
            "code": "2:17",
            "display": "Lead Y"
          },
          {
            "code": "2:18",
            "display": "Lead Z"
          },
          {
            "code": "2:19",
            "display": "Chest lead per V5 and V5R placement"
          },
          {
            "code": "2:103",
            "display": "Chest lead per V6 and V6R placement"
          },
          {
            "code": "2:104",
            "display": "Chest lead per V7 and V8R placement"
          },
          {
            "code": "2:105",
            "display": "Chest-manubrium lead"
          },
          {
            "code": "2:106",
            "display": "Chest-manubrium lead per V1 placement"
          },
          {
            "code": "2:95",
            "display": "Modified chest lead per V4 placement"
          },
          {
            "code": "2:100",
            "display": "Chest lead per V2 and V2R placement"
          },
          {
            "code": "2:96",
            "display": "Modified chest lead per V5 placement"
          },
          {
            "code": "2:101",
            "display": "Chest lead per V3 and V3R placement"
          },
          {
            "code": "2:97",
            "display": "Modified chest lead per V6 placement"
          },
          {
            "code": "2:98",
            "display": "Chest lead (symmetric placement)"
          },
          {
            "code": "2:102",
            "display": "Chest lead per V4 and V4R placement"
          },
          {
            "code": "2:10",
            "display": "Lead V2R"
          },
          {
            "code": "2:99",
            "display": "Chest lead per V1 and V1R placement"
          },
          {
            "code": "2:11",
            "display": "Lead V3R"
          },
          {
            "code": "2:12",
            "display": "Lead V4R"
          },
          {
            "code": "2:13",
            "display": "Lead V5R"
          },
          {
            "code": "2:14",
            "display": "Lead V6R"
          },
          {
            "code": "2:90",
            "display": "Lead VF, nonaugmented voltage, vector of LL"
          },
          {
            "code": "2:91",
            "display": "Modified chest lead (left arm indifferent)"
          },
          {
            "code": "2:92",
            "display": "Modified chest lead per V1 placement"
          },
          {
            "code": "2:93",
            "display": "Modified chest lead per V2 placement"
          },
          {
            "code": "2:94",
            "display": "Modified chest lead per V3 placement"
          }
        ]
      }
    ]
  },
  "meta": {
    "tag": [
      {
        "system": "https://mii-termserv.de/fhir/su-termserv/CodeSystem/mii-cs-suts-resource-tags-project",
        "code": "dicom",
        "display": "Digital Imaging and Communications in Medicine"
      },
      {
        "system": "https://mii-termserv.de/fhir/su-termserv/CodeSystem/mii-cs-suts-resource-tags-project",
        "code": "international",
        "display": "International standard terminology"
      },
      {
        "system": "https://mii-termserv.de/fhir/su-termserv/CodeSystem/mii-cs-suts-resource-tags-dataset",
        "code": "dicom",
        "display": "DICOM Terminology"
      },
      {
        "system": "https://mii-termserv.de/fhir/su-termserv/CodeSystem/mii-cs-suts-resource-tags-dataset",
        "code": "standard",
        "display": "International Standards"
      },
      {
        "system": "https://mii-termserv.de/fhir/su-termserv/CodeSystem/mii-cs-suts-resource-tags-license",
        "code": "https://mii-termserv.de/licenses#dicom",
        "display": "DICOM license"
      }
    ]
  },
  "title": "ECGLead",
  "text": {
    "status": "generated",
    "div": "<div xmlns=\"http://www.w3.org/1999/xhtml\"><h2>ECGLead</h2><tt>http://dicom.nema.org/medical/dicom/current/output/chtml/part16/sect_CID_3001.html</tt><p>Transitive closure of CID 3001 ECGLead</p><div><p><b>SU-TermServ Metadata</b></p><table><tbody><tr><td><b>Projects</b></td><td><ul><li>Digital Imaging and Communications in Medicine</li><li>International standard terminology</li></ul></td></tr><tr><td><b>Datasets</b></td><td><ul><li>DICOM Terminology</li><li>International Standards</li></ul></td></tr><tr><td><b>License</b></td><td><a href=\"https://mii-termserv.de/licenses#dicom\">DICOM license</a></td></tr><tr><td><b>Package Scope</b></td><td><a href=\"https://gitlab.com/groups/mii-termserv/fhir-resources/-/packages/?ForderBy%3Dversion%26sort%3Ddesc%26search%5B%5D%3D@mii-termserv/dicom.terminology\"><code>@mii-termserv/dicom.terminology</code></a></td></tr></tbody></table></div></div>"
  },
  "extension": [
    {
      "url": "http://hl7.org/fhir/StructureDefinition/cqf-scope",
      "valueString": "@mii-termserv/dicom.terminology"
    }
  ]
}