{
  "resourceType": "ValueSet",
  "id": "dicom-cid-7501-NeighbouringGreyLevelDependenceBasedFeature",
  "url": "http://dicom.nema.org/medical/dicom/current/output/chtml/part16/sect_CID_7501.html",
  "identifier": [
    {
      "system": "urn:ietf:rfc:3986",
      "value": "urn:oid:1.2.840.10008.6.1.1274"
    }
  ],
  "version": "20190121",
  "name": "NeighbouringGreyLevelDependenceBasedFeature",
  "status": "active",
  "experimental": false,
  "date": "2024-06-17",
  "publisher": "NEMA MITA DICOM",
  "description": "Transitive closure of CID 7501 NeighbouringGreyLevelDependenceBasedFeature",
  "copyright": "© 2024 NEMA",
  "compose": {
    "include": [
      {
        "system": "http://arxiv.org/abs/1612.07003",
        "concept": [
          {
            "code": "FCBV",
            "display": "Dependence count entropy"
          },
          {
            "code": "5SPA",
            "display": "Normalized grey level non-uniformity of NGLDM"
          },
          {
            "code": "1PFV",
            "display": "Grey level variance of NGLDM"
          },
          {
            "code": "EQ3F",
            "display": "Low dependence low grey level emphasis"
          },
          {
            "code": "OKJI",
            "display": "Dependence count non-uniformity normalized"
          },
          {
            "code": "FP8K",
            "display": "Grey level non-uniformity of NGLDM"
          },
          {
            "code": "6XV8",
            "display": "Dependence count percentage"
          },
          {
            "code": "JA6D",
            "display": "Low dependence high grey level emphasis"
          },
          {
            "code": "IMOQ",
            "display": "High dependence emphasis"
          },
          {
            "code": "DNX2",
            "display": "Dependence count variance"
          },
          {
            "code": "CAS9",
            "display": "Dependence count energy"
          },
          {
            "code": "OAE7",
            "display": "High grey level count emphasis"
          },
          {
            "code": "NBZI",
            "display": "High dependence low grey level emphasis"
          },
          {
            "code": "Z87G",
            "display": "Dependence count non-uniformity"
          },
          {
            "code": "SODN",
            "display": "Low dependence emphasis"
          },
          {
            "code": "9QMG",
            "display": "High dependence high grey level emphasis"
          },
          {
            "code": "TL9H",
            "display": "Low grey level count emphasis"
          }
        ]
      }
    ]
  },
  "meta": {
    "tag": [
      {
        "system": "https://mii-termserv.de/fhir/su-termserv/CodeSystem/mii-cs-suts-resource-tags-project",
        "code": "dicom",
        "display": "Digital Imaging and Communications in Medicine"
      },
      {
        "system": "https://mii-termserv.de/fhir/su-termserv/CodeSystem/mii-cs-suts-resource-tags-project",
        "code": "international",
        "display": "International standard terminology"
      },
      {
        "system": "https://mii-termserv.de/fhir/su-termserv/CodeSystem/mii-cs-suts-resource-tags-dataset",
        "code": "dicom",
        "display": "DICOM Terminology"
      },
      {
        "system": "https://mii-termserv.de/fhir/su-termserv/CodeSystem/mii-cs-suts-resource-tags-dataset",
        "code": "standard",
        "display": "International Standards"
      },
      {
        "system": "https://mii-termserv.de/fhir/su-termserv/CodeSystem/mii-cs-suts-resource-tags-license",
        "code": "https://mii-termserv.de/licenses#dicom",
        "display": "DICOM license"
      }
    ]
  },
  "title": "NeighbouringGreyLevelDependenceBasedFeature",
  "text": {
    "status": "generated",
    "div": "<div xmlns=\"http://www.w3.org/1999/xhtml\"><h2>NeighbouringGreyLevelDependenceBasedFeature</h2><tt>http://dicom.nema.org/medical/dicom/current/output/chtml/part16/sect_CID_7501.html</tt><p>Transitive closure of CID 7501 NeighbouringGreyLevelDependenceBasedFeature</p><div><p><b>SU-TermServ Metadata</b></p><table><tbody><tr><td><b>Projects</b></td><td><ul><li>Digital Imaging and Communications in Medicine</li><li>International standard terminology</li></ul></td></tr><tr><td><b>Datasets</b></td><td><ul><li>DICOM Terminology</li><li>International Standards</li></ul></td></tr><tr><td><b>License</b></td><td><a href=\"https://mii-termserv.de/licenses#dicom\">DICOM license</a></td></tr><tr><td><b>Package Scope</b></td><td><a href=\"https://gitlab.com/groups/mii-termserv/fhir-resources/-/packages/?ForderBy%3Dversion%26sort%3Ddesc%26search%5B%5D%3D@mii-termserv/dicom.terminology\"><code>@mii-termserv/dicom.terminology</code></a></td></tr></tbody></table></div></div>"
  },
  "extension": [
    {
      "url": "http://hl7.org/fhir/StructureDefinition/cqf-scope",
      "valueString": "@mii-termserv/dicom.terminology"
    }
  ]
}