{
  "resourceType": "ValueSet",
  "id": "dicom-cid-7194-MorphologicallyAbnormalStructureSegmentationPrope",
  "url": "http://dicom.nema.org/medical/dicom/current/output/chtml/part16/sect_CID_7194.html",
  "identifier": [
    {
      "system": "urn:ietf:rfc:3986",
      "value": "urn:oid:1.2.840.10008.6.1.1193"
    }
  ],
  "version": "20220402",
  "name": "MorphologicallyAbnormalStructureSegmentationPropertyType",
  "status": "active",
  "experimental": false,
  "date": "2024-06-17",
  "publisher": "NEMA MITA DICOM",
  "description": "Transitive closure of CID 7194 MorphologicallyAbnormalStructureSegmentationPropertyType",
  "copyright": "© 2024 NEMA",
  "compose": {
    "include": [
      {
        "system": "http://dicom.nema.org/resources/ontology/DCM",
        "concept": [
          {
            "code": "125040",
            "display": "Background"
          }
        ]
      },
      {
        "system": "http://ncit.nci.nih.gov",
        "concept": [
          {
            "code": "C113842",
            "display": "Enhancing Lesion"
          },
          {
            "code": "C81175",
            "display": "Non-Enhancing Lesion"
          }
        ]
      },
      {
        "system": "http://snomed.info/sct",
        "concept": [
          {
            "code": "301766008",
            "display": "Lesion of Brain"
          },
          {
            "code": "55584005",
            "display": "Embolus"
          },
          {
            "code": "372087000",
            "display": "Neoplasm, Primary"
          },
          {
            "code": "4147007",
            "display": "Mass"
          },
          {
            "code": "17621005",
            "display": "Normal"
          },
          {
            "code": "367643001",
            "display": "Cyst"
          },
          {
            "code": "44132006",
            "display": "Abscess"
          },
          {
            "code": "79654002",
            "display": "Edema"
          },
          {
            "code": "75753009",
            "display": "Blood clot"
          },
          {
            "code": "27925004",
            "display": "Nodule"
          },
          {
            "code": "52988006",
            "display": "Lesion"
          },
          {
            "code": "108369006",
            "display": "Neoplasm"
          },
          {
            "code": "14799000",
            "display": "Neoplasm, Secondary"
          },
          {
            "code": "6574001",
            "display": "Necrosis"
          },
          {
            "code": "50960005",
            "display": "Hemorrhage"
          },
          {
            "code": "409774005",
            "display": "Inflammation"
          }
        ]
      }
    ]
  },
  "meta": {
    "tag": [
      {
        "system": "https://mii-termserv.de/fhir/su-termserv/CodeSystem/mii-cs-suts-resource-tags-project",
        "code": "dicom",
        "display": "Digital Imaging and Communications in Medicine"
      },
      {
        "system": "https://mii-termserv.de/fhir/su-termserv/CodeSystem/mii-cs-suts-resource-tags-project",
        "code": "international",
        "display": "International standard terminology"
      },
      {
        "system": "https://mii-termserv.de/fhir/su-termserv/CodeSystem/mii-cs-suts-resource-tags-dataset",
        "code": "dicom",
        "display": "DICOM Terminology"
      },
      {
        "system": "https://mii-termserv.de/fhir/su-termserv/CodeSystem/mii-cs-suts-resource-tags-dataset",
        "code": "standard",
        "display": "International Standards"
      },
      {
        "system": "https://mii-termserv.de/fhir/su-termserv/CodeSystem/mii-cs-suts-resource-tags-license",
        "code": "https://mii-termserv.de/licenses#dicom",
        "display": "DICOM license"
      }
    ]
  },
  "title": "MorphologicallyAbnormalStructureSegmentationPropertyType",
  "text": {
    "status": "generated",
    "div": "<div xmlns=\"http://www.w3.org/1999/xhtml\"><h2>MorphologicallyAbnormalStructureSegmentationPropertyType</h2><tt>http://dicom.nema.org/medical/dicom/current/output/chtml/part16/sect_CID_7194.html</tt><p>Transitive closure of CID 7194 MorphologicallyAbnormalStructureSegmentationPropertyType</p><div><p><b>SU-TermServ Metadata</b></p><table><tbody><tr><td><b>Projects</b></td><td><ul><li>Digital Imaging and Communications in Medicine</li><li>International standard terminology</li></ul></td></tr><tr><td><b>Datasets</b></td><td><ul><li>DICOM Terminology</li><li>International Standards</li></ul></td></tr><tr><td><b>License</b></td><td><a href=\"https://mii-termserv.de/licenses#dicom\">DICOM license</a></td></tr><tr><td><b>Package Scope</b></td><td><a href=\"https://gitlab.com/groups/mii-termserv/fhir-resources/-/packages/?ForderBy%3Dversion%26sort%3Ddesc%26search%5B%5D%3D@mii-termserv/dicom.terminology\"><code>@mii-termserv/dicom.terminology</code></a></td></tr></tbody></table></div></div>"
  },
  "extension": [
    {
      "url": "http://hl7.org/fhir/StructureDefinition/cqf-scope",
      "valueString": "@mii-termserv/dicom.terminology"
    }
  ]
}