{
  "resourceType": "ValueSet",
  "id": "dicom-cid-221-MeasurementRangeConcept",
  "url": "http://dicom.nema.org/medical/dicom/current/output/chtml/part16/sect_CID_221.html",
  "identifier": [
    {
      "system": "urn:ietf:rfc:3986",
      "value": "urn:oid:1.2.840.10008.6.1.26"
    }
  ],
  "version": "20030327",
  "name": "MeasurementRangeConcept",
  "status": "active",
  "experimental": false,
  "date": "2024-06-17",
  "publisher": "NEMA MITA DICOM",
  "description": "Transitive closure of CID 221 MeasurementRangeConcept",
  "copyright": "© 2024 NEMA",
  "compose": {
    "include": [
      {
        "system": "http://dicom.nema.org/resources/ontology/DCM",
        "concept": [
          {
            "code": "121415",
            "display": "Percentile Ranking of measurement"
          },
          {
            "code": "121416",
            "display": "Z-Score of measurement"
          },
          {
            "code": "121414",
            "display": "Standard deviation of population"
          },
          {
            "code": "121417",
            "display": "2 Sigma deviation of population"
          },
          {
            "code": "130615",
            "display": "Interquartile Range to Median ratio of population"
          },
          {
            "code": "130614",
            "display": "Interquartile Range of population"
          }
        ]
      },
      {
        "system": "http://snomed.info/sct",
        "concept": [
          {
            "code": "371919006",
            "display": "1 Sigma Lower Value of population"
          },
          {
            "code": "371918003",
            "display": "2 Sigma Lower Value of population"
          },
          {
            "code": "371888009",
            "display": "5th Percentile Value of population"
          },
          {
            "code": "371890005",
            "display": "10th Percentile Value of population"
          },
          {
            "code": "371917008",
            "display": "1 Sigma Upper Value of population"
          },
          {
            "code": "371920000",
            "display": "2 Sigma Upper Value of population"
          },
          {
            "code": "373098007",
            "display": "Mean Value of population"
          },
          {
            "code": "371889001",
            "display": "95th Percentile Value of population"
          },
          {
            "code": "371887004",
            "display": "90th Percentile Value of population"
          },
          {
            "code": "373099004",
            "display": "Median Value of population"
          }
        ]
      }
    ]
  },
  "meta": {
    "tag": [
      {
        "system": "https://mii-termserv.de/fhir/su-termserv/CodeSystem/mii-cs-suts-resource-tags-project",
        "code": "dicom",
        "display": "Digital Imaging and Communications in Medicine"
      },
      {
        "system": "https://mii-termserv.de/fhir/su-termserv/CodeSystem/mii-cs-suts-resource-tags-project",
        "code": "international",
        "display": "International standard terminology"
      },
      {
        "system": "https://mii-termserv.de/fhir/su-termserv/CodeSystem/mii-cs-suts-resource-tags-dataset",
        "code": "dicom",
        "display": "DICOM Terminology"
      },
      {
        "system": "https://mii-termserv.de/fhir/su-termserv/CodeSystem/mii-cs-suts-resource-tags-dataset",
        "code": "standard",
        "display": "International Standards"
      },
      {
        "system": "https://mii-termserv.de/fhir/su-termserv/CodeSystem/mii-cs-suts-resource-tags-license",
        "code": "https://mii-termserv.de/licenses#dicom",
        "display": "DICOM license"
      }
    ]
  },
  "title": "MeasurementRangeConcept",
  "text": {
    "status": "generated",
    "div": "<div xmlns=\"http://www.w3.org/1999/xhtml\"><h2>MeasurementRangeConcept</h2><tt>http://dicom.nema.org/medical/dicom/current/output/chtml/part16/sect_CID_221.html</tt><p>Transitive closure of CID 221 MeasurementRangeConcept</p><div><p><b>SU-TermServ Metadata</b></p><table><tbody><tr><td><b>Projects</b></td><td><ul><li>Digital Imaging and Communications in Medicine</li><li>International standard terminology</li></ul></td></tr><tr><td><b>Datasets</b></td><td><ul><li>DICOM Terminology</li><li>International Standards</li></ul></td></tr><tr><td><b>License</b></td><td><a href=\"https://mii-termserv.de/licenses#dicom\">DICOM license</a></td></tr><tr><td><b>Package Scope</b></td><td><a href=\"https://gitlab.com/groups/mii-termserv/fhir-resources/-/packages/?ForderBy%3Dversion%26sort%3Ddesc%26search%5B%5D%3D@mii-termserv/dicom.terminology\"><code>@mii-termserv/dicom.terminology</code></a></td></tr></tbody></table></div></div>"
  },
  "extension": [
    {
      "url": "http://hl7.org/fhir/StructureDefinition/cqf-scope",
      "valueString": "@mii-termserv/dicom.terminology"
    }
  ]
}