{
  "resourceType": "ValueSet",
  "id": "dicom-cid-4250-VisualFieldStaticPerimetryTestPattern",
  "url": "http://dicom.nema.org/medical/dicom/current/output/chtml/part16/sect_CID_4250.html",
  "identifier": [
    {
      "system": "urn:ietf:rfc:3986",
      "value": "urn:oid:1.2.840.10008.6.1.909"
    }
  ],
  "version": "20100827",
  "name": "VisualFieldStaticPerimetryTestPattern",
  "status": "active",
  "experimental": false,
  "date": "2024-06-17",
  "publisher": "NEMA MITA DICOM",
  "description": "Transitive closure of CID 4250 VisualFieldStaticPerimetryTestPattern",
  "copyright": "© 2024 NEMA",
  "compose": {
    "include": [
      {
        "system": "http://dicom.nema.org/resources/ontology/DCM",
        "concept": [
          {
            "code": "111803",
            "display": "Visual Field 60-4 Test Pattern"
          },
          {
            "code": "111814",
            "display": "Visual Field Central Test Pattern"
          },
          {
            "code": "111804",
            "display": "Visual Field Macula Test Pattern"
          },
          {
            "code": "111805",
            "display": "Visual Field Central 40 Point Test Pattern"
          },
          {
            "code": "111806",
            "display": "Visual Field Central 76 Point Test Pattern"
          },
          {
            "code": "111807",
            "display": "Visual Field Peripheral 60 Point Test Pattern"
          },
          {
            "code": "111808",
            "display": "Visual Field Full Field 81 Point Test Pattern"
          },
          {
            "code": "111809",
            "display": "Visual Field Full Field 120 Point Test Pattern"
          },
          {
            "code": "111810",
            "display": "Visual Field G Test Pattern"
          },
          {
            "code": "111800",
            "display": "Visual Field 24-2 Test Pattern"
          },
          {
            "code": "111811",
            "display": "Visual Field M Test Pattern"
          },
          {
            "code": "111801",
            "display": "Visual Field 10-2 Test Pattern"
          },
          {
            "code": "111812",
            "display": "Visual Field 07 Test Pattern"
          },
          {
            "code": "111802",
            "display": "Visual Field 30-2 Test Pattern"
          },
          {
            "code": "111813",
            "display": "Visual Field LVC Test Pattern"
          }
        ]
      }
    ]
  },
  "meta": {
    "tag": [
      {
        "system": "https://mii-termserv.de/fhir/su-termserv/CodeSystem/mii-cs-suts-resource-tags-project",
        "code": "dicom",
        "display": "Digital Imaging and Communications in Medicine"
      },
      {
        "system": "https://mii-termserv.de/fhir/su-termserv/CodeSystem/mii-cs-suts-resource-tags-project",
        "code": "international",
        "display": "International standard terminology"
      },
      {
        "system": "https://mii-termserv.de/fhir/su-termserv/CodeSystem/mii-cs-suts-resource-tags-dataset",
        "code": "dicom",
        "display": "DICOM Terminology"
      },
      {
        "system": "https://mii-termserv.de/fhir/su-termserv/CodeSystem/mii-cs-suts-resource-tags-dataset",
        "code": "standard",
        "display": "International Standards"
      },
      {
        "system": "https://mii-termserv.de/fhir/su-termserv/CodeSystem/mii-cs-suts-resource-tags-license",
        "code": "https://mii-termserv.de/licenses#dicom",
        "display": "DICOM license"
      }
    ]
  },
  "title": "VisualFieldStaticPerimetryTestPattern",
  "text": {
    "status": "generated",
    "div": "<div xmlns=\"http://www.w3.org/1999/xhtml\"><h2>VisualFieldStaticPerimetryTestPattern</h2><tt>http://dicom.nema.org/medical/dicom/current/output/chtml/part16/sect_CID_4250.html</tt><p>Transitive closure of CID 4250 VisualFieldStaticPerimetryTestPattern</p><div><p><b>SU-TermServ Metadata</b></p><table><tbody><tr><td><b>Projects</b></td><td><ul><li>Digital Imaging and Communications in Medicine</li><li>International standard terminology</li></ul></td></tr><tr><td><b>Datasets</b></td><td><ul><li>DICOM Terminology</li><li>International Standards</li></ul></td></tr><tr><td><b>License</b></td><td><a href=\"https://mii-termserv.de/licenses#dicom\">DICOM license</a></td></tr><tr><td><b>Package Scope</b></td><td><a href=\"https://gitlab.com/groups/mii-termserv/fhir-resources/-/packages/?ForderBy%3Dversion%26sort%3Ddesc%26search%5B%5D%3D@mii-termserv/dicom.terminology\"><code>@mii-termserv/dicom.terminology</code></a></td></tr></tbody></table></div></div>"
  },
  "extension": [
    {
      "url": "http://hl7.org/fhir/StructureDefinition/cqf-scope",
      "valueString": "@mii-termserv/dicom.terminology"
    }
  ]
}