{
  "resourceType": "ValueSet",
  "id": "dicom-cid-33-Modality",
  "url": "http://dicom.nema.org/medical/dicom/current/output/chtml/part16/sect_CID_33.html",
  "identifier": [
    {
      "system": "urn:ietf:rfc:3986",
      "value": "urn:oid:1.2.840.10008.6.1.1283"
    }
  ],
  "version": "20190327",
  "name": "Modality",
  "status": "active",
  "experimental": false,
  "date": "2024-06-17",
  "publisher": "NEMA MITA DICOM",
  "description": "Transitive closure of CID 33 Modality",
  "copyright": "© 2024 NEMA",
  "compose": {
    "include": [
      {
        "system": "http://dicom.nema.org/resources/ontology/DCM",
        "concept": [
          {
            "code": "BMD",
            "display": "Bone Mineral Densitometry"
          },
          {
            "code": "EOG",
            "display": "Electrooculography"
          },
          {
            "code": "SM",
            "display": "Slide Microscopy"
          },
          {
            "code": "SR",
            "display": "Structured Report Document"
          },
          {
            "code": "FID",
            "display": "Spatial Fiducials"
          },
          {
            "code": "OP",
            "display": "Ophthalmic Photography"
          },
          {
            "code": "OT",
            "display": "Other"
          },
          {
            "code": "KO",
            "display": "Key Object Selection"
          },
          {
            "code": "ECG",
            "display": "Electrocardiography"
          },
          {
            "code": "GM",
            "display": "General Microscopy"
          },
          {
            "code": "XA",
            "display": "X-Ray Angiography"
          },
          {
            "code": "IOL",
            "display": "Intraocular Lens Calculation"
          },
          {
            "code": "XC",
            "display": "External-camera Photography"
          },
          {
            "code": "ASMT",
            "display": "Content Assessment Result"
          },
          {
            "code": "DMS",
            "display": "Dermoscopy"
          },
          {
            "code": "IVUS",
            "display": "Intravascular Ultrasound"
          },
          {
            "code": "CR",
            "display": "Computed Radiography"
          },
          {
            "code": "CT",
            "display": "Computed Tomography"
          },
          {
            "code": "PA",
            "display": "Photoacoustic"
          },
          {
            "code": "OSS",
            "display": "Optical Surface Scanner"
          },
          {
            "code": "TG",
            "display": "Thermography"
          },
          {
            "code": "REG",
            "display": "Registration"
          },
          {
            "code": "LEN",
            "display": "Lensometry"
          },
          {
            "code": "TEXTUREMAP",
            "display": "Texture Map"
          },
          {
            "code": "RTDOSE",
            "display": "RT Dose"
          },
          {
            "code": "OPTENF",
            "display": "Ophthalmic Tomography En Face"
          },
          {
            "code": "HC",
            "display": "Hard Copy"
          },
          {
            "code": "RTPLAN",
            "display": "RT Plan"
          },
          {
            "code": "HD",
            "display": "Hemodynamic Waveform"
          },
          {
            "code": "OCT",
            "display": "Optical Coherence Tomography"
          },
          {
            "code": "BDUS",
            "display": "Ultrasound Bone Densitometry"
          },
          {
            "code": "M3D",
            "display": "Model for 3D Manufacturing"
          },
          {
            "code": "DG",
            "display": "Diaphanography"
          },
          {
            "code": "PR",
            "display": "Presentation State"
          },
          {
            "code": "PT",
            "display": "Positron emission tomography"
          },
          {
            "code": "EPS",
            "display": "Cardiac Electrophysiology"
          },
          {
            "code": "LS",
            "display": "Laser Scan"
          },
          {
            "code": "PX",
            "display": "Panoramic X-Ray"
          },
          {
            "code": "OPM",
            "display": "Ophthalmic Mapping"
          },
          {
            "code": "OPTBSV",
            "display": "Ophthalmic Tomography B-scan Volume Analysis"
          },
          {
            "code": "OPV",
            "display": "Ophthalmic Visual Field"
          },
          {
            "code": "DX",
            "display": "Digital Radiography"
          },
          {
            "code": "OPT",
            "display": "Ophthalmic Tomography"
          },
          {
            "code": "DOC",
            "display": "Document"
          },
          {
            "code": "RTRECORD",
            "display": "RT Treatment Record"
          },
          {
            "code": "MG",
            "display": "Mammography"
          },
          {
            "code": "US",
            "display": "Ultrasound"
          },
          {
            "code": "EMG",
            "display": "Electromyography"
          },
          {
            "code": "IVOCT",
            "display": "Intravascular Optical Coherence Tomography"
          },
          {
            "code": "RTSTRUCT",
            "display": "RT Structure Set"
          },
          {
            "code": "MR",
            "display": "Magnetic Resonance"
          },
          {
            "code": "IO",
            "display": "Intra-oral Radiography"
          },
          {
            "code": "EEG",
            "display": "Electroencephalography"
          },
          {
            "code": "RTIMAGE",
            "display": "RT Image"
          },
          {
            "code": "VA",
            "display": "Visual Acuity"
          },
          {
            "code": "RESP",
            "display": "Respiratory Waveform"
          },
          {
            "code": "ES",
            "display": "Endoscopy"
          },
          {
            "code": "RWV",
            "display": "Real World Value Map"
          },
          {
            "code": "AR",
            "display": "Autorefraction"
          },
          {
            "code": "POS",
            "display": "Position Sensor"
          },
          {
            "code": "SEG",
            "display": "Segmentation"
          },
          {
            "code": "RG",
            "display": "Radiographic imaging"
          },
          {
            "code": "RF",
            "display": "Radiofluoroscopy"
          },
          {
            "code": "AU",
            "display": "Basic Voice Audio"
          },
          {
            "code": "KER",
            "display": "Keratometry"
          },
          {
            "code": "SMR",
            "display": "Stereometric Relationship"
          },
          {
            "code": "CTPROTOCOL",
            "display": "CT Protocol"
          },
          {
            "code": "STAIN",
            "display": "Automated Slide Stainer"
          },
          {
            "code": "OAM",
            "display": "Ophthalmic Axial Measurements"
          },
          {
            "code": "NM",
            "display": "Nuclear Medicine"
          },
          {
            "code": "PLAN",
            "display": "Plan"
          },
          {
            "code": "BI",
            "display": "Biomagnetic Imaging"
          },
          {
            "code": "SRF",
            "display": "Subjective Refraction"
          },
          {
            "code": "CFM",
            "display": "Confocal Microscopy"
          }
        ]
      }
    ]
  },
  "meta": {
    "tag": [
      {
        "system": "https://mii-termserv.de/fhir/su-termserv/CodeSystem/mii-cs-suts-resource-tags-project",
        "code": "dicom",
        "display": "Digital Imaging and Communications in Medicine"
      },
      {
        "system": "https://mii-termserv.de/fhir/su-termserv/CodeSystem/mii-cs-suts-resource-tags-project",
        "code": "international",
        "display": "International standard terminology"
      },
      {
        "system": "https://mii-termserv.de/fhir/su-termserv/CodeSystem/mii-cs-suts-resource-tags-dataset",
        "code": "dicom",
        "display": "DICOM Terminology"
      },
      {
        "system": "https://mii-termserv.de/fhir/su-termserv/CodeSystem/mii-cs-suts-resource-tags-dataset",
        "code": "standard",
        "display": "International Standards"
      },
      {
        "system": "https://mii-termserv.de/fhir/su-termserv/CodeSystem/mii-cs-suts-resource-tags-license",
        "code": "https://mii-termserv.de/licenses#dicom",
        "display": "DICOM license"
      }
    ]
  },
  "title": "Modality",
  "text": {
    "status": "generated",
    "div": "<div xmlns=\"http://www.w3.org/1999/xhtml\"><h2>Modality</h2><tt>http://dicom.nema.org/medical/dicom/current/output/chtml/part16/sect_CID_33.html</tt><p>Transitive closure of CID 33 Modality</p><div><p><b>SU-TermServ Metadata</b></p><table><tbody><tr><td><b>Projects</b></td><td><ul><li>Digital Imaging and Communications in Medicine</li><li>International standard terminology</li></ul></td></tr><tr><td><b>Datasets</b></td><td><ul><li>DICOM Terminology</li><li>International Standards</li></ul></td></tr><tr><td><b>License</b></td><td><a href=\"https://mii-termserv.de/licenses#dicom\">DICOM license</a></td></tr><tr><td><b>Package Scope</b></td><td><a href=\"https://gitlab.com/groups/mii-termserv/fhir-resources/-/packages/?ForderBy%3Dversion%26sort%3Ddesc%26search%5B%5D%3D@mii-termserv/dicom.terminology\"><code>@mii-termserv/dicom.terminology</code></a></td></tr></tbody></table></div></div>"
  },
  "extension": [
    {
      "url": "http://hl7.org/fhir/StructureDefinition/cqf-scope",
      "valueString": "@mii-termserv/dicom.terminology"
    }
  ]
}