{
  "resourceType": "ValueSet",
  "id": "dicom-cid-3415-CardiacRhythm",
  "url": "http://dicom.nema.org/medical/dicom/current/output/chtml/part16/sect_CID_3415.html",
  "identifier": [
    {
      "system": "urn:ietf:rfc:3986",
      "value": "urn:oid:1.2.840.10008.6.1.80"
    }
  ],
  "version": "20080927",
  "name": "CardiacRhythm",
  "status": "active",
  "experimental": false,
  "date": "2024-06-17",
  "publisher": "NEMA MITA DICOM",
  "description": "Transitive closure of CID 3415 CardiacRhythm",
  "copyright": "© 2024 NEMA",
  "compose": {
    "include": [
      {
        "system": "urn:iso:std:iso:11073:10101",
        "concept": [
          {
            "code": "10:9712",
            "display": "AV Dissociation"
          },
          {
            "code": "10:9952",
            "display": "Ventricular Couplet"
          },
          {
            "code": "10:9632",
            "display": "First Degree AV Block"
          },
          {
            "code": "10:9312",
            "display": "Non-Respiratory Sinus Arrhythmia"
          },
          {
            "code": "10:9872",
            "display": "Ventricular Parasystole"
          },
          {
            "code": "10:10032",
            "display": "Nonsustained Ventricular Tachycardia (paroxysmal)"
          },
          {
            "code": "10:9552",
            "display": "AV junctional (nodal) escape rhythm"
          },
          {
            "code": "10:10352",
            "display": "Irregular rhythm"
          },
          {
            "code": "10:10112",
            "display": "Wolf-Parkinson-White syndrome"
          },
          {
            "code": "10:10432",
            "display": "Bradycardia"
          },
          {
            "code": "10:10160",
            "display": "Lown-Ganong-Levine syndrome"
          },
          {
            "code": "10:9760",
            "display": "Complete AV dissociation"
          },
          {
            "code": "10:9440",
            "display": "Automatic Atrial Tachycardia"
          },
          {
            "code": "10:9680",
            "display": "Second Degree AV Block Type II (Mobitz Type II)"
          },
          {
            "code": "10:9360",
            "display": "Atrial Ectopic Rhythm"
          },
          {
            "code": "10:10080",
            "display": "Torsades de Pointes Ventricular Tachycardia"
          },
          {
            "code": "10:9280",
            "display": "Sinus Arrhythmia"
          },
          {
            "code": "10:9328",
            "display": "Wandering Sinus Pacemaker within the sinus node"
          },
          {
            "code": "10:9888",
            "display": "Accelerated idioventricular rhythm"
          },
          {
            "code": "10:10048",
            "display": "Sustained Monomorphic Ventricular Tachycardia"
          },
          {
            "code": "10:10128",
            "display": "Wolf-Parkinson type A"
          },
          {
            "code": "10:9568",
            "display": "Accelerated AV junctional (nodal) rhythm"
          },
          {
            "code": "10:9920",
            "display": "Ventricular Bigeminy"
          },
          {
            "code": "10:10448",
            "display": "Calibration signal (sustained)"
          },
          {
            "code": "10:9248",
            "display": "Sinus Bradycardia"
          },
          {
            "code": "10:9600",
            "display": "AV reciprocating tachycardia"
          },
          {
            "code": "10:9488",
            "display": "Supraventricular (atrial or junctional) Ectopic Rhythm"
          },
          {
            "code": "10:9840",
            "display": "Ventricular rhythm"
          },
          {
            "code": "10:10000",
            "display": "Ventricular Flutter"
          },
          {
            "code": "10:9520",
            "display": "Supraventricular Paroxsysmal Tachycardia"
          },
          {
            "code": "10:10240",
            "display": "Ventricular Demand Mode Pacing"
          },
          {
            "code": "10:9808",
            "display": "Second Degree SA Block Type II"
          },
          {
            "code": "10:9728",
            "display": "AV dissociation with interference"
          },
          {
            "code": "10:9408",
            "display": "Paroxsysmal Atrial Tachycardia"
          },
          {
            "code": "10:9968",
            "display": "Ventricular Run"
          },
          {
            "code": "10:9648",
            "display": "Second Degree AV Block"
          },
          {
            "code": "10:10368",
            "display": "Low Heart Rate Variability"
          },
          {
            "code": "10:10096",
            "display": "pre-excitation"
          },
          {
            "code": "10:9296",
            "display": "Respiratory Sinus Arrhythmia"
          },
          {
            "code": "10:9856",
            "display": "Idioventricular (ventricular escape) rhythm"
          },
          {
            "code": "10:10016",
            "display": "Ventricular Fibrillation"
          },
          {
            "code": "10:10336",
            "display": "Asystole"
          },
          {
            "code": "10:9536",
            "display": "AV junctional (nodal) rhythm"
          },
          {
            "code": "10:9216",
            "display": "Sinus Rhythm"
          },
          {
            "code": "10:9776",
            "display": "First Degree SA Block"
          },
          {
            "code": "10:10416",
            "display": "T-wave alternans"
          },
          {
            "code": "10:9456",
            "display": "Atrial flutter"
          },
          {
            "code": "10:9696",
            "display": "Third Degree AV Block (complete AV block)"
          },
          {
            "code": "10:9376",
            "display": "Atrial Bigeminy"
          },
          {
            "code": "10:10176",
            "display": "Atrial Demand Mode Pacing"
          },
          {
            "code": "10:9936",
            "display": "Ventricular Trigeminy"
          },
          {
            "code": "10:9616",
            "display": "Reentrant AV nodal tachycardia"
          },
          {
            "code": "10:9584",
            "display": "Junctional Tachycardia"
          },
          {
            "code": "10:9264",
            "display": "Sinus Tachycardia"
          },
          {
            "code": "10:9504",
            "display": "Supraventricular Tachycardia (atrial or junctional)"
          },
          {
            "code": "10:10304",
            "display": "Anti-Tachycardia Pacing"
          },
          {
            "code": "10:9744",
            "display": "Isorhythmic AV dissociation"
          },
          {
            "code": "10:9424",
            "display": "Multifocal Atrial Tachycardia"
          },
          {
            "code": "10:9984",
            "display": "Ventricular Tachycardia (nonparoxysmal)"
          },
          {
            "code": "10:9664",
            "display": "Second Degree AV Block Type I (Wenckebach, or Mobitz Type I)"
          },
          {
            "code": "10:9344",
            "display": "Wandering Pacemaker between the sinus node and the A-V node"
          },
          {
            "code": "10:10064",
            "display": "Polymorphic Ventricular Tachycardia"
          },
          {
            "code": "10:10144",
            "display": "Wolf-Parkinson type B"
          },
          {
            "code": "10:9904",
            "display": "Slow Ventricular Tachycardia (Idioventricular Tachycardia)"
          },
          {
            "code": "10:9824",
            "display": "Third Degree SA Block (complete SA block)"
          },
          {
            "code": "10:9232",
            "display": "Normal Sinus Rhythm"
          },
          {
            "code": "10:9792",
            "display": "Second Degree SA Block Type I (Wenckebach)"
          },
          {
            "code": "10:9472",
            "display": "Atrial fibrillation"
          },
          {
            "code": "10:9392",
            "display": "Atrial Tachycardia"
          }
        ]
      }
    ]
  },
  "meta": {
    "tag": [
      {
        "system": "https://mii-termserv.de/fhir/su-termserv/CodeSystem/mii-cs-suts-resource-tags-project",
        "code": "dicom",
        "display": "Digital Imaging and Communications in Medicine"
      },
      {
        "system": "https://mii-termserv.de/fhir/su-termserv/CodeSystem/mii-cs-suts-resource-tags-project",
        "code": "international",
        "display": "International standard terminology"
      },
      {
        "system": "https://mii-termserv.de/fhir/su-termserv/CodeSystem/mii-cs-suts-resource-tags-dataset",
        "code": "dicom",
        "display": "DICOM Terminology"
      },
      {
        "system": "https://mii-termserv.de/fhir/su-termserv/CodeSystem/mii-cs-suts-resource-tags-dataset",
        "code": "standard",
        "display": "International Standards"
      },
      {
        "system": "https://mii-termserv.de/fhir/su-termserv/CodeSystem/mii-cs-suts-resource-tags-license",
        "code": "https://mii-termserv.de/licenses#dicom",
        "display": "DICOM license"
      }
    ]
  },
  "title": "CardiacRhythm",
  "text": {
    "status": "generated",
    "div": "<div xmlns=\"http://www.w3.org/1999/xhtml\"><h2>CardiacRhythm</h2><tt>http://dicom.nema.org/medical/dicom/current/output/chtml/part16/sect_CID_3415.html</tt><p>Transitive closure of CID 3415 CardiacRhythm</p><div><p><b>SU-TermServ Metadata</b></p><table><tbody><tr><td><b>Projects</b></td><td><ul><li>Digital Imaging and Communications in Medicine</li><li>International standard terminology</li></ul></td></tr><tr><td><b>Datasets</b></td><td><ul><li>DICOM Terminology</li><li>International Standards</li></ul></td></tr><tr><td><b>License</b></td><td><a href=\"https://mii-termserv.de/licenses#dicom\">DICOM license</a></td></tr><tr><td><b>Package Scope</b></td><td><a href=\"https://gitlab.com/groups/mii-termserv/fhir-resources/-/packages/?ForderBy%3Dversion%26sort%3Ddesc%26search%5B%5D%3D@mii-termserv/dicom.terminology\"><code>@mii-termserv/dicom.terminology</code></a></td></tr></tbody></table></div></div>"
  },
  "extension": [
    {
      "url": "http://hl7.org/fhir/StructureDefinition/cqf-scope",
      "valueString": "@mii-termserv/dicom.terminology"
    }
  ]
}