{
  "resourceType": "ValueSet",
  "id": "dicom-cid-4109-ModelIndependentDynamicContrastAnalysisParameter",
  "url": "http://dicom.nema.org/medical/dicom/current/output/chtml/part16/sect_CID_4109.html",
  "identifier": [
    {
      "system": "urn:ietf:rfc:3986",
      "value": "urn:oid:1.2.840.10008.6.1.994"
    }
  ],
  "version": "20150916",
  "name": "ModelIndependentDynamicContrastAnalysisParameter",
  "status": "active",
  "experimental": false,
  "date": "2024-06-17",
  "publisher": "NEMA MITA DICOM",
  "description": "Transitive closure of CID 4109 ModelIndependentDynamicContrastAnalysisParameter",
  "copyright": "© 2024 NEMA",
  "compose": {
    "include": [
      {
        "system": "http://dicom.nema.org/resources/ontology/DCM",
        "concept": [
          {
            "code": "113069",
            "display": "Time To Peak"
          },
          {
            "code": "126326",
            "display": "IAUC90BN"
          },
          {
            "code": "126327",
            "display": "IAUC180BN"
          },
          {
            "code": "126374",
            "display": "Temporal Derivative Threshold"
          },
          {
            "code": "126320",
            "display": "IAUC"
          },
          {
            "code": "126375",
            "display": "Maximum Slope"
          },
          {
            "code": "126321",
            "display": "IAUC60"
          },
          {
            "code": "126376",
            "display": "Maximum Difference"
          },
          {
            "code": "126322",
            "display": "IAUC90"
          },
          {
            "code": "126377",
            "display": "Tracer Concentration"
          },
          {
            "code": "126323",
            "display": "IAUC180"
          },
          {
            "code": "126324",
            "display": "IAUCBN"
          },
          {
            "code": "126325",
            "display": "IAUC60BN"
          },
          {
            "code": "126370",
            "display": "Time of Peak Concentration"
          },
          {
            "code": "126371",
            "display": "Bolus Arrival Time"
          },
          {
            "code": "126372",
            "display": "Time of Leading Half-Peak Concentration"
          }
        ]
      }
    ]
  },
  "meta": {
    "tag": [
      {
        "system": "https://mii-termserv.de/fhir/su-termserv/CodeSystem/mii-cs-suts-resource-tags-project",
        "code": "dicom",
        "display": "Digital Imaging and Communications in Medicine"
      },
      {
        "system": "https://mii-termserv.de/fhir/su-termserv/CodeSystem/mii-cs-suts-resource-tags-project",
        "code": "international",
        "display": "International standard terminology"
      },
      {
        "system": "https://mii-termserv.de/fhir/su-termserv/CodeSystem/mii-cs-suts-resource-tags-dataset",
        "code": "dicom",
        "display": "DICOM Terminology"
      },
      {
        "system": "https://mii-termserv.de/fhir/su-termserv/CodeSystem/mii-cs-suts-resource-tags-dataset",
        "code": "standard",
        "display": "International Standards"
      },
      {
        "system": "https://mii-termserv.de/fhir/su-termserv/CodeSystem/mii-cs-suts-resource-tags-license",
        "code": "https://mii-termserv.de/licenses#dicom",
        "display": "DICOM license"
      }
    ]
  },
  "title": "ModelIndependentDynamicContrastAnalysisParameter",
  "text": {
    "status": "generated",
    "div": "<div xmlns=\"http://www.w3.org/1999/xhtml\"><h2>ModelIndependentDynamicContrastAnalysisParameter</h2><tt>http://dicom.nema.org/medical/dicom/current/output/chtml/part16/sect_CID_4109.html</tt><p>Transitive closure of CID 4109 ModelIndependentDynamicContrastAnalysisParameter</p><div><p><b>SU-TermServ Metadata</b></p><table><tbody><tr><td><b>Projects</b></td><td><ul><li>Digital Imaging and Communications in Medicine</li><li>International standard terminology</li></ul></td></tr><tr><td><b>Datasets</b></td><td><ul><li>DICOM Terminology</li><li>International Standards</li></ul></td></tr><tr><td><b>License</b></td><td><a href=\"https://mii-termserv.de/licenses#dicom\">DICOM license</a></td></tr><tr><td><b>Package Scope</b></td><td><a href=\"https://gitlab.com/groups/mii-termserv/fhir-resources/-/packages/?ForderBy%3Dversion%26sort%3Ddesc%26search%5B%5D%3D@mii-termserv/dicom.terminology\"><code>@mii-termserv/dicom.terminology</code></a></td></tr></tbody></table></div></div>"
  },
  "extension": [
    {
      "url": "http://hl7.org/fhir/StructureDefinition/cqf-scope",
      "valueString": "@mii-termserv/dicom.terminology"
    }
  ]
}