{
  "resourceType": "ValueSet",
  "id": "dicom-cid-3629-ProcedureIntent",
  "url": "http://dicom.nema.org/medical/dicom/current/output/chtml/part16/sect_CID_3629.html",
  "identifier": [
    {
      "system": "urn:ietf:rfc:3986",
      "value": "urn:oid:1.2.840.10008.6.1.174"
    }
  ],
  "version": "20230630",
  "name": "ProcedureIntent",
  "status": "active",
  "experimental": false,
  "date": "2024-06-17",
  "publisher": "NEMA MITA DICOM",
  "description": "Transitive closure of CID 3629 ProcedureIntent",
  "copyright": "© 2024 NEMA",
  "compose": {
    "include": [
      {
        "system": "http://dicom.nema.org/resources/ontology/DCM",
        "concept": [
          {
            "code": "113680",
            "display": "Quality Control Intent"
          }
        ]
      },
      {
        "system": "http://snomed.info/sct",
        "concept": [
          {
            "code": "261004008",
            "display": "Diagnostic Intent"
          },
          {
            "code": "373825000",
            "display": "Staging intent"
          },
          {
            "code": "262202000",
            "display": "Therapeutic Intent"
          },
          {
            "code": "373808002",
            "display": "Curative intent"
          },
          {
            "code": "360271000",
            "display": "Prophylactic intent"
          },
          {
            "code": "421974008",
            "display": "Adjunct intent"
          },
          {
            "code": "447295008",
            "display": "Forensic Intent"
          },
          {
            "code": "373847000",
            "display": "Neo-adjuvant intent"
          },
          {
            "code": "399707004",
            "display": "Supportive intent"
          },
          {
            "code": "363675004",
            "display": "Guidance Intent"
          },
          {
            "code": "363676003",
            "display": "Palliative Intent"
          },
          {
            "code": "373846009",
            "display": "Adjuvant intent"
          },
          {
            "code": "1279505009",
            "display": "Combined Diagnostic and Therapeutic Intent"
          },
          {
            "code": "360156006",
            "display": "Screening Intent"
          },
          {
            "code": "129428001",
            "display": "Preventive intent"
          }
        ]
      }
    ]
  },
  "meta": {
    "tag": [
      {
        "system": "https://mii-termserv.de/fhir/su-termserv/CodeSystem/mii-cs-suts-resource-tags-project",
        "code": "dicom",
        "display": "Digital Imaging and Communications in Medicine"
      },
      {
        "system": "https://mii-termserv.de/fhir/su-termserv/CodeSystem/mii-cs-suts-resource-tags-project",
        "code": "international",
        "display": "International standard terminology"
      },
      {
        "system": "https://mii-termserv.de/fhir/su-termserv/CodeSystem/mii-cs-suts-resource-tags-dataset",
        "code": "dicom",
        "display": "DICOM Terminology"
      },
      {
        "system": "https://mii-termserv.de/fhir/su-termserv/CodeSystem/mii-cs-suts-resource-tags-dataset",
        "code": "standard",
        "display": "International Standards"
      },
      {
        "system": "https://mii-termserv.de/fhir/su-termserv/CodeSystem/mii-cs-suts-resource-tags-license",
        "code": "https://mii-termserv.de/licenses#dicom",
        "display": "DICOM license"
      }
    ]
  },
  "title": "ProcedureIntent",
  "text": {
    "status": "generated",
    "div": "<div xmlns=\"http://www.w3.org/1999/xhtml\"><h2>ProcedureIntent</h2><tt>http://dicom.nema.org/medical/dicom/current/output/chtml/part16/sect_CID_3629.html</tt><p>Transitive closure of CID 3629 ProcedureIntent</p><div><p><b>SU-TermServ Metadata</b></p><table><tbody><tr><td><b>Projects</b></td><td><ul><li>Digital Imaging and Communications in Medicine</li><li>International standard terminology</li></ul></td></tr><tr><td><b>Datasets</b></td><td><ul><li>DICOM Terminology</li><li>International Standards</li></ul></td></tr><tr><td><b>License</b></td><td><a href=\"https://mii-termserv.de/licenses#dicom\">DICOM license</a></td></tr><tr><td><b>Package Scope</b></td><td><a href=\"https://gitlab.com/groups/mii-termserv/fhir-resources/-/packages/?ForderBy%3Dversion%26sort%3Ddesc%26search%5B%5D%3D@mii-termserv/dicom.terminology\"><code>@mii-termserv/dicom.terminology</code></a></td></tr></tbody></table></div></div>"
  },
  "extension": [
    {
      "url": "http://hl7.org/fhir/StructureDefinition/cqf-scope",
      "valueString": "@mii-termserv/dicom.terminology"
    }
  ]
}