{
  "resourceType": "ValueSet",
  "id": "dicom-cid-7482-DXAnatomyImagedForAnimal",
  "url": "http://dicom.nema.org/medical/dicom/current/output/chtml/part16/sect_CID_7482.html",
  "identifier": [
    {
      "system": "urn:ietf:rfc:3986",
      "value": "urn:oid:1.2.840.10008.6.1.814"
    }
  ],
  "version": "20090717",
  "name": "DXAnatomyImagedforAnimal",
  "status": "active",
  "experimental": false,
  "date": "2024-06-17",
  "publisher": "NEMA MITA DICOM",
  "description": "Transitive closure of CID 7482 DXAnatomyImagedforAnimal",
  "copyright": "© 2024 NEMA",
  "compose": {
    "include": [
      {
        "system": "http://snomed.info/sct",
        "concept": [
          {
            "code": "113351006",
            "display": "Fetlock of hindlimb"
          },
          {
            "code": "54735007",
            "display": "Sacrum"
          },
          {
            "code": "1217256009",
            "display": "Thoraco-lumbar spine"
          },
          {
            "code": "2095001",
            "display": "Nasal sinus"
          },
          {
            "code": "280711000",
            "display": "Metatarsus"
          },
          {
            "code": "75772009",
            "display": "Navicular of hindfoot"
          },
          {
            "code": "82474009",
            "display": "Calcaneal tubercle"
          },
          {
            "code": "85050009",
            "display": "Humerus"
          },
          {
            "code": "13190002",
            "display": "Fetlock of forelimb"
          },
          {
            "code": "32849002",
            "display": "Esophagus"
          },
          {
            "code": "89837001",
            "display": "Bladder"
          },
          {
            "code": "62555009",
            "display": "Atlantal-axial joint"
          },
          {
            "code": "91609006",
            "display": "Mandible"
          },
          {
            "code": "18525008",
            "display": "Pastern of hindfoot"
          },
          {
            "code": "53036007",
            "display": "Wing"
          },
          {
            "code": "36455000",
            "display": "Metacarpus"
          },
          {
            "code": "442100006",
            "display": "Maxillary incisor teeth"
          },
          {
            "code": "431938005",
            "display": "Urinary tract"
          },
          {
            "code": "88176008",
            "display": "Mandibular dental arch"
          },
          {
            "code": "816092008",
            "display": "Pelvis"
          },
          {
            "code": "8205005",
            "display": "Carpus"
          },
          {
            "code": "38266002",
            "display": "Entire body"
          },
          {
            "code": "416550000",
            "display": "Chest and Abdomen"
          },
          {
            "code": "110535000",
            "display": "Radius and ulna"
          },
          {
            "code": "122496007",
            "display": "Lumbar spine"
          },
          {
            "code": "818981001",
            "display": "Abdomen"
          },
          {
            "code": "82680008",
            "display": "Digit"
          },
          {
            "code": "416804009",
            "display": "Hindfoot"
          },
          {
            "code": "39481002",
            "display": "Maxillary dental arch"
          },
          {
            "code": "110536004",
            "display": "Tibia and fibula"
          },
          {
            "code": "31329001",
            "display": "Pastern of forefoot"
          },
          {
            "code": "419176008",
            "display": "Forefoot"
          },
          {
            "code": "108371006",
            "display": "Tarsus"
          },
          {
            "code": "62834003",
            "display": "Upper gastro-intestinal tract"
          },
          {
            "code": "16982005",
            "display": "Shoulder"
          },
          {
            "code": "116010006",
            "display": "Stiffle"
          },
          {
            "code": "16953009",
            "display": "Elbow joint"
          },
          {
            "code": "71854001",
            "display": "Colon"
          },
          {
            "code": "42694008",
            "display": "All legs"
          },
          {
            "code": "363654007",
            "display": "Orbital structure"
          },
          {
            "code": "122495006",
            "display": "Thoracic spine"
          },
          {
            "code": "24136001",
            "display": "Hip joint"
          },
          {
            "code": "816094009",
            "display": "Chest"
          },
          {
            "code": "18149002",
            "display": "Coccygeal vertrebrae"
          },
          {
            "code": "442274007",
            "display": "Mandibular incisor teeth"
          },
          {
            "code": "71341001",
            "display": "Femur"
          },
          {
            "code": "55060009",
            "display": "Frontal sinus"
          },
          {
            "code": "1217257000",
            "display": "Cervico-thoracic spine"
          },
          {
            "code": "89546000",
            "display": "Skull"
          },
          {
            "code": "13648007",
            "display": "Urethra"
          },
          {
            "code": "64234005",
            "display": "Patella"
          },
          {
            "code": "20292002",
            "display": "Atlanto-occipital joint"
          },
          {
            "code": "1217253001",
            "display": "Lumbo-sacral spine"
          },
          {
            "code": "30518006",
            "display": "Navicular of forefoot"
          },
          {
            "code": "122494005",
            "display": "Cervical spine"
          }
        ]
      },
      {
        "system": "http://www.nlm.nih.gov/research/umls",
        "concept": [
          {
            "code": "C3669027",
            "display": "Distal phalanx"
          }
        ]
      }
    ]
  },
  "meta": {
    "tag": [
      {
        "system": "https://mii-termserv.de/fhir/su-termserv/CodeSystem/mii-cs-suts-resource-tags-project",
        "code": "dicom",
        "display": "Digital Imaging and Communications in Medicine"
      },
      {
        "system": "https://mii-termserv.de/fhir/su-termserv/CodeSystem/mii-cs-suts-resource-tags-project",
        "code": "international",
        "display": "International standard terminology"
      },
      {
        "system": "https://mii-termserv.de/fhir/su-termserv/CodeSystem/mii-cs-suts-resource-tags-dataset",
        "code": "dicom",
        "display": "DICOM Terminology"
      },
      {
        "system": "https://mii-termserv.de/fhir/su-termserv/CodeSystem/mii-cs-suts-resource-tags-dataset",
        "code": "standard",
        "display": "International Standards"
      },
      {
        "system": "https://mii-termserv.de/fhir/su-termserv/CodeSystem/mii-cs-suts-resource-tags-license",
        "code": "https://mii-termserv.de/licenses#dicom",
        "display": "DICOM license"
      }
    ]
  },
  "title": "DXAnatomyImagedforAnimal",
  "text": {
    "status": "generated",
    "div": "<div xmlns=\"http://www.w3.org/1999/xhtml\"><h2>DXAnatomyImagedforAnimal</h2><tt>http://dicom.nema.org/medical/dicom/current/output/chtml/part16/sect_CID_7482.html</tt><p>Transitive closure of CID 7482 DXAnatomyImagedforAnimal</p><div><p><b>SU-TermServ Metadata</b></p><table><tbody><tr><td><b>Projects</b></td><td><ul><li>Digital Imaging and Communications in Medicine</li><li>International standard terminology</li></ul></td></tr><tr><td><b>Datasets</b></td><td><ul><li>DICOM Terminology</li><li>International Standards</li></ul></td></tr><tr><td><b>License</b></td><td><a href=\"https://mii-termserv.de/licenses#dicom\">DICOM license</a></td></tr><tr><td><b>Package Scope</b></td><td><a href=\"https://gitlab.com/groups/mii-termserv/fhir-resources/-/packages/?ForderBy%3Dversion%26sort%3Ddesc%26search%5B%5D%3D@mii-termserv/dicom.terminology\"><code>@mii-termserv/dicom.terminology</code></a></td></tr></tbody></table></div></div>"
  },
  "extension": [
    {
      "url": "http://hl7.org/fhir/StructureDefinition/cqf-scope",
      "valueString": "@mii-termserv/dicom.terminology"
    }
  ]
}