{
  "resourceType": "ValueSet",
  "id": "dicom-cid-4052-PhantomDevice",
  "url": "http://dicom.nema.org/medical/dicom/current/output/chtml/part16/sect_CID_4052.html",
  "identifier": [
    {
      "system": "urn:ietf:rfc:3986",
      "value": "urn:oid:1.2.840.10008.6.1.315"
    }
  ],
  "version": "20221224",
  "name": "PhantomDevice",
  "status": "active",
  "experimental": false,
  "date": "2024-06-17",
  "publisher": "NEMA MITA DICOM",
  "description": "Transitive closure of CID 4052 PhantomDevice",
  "copyright": "© 2024 NEMA",
  "compose": {
    "include": [
      {
        "system": "http://dicom.nema.org/resources/ontology/DCM",
        "concept": [
          {
            "code": "113690",
            "display": "IEC Head Dosimetry Phantom"
          },
          {
            "code": "113691",
            "display": "IEC Body Dosimetry Phantom"
          },
          {
            "code": "113692",
            "display": "NEMA XR21-2000 Phantom"
          },
          {
            "code": "113682",
            "display": "ACR Accreditation Phantom - CT"
          },
          {
            "code": "113683",
            "display": "ACR Accreditation Phantom - MR"
          },
          {
            "code": "113684",
            "display": "ACR Accreditation Phantom - Mammography"
          },
          {
            "code": "113685",
            "display": "ACR Accreditation Phantom - Stereotactic Breast Biopsy"
          },
          {
            "code": "113686",
            "display": "ACR Accreditation Phantom - ECT"
          },
          {
            "code": "130541",
            "display": "10 cm Dosimetry Phantom"
          },
          {
            "code": "113687",
            "display": "ACR Accreditation Phantom - PET"
          },
          {
            "code": "113688",
            "display": "ACR Accreditation Phantom - ECT/PET"
          },
          {
            "code": "113689",
            "display": "ACR Accreditation Phantom - PET Faceplate"
          }
        ]
      },
      {
        "system": "http://snomed.info/sct",
        "concept": [
          {
            "code": "706342009",
            "display": "Phantom"
          }
        ]
      }
    ]
  },
  "meta": {
    "tag": [
      {
        "system": "https://mii-termserv.de/fhir/su-termserv/CodeSystem/mii-cs-suts-resource-tags-project",
        "code": "dicom",
        "display": "Digital Imaging and Communications in Medicine"
      },
      {
        "system": "https://mii-termserv.de/fhir/su-termserv/CodeSystem/mii-cs-suts-resource-tags-project",
        "code": "international",
        "display": "International standard terminology"
      },
      {
        "system": "https://mii-termserv.de/fhir/su-termserv/CodeSystem/mii-cs-suts-resource-tags-dataset",
        "code": "dicom",
        "display": "DICOM Terminology"
      },
      {
        "system": "https://mii-termserv.de/fhir/su-termserv/CodeSystem/mii-cs-suts-resource-tags-dataset",
        "code": "standard",
        "display": "International Standards"
      },
      {
        "system": "https://mii-termserv.de/fhir/su-termserv/CodeSystem/mii-cs-suts-resource-tags-license",
        "code": "https://mii-termserv.de/licenses#dicom",
        "display": "DICOM license"
      }
    ]
  },
  "title": "PhantomDevice",
  "text": {
    "status": "generated",
    "div": "<div xmlns=\"http://www.w3.org/1999/xhtml\"><h2>PhantomDevice</h2><tt>http://dicom.nema.org/medical/dicom/current/output/chtml/part16/sect_CID_4052.html</tt><p>Transitive closure of CID 4052 PhantomDevice</p><div><p><b>SU-TermServ Metadata</b></p><table><tbody><tr><td><b>Projects</b></td><td><ul><li>Digital Imaging and Communications in Medicine</li><li>International standard terminology</li></ul></td></tr><tr><td><b>Datasets</b></td><td><ul><li>DICOM Terminology</li><li>International Standards</li></ul></td></tr><tr><td><b>License</b></td><td><a href=\"https://mii-termserv.de/licenses#dicom\">DICOM license</a></td></tr><tr><td><b>Package Scope</b></td><td><a href=\"https://gitlab.com/groups/mii-termserv/fhir-resources/-/packages/?ForderBy%3Dversion%26sort%3Ddesc%26search%5B%5D%3D@mii-termserv/dicom.terminology\"><code>@mii-termserv/dicom.terminology</code></a></td></tr></tbody></table></div></div>"
  },
  "extension": [
    {
      "url": "http://hl7.org/fhir/StructureDefinition/cqf-scope",
      "valueString": "@mii-termserv/dicom.terminology"
    }
  ]
}