{
  "resourceType": "ValueSet",
  "id": "dicom-cid-3038-PatternEvent",
  "url": "http://dicom.nema.org/medical/dicom/current/output/chtml/part16/sect_CID_3038.html",
  "identifier": [
    {
      "system": "urn:ietf:rfc:3986",
      "value": "urn:oid:1.2.840.10008.6.1.1336"
    }
  ],
  "version": "20200623",
  "name": "PatternEvent",
  "status": "active",
  "experimental": false,
  "date": "2024-06-17",
  "publisher": "NEMA MITA DICOM",
  "description": "Transitive closure of CID 3038 PatternEvent",
  "copyright": "© 2024 NEMA",
  "compose": {
    "include": [
      {
        "system": "http://dicom.nema.org/resources/ontology/DCM",
        "concept": [
          {
            "code": "130414",
            "display": "Hyperventilation end"
          },
          {
            "code": "130413",
            "display": "Hyperventilation begin"
          },
          {
            "code": "130415",
            "display": "Post-hyperventilation"
          }
        ]
      },
      {
        "system": "http://snomed.info/sct",
        "concept": [
          {
            "code": "68978004",
            "display": "Hyperventilation"
          }
        ]
      },
      {
        "system": "urn:iso:std:iso:11073:10101",
        "concept": [
          {
            "code": "3:3276",
            "display": "Atrial flutter"
          },
          {
            "code": "3:3254",
            "display": "Spikes and waves"
          },
          {
            "code": "3:3264",
            "display": "Clinical seizure discharge"
          },
          {
            "code": "3:3146",
            "display": "First-degree AV block"
          },
          {
            "code": "3:3266",
            "display": "Arrhythmia event"
          },
          {
            "code": "3:3148",
            "display": "Second-degree AV block"
          },
          {
            "code": "3:3258",
            "display": "Third-degree AV block"
          },
          {
            "code": "3:3158",
            "display": "Irregular heart rate"
          },
          {
            "code": "3:3246",
            "display": "Desaturation"
          },
          {
            "code": "3:3128",
            "display": "Atrial fibrillation"
          },
          {
            "code": "3:3118",
            "display": "Irregular rhythm"
          },
          {
            "code": "3:3190",
            "display": "Supraventricular extrasystole"
          },
          {
            "code": "3:3072",
            "display": "Apnea"
          },
          {
            "code": "3:3292",
            "display": "Apnea 30 sec"
          },
          {
            "code": "3:3270",
            "display": "Sharp spikes"
          },
          {
            "code": "3:3294",
            "display": "Pacer artifact"
          },
          {
            "code": "3:3084",
            "display": "Bradycardia"
          },
          {
            "code": "3:3076",
            "display": "Asystole"
          },
          {
            "code": "3:3284",
            "display": "Apnea 15 sec"
          },
          {
            "code": "3:3262",
            "display": "Sinus tachycardia"
          }
        ]
      }
    ]
  },
  "meta": {
    "tag": [
      {
        "system": "https://mii-termserv.de/fhir/su-termserv/CodeSystem/mii-cs-suts-resource-tags-project",
        "code": "dicom",
        "display": "Digital Imaging and Communications in Medicine"
      },
      {
        "system": "https://mii-termserv.de/fhir/su-termserv/CodeSystem/mii-cs-suts-resource-tags-project",
        "code": "international",
        "display": "International standard terminology"
      },
      {
        "system": "https://mii-termserv.de/fhir/su-termserv/CodeSystem/mii-cs-suts-resource-tags-dataset",
        "code": "dicom",
        "display": "DICOM Terminology"
      },
      {
        "system": "https://mii-termserv.de/fhir/su-termserv/CodeSystem/mii-cs-suts-resource-tags-dataset",
        "code": "standard",
        "display": "International Standards"
      },
      {
        "system": "https://mii-termserv.de/fhir/su-termserv/CodeSystem/mii-cs-suts-resource-tags-license",
        "code": "https://mii-termserv.de/licenses#dicom",
        "display": "DICOM license"
      }
    ]
  },
  "title": "PatternEvent",
  "text": {
    "status": "generated",
    "div": "<div xmlns=\"http://www.w3.org/1999/xhtml\"><h2>PatternEvent</h2><tt>http://dicom.nema.org/medical/dicom/current/output/chtml/part16/sect_CID_3038.html</tt><p>Transitive closure of CID 3038 PatternEvent</p><div><p><b>SU-TermServ Metadata</b></p><table><tbody><tr><td><b>Projects</b></td><td><ul><li>Digital Imaging and Communications in Medicine</li><li>International standard terminology</li></ul></td></tr><tr><td><b>Datasets</b></td><td><ul><li>DICOM Terminology</li><li>International Standards</li></ul></td></tr><tr><td><b>License</b></td><td><a href=\"https://mii-termserv.de/licenses#dicom\">DICOM license</a></td></tr><tr><td><b>Package Scope</b></td><td><a href=\"https://gitlab.com/groups/mii-termserv/fhir-resources/-/packages/?ForderBy%3Dversion%26sort%3Ddesc%26search%5B%5D%3D@mii-termserv/dicom.terminology\"><code>@mii-termserv/dicom.terminology</code></a></td></tr></tbody></table></div></div>"
  },
  "extension": [
    {
      "url": "http://hl7.org/fhir/StructureDefinition/cqf-scope",
      "valueString": "@mii-termserv/dicom.terminology"
    }
  ]
}