{
  "resourceType": "ValueSet",
  "id": "dicom-cid-7185-AbstractMultiDimensionalImageModelAxisOrientation",
  "url": "http://dicom.nema.org/medical/dicom/current/output/chtml/part16/sect_CID_7185.html",
  "identifier": [
    {
      "system": "urn:ietf:rfc:3986",
      "value": "urn:oid:1.2.840.10008.6.1.922"
    }
  ],
  "version": "20100825",
  "name": "AbstractMultidimensionalImageModelAxisOrientation",
  "status": "active",
  "experimental": false,
  "date": "2024-06-17",
  "publisher": "NEMA MITA DICOM",
  "description": "Transitive closure of CID 7185 AbstractMultidimensionalImageModelAxisOrientation",
  "copyright": "© 2024 NEMA",
  "compose": {
    "include": [
      {
        "system": "http://dicom.nema.org/resources/ontology/DCM",
        "concept": [
          {
            "code": "110867",
            "display": "Left To Right"
          },
          {
            "code": "110866",
            "display": "Right To Left"
          },
          {
            "code": "110877",
            "display": "Wall To Septum"
          },
          {
            "code": "110876",
            "display": "Septum To Wall"
          },
          {
            "code": "110875",
            "display": "Inferior To Anterior"
          },
          {
            "code": "110874",
            "display": "Anterior To Inferior"
          },
          {
            "code": "110873",
            "display": "Base To Apex"
          },
          {
            "code": "110872",
            "display": "Apex To Base"
          },
          {
            "code": "110871",
            "display": "Posterior To Anterior"
          },
          {
            "code": "110870",
            "display": "Anterior To Posterior"
          },
          {
            "code": "110869",
            "display": "Foot To Head"
          },
          {
            "code": "110868",
            "display": "Head To Foot"
          }
        ]
      }
    ]
  },
  "meta": {
    "tag": [
      {
        "system": "https://mii-termserv.de/fhir/su-termserv/CodeSystem/mii-cs-suts-resource-tags-project",
        "code": "dicom",
        "display": "Digital Imaging and Communications in Medicine"
      },
      {
        "system": "https://mii-termserv.de/fhir/su-termserv/CodeSystem/mii-cs-suts-resource-tags-project",
        "code": "international",
        "display": "International standard terminology"
      },
      {
        "system": "https://mii-termserv.de/fhir/su-termserv/CodeSystem/mii-cs-suts-resource-tags-dataset",
        "code": "dicom",
        "display": "DICOM Terminology"
      },
      {
        "system": "https://mii-termserv.de/fhir/su-termserv/CodeSystem/mii-cs-suts-resource-tags-dataset",
        "code": "standard",
        "display": "International Standards"
      },
      {
        "system": "https://mii-termserv.de/fhir/su-termserv/CodeSystem/mii-cs-suts-resource-tags-license",
        "code": "https://mii-termserv.de/licenses#dicom",
        "display": "DICOM license"
      }
    ]
  },
  "title": "AbstractMultidimensionalImageModelAxisOrientation",
  "text": {
    "status": "generated",
    "div": "<div xmlns=\"http://www.w3.org/1999/xhtml\"><h2>AbstractMultidimensionalImageModelAxisOrientation</h2><tt>http://dicom.nema.org/medical/dicom/current/output/chtml/part16/sect_CID_7185.html</tt><p>Transitive closure of CID 7185 AbstractMultidimensionalImageModelAxisOrientation</p><div><p><b>SU-TermServ Metadata</b></p><table><tbody><tr><td><b>Projects</b></td><td><ul><li>Digital Imaging and Communications in Medicine</li><li>International standard terminology</li></ul></td></tr><tr><td><b>Datasets</b></td><td><ul><li>DICOM Terminology</li><li>International Standards</li></ul></td></tr><tr><td><b>License</b></td><td><a href=\"https://mii-termserv.de/licenses#dicom\">DICOM license</a></td></tr><tr><td><b>Package Scope</b></td><td><a href=\"https://gitlab.com/groups/mii-termserv/fhir-resources/-/packages/?ForderBy%3Dversion%26sort%3Ddesc%26search%5B%5D%3D@mii-termserv/dicom.terminology\"><code>@mii-termserv/dicom.terminology</code></a></td></tr></tbody></table></div></div>"
  },
  "extension": [
    {
      "url": "http://hl7.org/fhir/StructureDefinition/cqf-scope",
      "valueString": "@mii-termserv/dicom.terminology"
    }
  ]
}