{
  "resourceType": "ValueSet",
  "id": "dicom-cid-9568-RadiotherapyTreatmentInterlock",
  "url": "http://dicom.nema.org/medical/dicom/current/output/chtml/part16/sect_CID_9568.html",
  "identifier": [
    {
      "system": "urn:ietf:rfc:3986",
      "value": "urn:oid:1.2.840.10008.6.1.1325"
    }
  ],
  "version": "20230904",
  "name": "RadiotherapyTreatmentInterlock",
  "status": "active",
  "experimental": false,
  "date": "2024-06-17",
  "publisher": "NEMA MITA DICOM",
  "description": "Transitive closure of CID 9568 RadiotherapyTreatmentInterlock",
  "copyright": "© 2024 NEMA",
  "compose": {
    "include": [
      {
        "system": "http://dicom.nema.org/resources/ontology/DCM",
        "concept": [
          {
            "code": "130476",
            "display": "Secondary Fluence Monitoring System Interlock"
          },
          {
            "code": "130740",
            "display": "Machine Clearance Interlock"
          },
          {
            "code": "130475",
            "display": "Primary Fluence Monitoring System Interlock"
          },
          {
            "code": "130479",
            "display": "Patient Motion Interlock"
          },
          {
            "code": "130743",
            "display": "Out of Tolerance Interlock"
          },
          {
            "code": "130831",
            "display": "Beam Energy Interlock"
          },
          {
            "code": "130478",
            "display": "Door Interlock"
          },
          {
            "code": "130742",
            "display": "Accessory Clearance Interlock"
          },
          {
            "code": "130830",
            "display": "Meterset Rate Interlock"
          },
          {
            "code": "130477",
            "display": "Timer Interlock"
          },
          {
            "code": "130741",
            "display": "Patient Clearance Interlock"
          },
          {
            "code": "130825",
            "display": "Scan Spot Position Interlock"
          },
          {
            "code": "130824",
            "display": "Scan Spot Interlock"
          },
          {
            "code": "130829",
            "display": "MLC Position Interlock"
          },
          {
            "code": "130828",
            "display": "Radiation Detected During Beam Hold Interlock"
          },
          {
            "code": "130739",
            "display": "Clearance Interlock"
          },
          {
            "code": "130827",
            "display": "Scan Spot Meterset Interlock"
          },
          {
            "code": "130738",
            "display": "Dose Limit Interlock"
          },
          {
            "code": "130826",
            "display": "Scan Spot Size Interlock"
          }
        ]
      }
    ]
  },
  "meta": {
    "tag": [
      {
        "system": "https://mii-termserv.de/fhir/su-termserv/CodeSystem/mii-cs-suts-resource-tags-project",
        "code": "dicom",
        "display": "Digital Imaging and Communications in Medicine"
      },
      {
        "system": "https://mii-termserv.de/fhir/su-termserv/CodeSystem/mii-cs-suts-resource-tags-project",
        "code": "international",
        "display": "International standard terminology"
      },
      {
        "system": "https://mii-termserv.de/fhir/su-termserv/CodeSystem/mii-cs-suts-resource-tags-dataset",
        "code": "dicom",
        "display": "DICOM Terminology"
      },
      {
        "system": "https://mii-termserv.de/fhir/su-termserv/CodeSystem/mii-cs-suts-resource-tags-dataset",
        "code": "standard",
        "display": "International Standards"
      },
      {
        "system": "https://mii-termserv.de/fhir/su-termserv/CodeSystem/mii-cs-suts-resource-tags-license",
        "code": "https://mii-termserv.de/licenses#dicom",
        "display": "DICOM license"
      }
    ]
  },
  "title": "RadiotherapyTreatmentInterlock",
  "text": {
    "status": "generated",
    "div": "<div xmlns=\"http://www.w3.org/1999/xhtml\"><h2>RadiotherapyTreatmentInterlock</h2><tt>http://dicom.nema.org/medical/dicom/current/output/chtml/part16/sect_CID_9568.html</tt><p>Transitive closure of CID 9568 RadiotherapyTreatmentInterlock</p><div><p><b>SU-TermServ Metadata</b></p><table><tbody><tr><td><b>Projects</b></td><td><ul><li>Digital Imaging and Communications in Medicine</li><li>International standard terminology</li></ul></td></tr><tr><td><b>Datasets</b></td><td><ul><li>DICOM Terminology</li><li>International Standards</li></ul></td></tr><tr><td><b>License</b></td><td><a href=\"https://mii-termserv.de/licenses#dicom\">DICOM license</a></td></tr><tr><td><b>Package Scope</b></td><td><a href=\"https://gitlab.com/groups/mii-termserv/fhir-resources/-/packages/?ForderBy%3Dversion%26sort%3Ddesc%26search%5B%5D%3D@mii-termserv/dicom.terminology\"><code>@mii-termserv/dicom.terminology</code></a></td></tr></tbody></table></div></div>"
  },
  "extension": [
    {
      "url": "http://hl7.org/fhir/StructureDefinition/cqf-scope",
      "valueString": "@mii-termserv/dicom.terminology"
    }
  ]
}