{
  "resourceType": "ValueSet",
  "id": "dicom-cid-3230-ECGFinding",
  "url": "http://dicom.nema.org/medical/dicom/current/output/chtml/part16/sect_CID_3230.html",
  "identifier": [
    {
      "system": "urn:ietf:rfc:3986",
      "value": "urn:oid:1.2.840.10008.6.1.776"
    }
  ],
  "version": "20230630",
  "name": "ECGFinding",
  "status": "active",
  "experimental": false,
  "date": "2024-06-17",
  "publisher": "NEMA MITA DICOM",
  "description": "Transitive closure of CID 3230 ECGFinding",
  "copyright": "© 2024 NEMA",
  "compose": {
    "include": [
      {
        "system": "http://snomed.info/sct",
        "concept": [
          {
            "code": "71908006",
            "display": "Ventricular fibrillation"
          },
          {
            "code": "195060002",
            "display": "Ventricular pre-excitation"
          },
          {
            "code": "284470004",
            "display": "Atrial premature contraction"
          },
          {
            "code": "26141007",
            "display": "ST depression"
          },
          {
            "code": "59118001",
            "display": "Right bundle branch block"
          },
          {
            "code": "195042002",
            "display": "Second degree Atrioventricular block"
          },
          {
            "code": "251175005",
            "display": "Ventricular premature contraction"
          },
          {
            "code": "27885002",
            "display": "Third degree Atrioventricular block"
          },
          {
            "code": "428549008",
            "display": "Secondary ST-T abnormality"
          },
          {
            "code": "164854000",
            "display": "Normal"
          },
          {
            "code": "428417006",
            "display": "Early repolarization"
          },
          {
            "code": "66657009",
            "display": "Non-sustained ventricular tachycardia"
          },
          {
            "code": "4554005",
            "display": "Intraventricular conduction disturbance"
          },
          {
            "code": "49436004",
            "display": "Atrial Fibrillation"
          },
          {
            "code": "74021003",
            "display": "Bifascicular Block"
          },
          {
            "code": "25569003",
            "display": "Ventricular tachycardia"
          },
          {
            "code": "76388001",
            "display": "ST elevation"
          },
          {
            "code": "6456007",
            "display": "Supraventricular Tachycardia"
          },
          {
            "code": "37760005",
            "display": "Left anterior fascicular block"
          },
          {
            "code": "251124007",
            "display": "Incomplete Right bundle branch block"
          },
          {
            "code": "63467002",
            "display": "Left bundle branch block"
          },
          {
            "code": "251120003",
            "display": "Incomplete Left bundle branch block"
          },
          {
            "code": "270492004",
            "display": "First degree Atrioventricular block"
          },
          {
            "code": "428750005",
            "display": "Nonspecific ST-T abnormality"
          },
          {
            "code": "62026008",
            "display": "Left posterior fascicular block"
          }
        ]
      }
    ]
  },
  "meta": {
    "tag": [
      {
        "system": "https://mii-termserv.de/fhir/su-termserv/CodeSystem/mii-cs-suts-resource-tags-project",
        "code": "dicom",
        "display": "Digital Imaging and Communications in Medicine"
      },
      {
        "system": "https://mii-termserv.de/fhir/su-termserv/CodeSystem/mii-cs-suts-resource-tags-project",
        "code": "international",
        "display": "International standard terminology"
      },
      {
        "system": "https://mii-termserv.de/fhir/su-termserv/CodeSystem/mii-cs-suts-resource-tags-dataset",
        "code": "dicom",
        "display": "DICOM Terminology"
      },
      {
        "system": "https://mii-termserv.de/fhir/su-termserv/CodeSystem/mii-cs-suts-resource-tags-dataset",
        "code": "standard",
        "display": "International Standards"
      },
      {
        "system": "https://mii-termserv.de/fhir/su-termserv/CodeSystem/mii-cs-suts-resource-tags-license",
        "code": "https://mii-termserv.de/licenses#dicom",
        "display": "DICOM license"
      }
    ]
  },
  "title": "ECGFinding",
  "text": {
    "status": "generated",
    "div": "<div xmlns=\"http://www.w3.org/1999/xhtml\"><h2>ECGFinding</h2><tt>http://dicom.nema.org/medical/dicom/current/output/chtml/part16/sect_CID_3230.html</tt><p>Transitive closure of CID 3230 ECGFinding</p><div><p><b>SU-TermServ Metadata</b></p><table><tbody><tr><td><b>Projects</b></td><td><ul><li>Digital Imaging and Communications in Medicine</li><li>International standard terminology</li></ul></td></tr><tr><td><b>Datasets</b></td><td><ul><li>DICOM Terminology</li><li>International Standards</li></ul></td></tr><tr><td><b>License</b></td><td><a href=\"https://mii-termserv.de/licenses#dicom\">DICOM license</a></td></tr><tr><td><b>Package Scope</b></td><td><a href=\"https://gitlab.com/groups/mii-termserv/fhir-resources/-/packages/?ForderBy%3Dversion%26sort%3Ddesc%26search%5B%5D%3D@mii-termserv/dicom.terminology\"><code>@mii-termserv/dicom.terminology</code></a></td></tr></tbody></table></div></div>"
  },
  "extension": [
    {
      "url": "http://hl7.org/fhir/StructureDefinition/cqf-scope",
      "valueString": "@mii-termserv/dicom.terminology"
    }
  ]
}