{
  "resourceType": "ValueSet",
  "id": "dicom-cid-12321-ElastographySite",
  "url": "http://dicom.nema.org/medical/dicom/current/output/chtml/part16/sect_CID_12321.html",
  "identifier": [
    {
      "system": "urn:ietf:rfc:3986",
      "value": "urn:oid:1.2.840.10008.6.1.1448"
    }
  ],
  "version": "20220628",
  "name": "ElastographySite",
  "status": "active",
  "experimental": false,
  "date": "2024-06-17",
  "publisher": "NEMA MITA DICOM",
  "description": "Transitive closure of CID 12321 ElastographySite",
  "copyright": "© 2024 NEMA",
  "compose": {
    "include": [
      {
        "system": "http://snomed.info/sct",
        "concept": [
          {
            "code": "40689003",
            "display": "Testis"
          },
          {
            "code": "15776009",
            "display": "Pancreas"
          },
          {
            "code": "10200004",
            "display": "Liver"
          },
          {
            "code": "41216001",
            "display": "Prostate"
          },
          {
            "code": "245100002",
            "display": "Tendon of Rotator Cuff of Shoulder"
          },
          {
            "code": "69748006",
            "display": "Thyroid"
          },
          {
            "code": "76752008",
            "display": "Breast"
          },
          {
            "code": "78961009",
            "display": "Spleen"
          },
          {
            "code": "64033007",
            "display": "Kidney"
          },
          {
            "code": "18033002",
            "display": "Patellar Tendon"
          },
          {
            "code": "61352006",
            "display": "Achilles Tendon"
          }
        ]
      }
    ]
  },
  "meta": {
    "tag": [
      {
        "system": "https://mii-termserv.de/fhir/su-termserv/CodeSystem/mii-cs-suts-resource-tags-project",
        "code": "dicom",
        "display": "Digital Imaging and Communications in Medicine"
      },
      {
        "system": "https://mii-termserv.de/fhir/su-termserv/CodeSystem/mii-cs-suts-resource-tags-project",
        "code": "international",
        "display": "International standard terminology"
      },
      {
        "system": "https://mii-termserv.de/fhir/su-termserv/CodeSystem/mii-cs-suts-resource-tags-dataset",
        "code": "dicom",
        "display": "DICOM Terminology"
      },
      {
        "system": "https://mii-termserv.de/fhir/su-termserv/CodeSystem/mii-cs-suts-resource-tags-dataset",
        "code": "standard",
        "display": "International Standards"
      },
      {
        "system": "https://mii-termserv.de/fhir/su-termserv/CodeSystem/mii-cs-suts-resource-tags-license",
        "code": "https://mii-termserv.de/licenses#dicom",
        "display": "DICOM license"
      }
    ]
  },
  "title": "ElastographySite",
  "text": {
    "status": "generated",
    "div": "<div xmlns=\"http://www.w3.org/1999/xhtml\"><h2>ElastographySite</h2><tt>http://dicom.nema.org/medical/dicom/current/output/chtml/part16/sect_CID_12321.html</tt><p>Transitive closure of CID 12321 ElastographySite</p><div><p><b>SU-TermServ Metadata</b></p><table><tbody><tr><td><b>Projects</b></td><td><ul><li>Digital Imaging and Communications in Medicine</li><li>International standard terminology</li></ul></td></tr><tr><td><b>Datasets</b></td><td><ul><li>DICOM Terminology</li><li>International Standards</li></ul></td></tr><tr><td><b>License</b></td><td><a href=\"https://mii-termserv.de/licenses#dicom\">DICOM license</a></td></tr><tr><td><b>Package Scope</b></td><td><a href=\"https://gitlab.com/groups/mii-termserv/fhir-resources/-/packages/?ForderBy%3Dversion%26sort%3Ddesc%26search%5B%5D%3D@mii-termserv/dicom.terminology\"><code>@mii-termserv/dicom.terminology</code></a></td></tr></tbody></table></div></div>"
  },
  "extension": [
    {
      "url": "http://hl7.org/fhir/StructureDefinition/cqf-scope",
      "valueString": "@mii-termserv/dicom.terminology"
    }
  ]
}