{
  "resourceType": "ValueSet",
  "id": "dicom-cid-3664-OxygenConsumptionEquationTable",
  "url": "http://dicom.nema.org/medical/dicom/current/output/chtml/part16/sect_CID_3664.html",
  "identifier": [
    {
      "system": "urn:ietf:rfc:3986",
      "value": "urn:oid:1.2.840.10008.6.1.181"
    }
  ],
  "version": "20030327",
  "name": "OxygenConsumptionEquation/Table",
  "status": "active",
  "experimental": false,
  "date": "2024-06-17",
  "publisher": "NEMA MITA DICOM",
  "description": "Transitive closure of CID 3664 OxygenConsumptionEquation/Table",
  "copyright": "© 2024 NEMA",
  "compose": {
    "include": [
      {
        "system": "http://dicom.nema.org/resources/ontology/DCM",
        "concept": [
          {
            "code": "122249",
            "display": "VO2 = VeSTPD * 10 * (FIO2 - FE02)"
          },
          {
            "code": "122247",
            "display": "VO2male = BSA (138.1 - 11.49 * loge(age) + 0.378*HRf)"
          },
          {
            "code": "122248",
            "display": "VO2female = BSA (138.1 - 17.04 * loge(age) + 0.378*HRf)"
          },
          {
            "code": "122254",
            "display": "Fleisch table"
          },
          {
            "code": "122255",
            "display": "Boothby table"
          },
          {
            "code": "122252",
            "display": "VO2 = 176 * BSA"
          },
          {
            "code": "122253",
            "display": "Robertson & Reid table"
          },
          {
            "code": "122250",
            "display": "VO2 = 152 * BSA"
          },
          {
            "code": "122251",
            "display": "VO2 = 175 * BSA"
          }
        ]
      }
    ]
  },
  "meta": {
    "tag": [
      {
        "system": "https://mii-termserv.de/fhir/su-termserv/CodeSystem/mii-cs-suts-resource-tags-project",
        "code": "dicom",
        "display": "Digital Imaging and Communications in Medicine"
      },
      {
        "system": "https://mii-termserv.de/fhir/su-termserv/CodeSystem/mii-cs-suts-resource-tags-project",
        "code": "international",
        "display": "International standard terminology"
      },
      {
        "system": "https://mii-termserv.de/fhir/su-termserv/CodeSystem/mii-cs-suts-resource-tags-dataset",
        "code": "dicom",
        "display": "DICOM Terminology"
      },
      {
        "system": "https://mii-termserv.de/fhir/su-termserv/CodeSystem/mii-cs-suts-resource-tags-dataset",
        "code": "standard",
        "display": "International Standards"
      },
      {
        "system": "https://mii-termserv.de/fhir/su-termserv/CodeSystem/mii-cs-suts-resource-tags-license",
        "code": "https://mii-termserv.de/licenses#dicom",
        "display": "DICOM license"
      }
    ]
  },
  "title": "OxygenConsumptionEquation/Table",
  "text": {
    "status": "generated",
    "div": "<div xmlns=\"http://www.w3.org/1999/xhtml\"><h2>OxygenConsumptionEquation/Table</h2><tt>http://dicom.nema.org/medical/dicom/current/output/chtml/part16/sect_CID_3664.html</tt><p>Transitive closure of CID 3664 OxygenConsumptionEquation/Table</p><div><p><b>SU-TermServ Metadata</b></p><table><tbody><tr><td><b>Projects</b></td><td><ul><li>Digital Imaging and Communications in Medicine</li><li>International standard terminology</li></ul></td></tr><tr><td><b>Datasets</b></td><td><ul><li>DICOM Terminology</li><li>International Standards</li></ul></td></tr><tr><td><b>License</b></td><td><a href=\"https://mii-termserv.de/licenses#dicom\">DICOM license</a></td></tr><tr><td><b>Package Scope</b></td><td><a href=\"https://gitlab.com/groups/mii-termserv/fhir-resources/-/packages/?ForderBy%3Dversion%26sort%3Ddesc%26search%5B%5D%3D@mii-termserv/dicom.terminology\"><code>@mii-termserv/dicom.terminology</code></a></td></tr></tbody></table></div></div>"
  },
  "extension": [
    {
      "url": "http://hl7.org/fhir/StructureDefinition/cqf-scope",
      "valueString": "@mii-termserv/dicom.terminology"
    }
  ]
}