{
  "resourceType": "ValueSet",
  "id": "dicom-cid-6089-Substance",
  "url": "http://dicom.nema.org/medical/dicom/current/output/chtml/part16/sect_CID_6089.html",
  "identifier": [
    {
      "system": "urn:ietf:rfc:3986",
      "value": "urn:oid:1.2.840.10008.6.1.411"
    }
  ],
  "version": "20160314",
  "name": "Substance",
  "status": "active",
  "experimental": false,
  "date": "2024-06-17",
  "publisher": "NEMA MITA DICOM",
  "description": "Transitive closure of CID 6089 Substance",
  "copyright": "© 2024 NEMA",
  "compose": {
    "include": [
      {
        "system": "http://snomed.info/sct",
        "concept": [
          {
            "code": "15698006",
            "display": "Lysergic acid diethlyamide"
          },
          {
            "code": "373337007",
            "display": "Methlyphenidate"
          },
          {
            "code": "387286002",
            "display": "Methadone"
          },
          {
            "code": "9721008",
            "display": "Phencyclidine"
          },
          {
            "code": "373529000",
            "display": "Morphine"
          },
          {
            "code": "387085005",
            "display": "Cocaine"
          },
          {
            "code": "387341002",
            "display": "Heroin"
          },
          {
            "code": "703842006",
            "display": "Amphetamine"
          },
          {
            "code": "255641001",
            "display": "Caffeine"
          },
          {
            "code": "398705004",
            "display": "Marijuana"
          },
          {
            "code": "419442005",
            "display": "Ethyl alcohol"
          },
          {
            "code": "81911001",
            "display": "Chewing tobacco"
          },
          {
            "code": "66562002",
            "display": "Cigarette smoking tobacco"
          },
          {
            "code": "373780001",
            "display": "Mescaline"
          }
        ]
      }
    ]
  },
  "meta": {
    "tag": [
      {
        "system": "https://mii-termserv.de/fhir/su-termserv/CodeSystem/mii-cs-suts-resource-tags-project",
        "code": "dicom",
        "display": "Digital Imaging and Communications in Medicine"
      },
      {
        "system": "https://mii-termserv.de/fhir/su-termserv/CodeSystem/mii-cs-suts-resource-tags-project",
        "code": "international",
        "display": "International standard terminology"
      },
      {
        "system": "https://mii-termserv.de/fhir/su-termserv/CodeSystem/mii-cs-suts-resource-tags-dataset",
        "code": "dicom",
        "display": "DICOM Terminology"
      },
      {
        "system": "https://mii-termserv.de/fhir/su-termserv/CodeSystem/mii-cs-suts-resource-tags-dataset",
        "code": "standard",
        "display": "International Standards"
      },
      {
        "system": "https://mii-termserv.de/fhir/su-termserv/CodeSystem/mii-cs-suts-resource-tags-license",
        "code": "https://mii-termserv.de/licenses#dicom",
        "display": "DICOM license"
      }
    ]
  },
  "title": "Substance",
  "text": {
    "status": "generated",
    "div": "<div xmlns=\"http://www.w3.org/1999/xhtml\"><h2>Substance</h2><tt>http://dicom.nema.org/medical/dicom/current/output/chtml/part16/sect_CID_6089.html</tt><p>Transitive closure of CID 6089 Substance</p><div><p><b>SU-TermServ Metadata</b></p><table><tbody><tr><td><b>Projects</b></td><td><ul><li>Digital Imaging and Communications in Medicine</li><li>International standard terminology</li></ul></td></tr><tr><td><b>Datasets</b></td><td><ul><li>DICOM Terminology</li><li>International Standards</li></ul></td></tr><tr><td><b>License</b></td><td><a href=\"https://mii-termserv.de/licenses#dicom\">DICOM license</a></td></tr><tr><td><b>Package Scope</b></td><td><a href=\"https://gitlab.com/groups/mii-termserv/fhir-resources/-/packages/?ForderBy%3Dversion%26sort%3Ddesc%26search%5B%5D%3D@mii-termserv/dicom.terminology\"><code>@mii-termserv/dicom.terminology</code></a></td></tr></tbody></table></div></div>"
  },
  "extension": [
    {
      "url": "http://hl7.org/fhir/StructureDefinition/cqf-scope",
      "valueString": "@mii-termserv/dicom.terminology"
    }
  ]
}