{
  "resourceType": "ValueSet",
  "id": "dicom-cid-64-ImagingAgentAdministrationPatientState",
  "url": "http://dicom.nema.org/medical/dicom/current/output/chtml/part16/sect_CID_64.html",
  "identifier": [
    {
      "system": "urn:ietf:rfc:3986",
      "value": "urn:oid:1.2.840.10008.6.1.1254"
    }
  ],
  "version": "20230630",
  "name": "ImagingAgentAdministrationPatientState",
  "status": "active",
  "experimental": false,
  "date": "2024-06-17",
  "publisher": "NEMA MITA DICOM",
  "description": "Transitive closure of CID 64 ImagingAgentAdministrationPatientState",
  "copyright": "© 2024 NEMA",
  "compose": {
    "include": [
      {
        "system": "http://dicom.nema.org/resources/ontology/DCM",
        "concept": [
          {
            "code": "113560",
            "display": "Acute unilateral renal blockage"
          },
          {
            "code": "113561",
            "display": "Low Thyroid Uptake"
          },
          {
            "code": "113562",
            "display": "High Thyroid Uptake"
          },
          {
            "code": "113563",
            "display": "Severely Jaundiced"
          },
          {
            "code": "110503",
            "display": "Patient allergic to media/contrast"
          }
        ]
      },
      {
        "system": "http://snomed.info/sct",
        "concept": [
          {
            "code": "85898001",
            "display": "Cardiomyopathy"
          },
          {
            "code": "448216007",
            "display": "Malignant epithelial neoplasm of thyroid"
          },
          {
            "code": "161501007",
            "display": "History of Hypertension"
          },
          {
            "code": "161445009",
            "display": "History of diabetes mellitus"
          },
          {
            "code": "194828000",
            "display": "Angina pectoris"
          },
          {
            "code": "35601003",
            "display": "Paraproteinemia"
          },
          {
            "code": "161505003",
            "display": "History of congestive heart failure"
          },
          {
            "code": "70995007",
            "display": "Pulmonary hypertension"
          },
          {
            "code": "1162576007",
            "display": "Multiple myeloma"
          },
          {
            "code": "48694002",
            "display": "Anxiety"
          },
          {
            "code": "195967001",
            "display": "Asthma"
          },
          {
            "code": "440935004",
            "display": "History of Beta-blocking agents therapy"
          },
          {
            "code": "414417004",
            "display": "History of renal failure"
          },
          {
            "code": "60573004",
            "display": "Aortic stenosis"
          },
          {
            "code": "39539005",
            "display": "Abnormal Renal Function"
          }
        ]
      }
    ]
  },
  "meta": {
    "tag": [
      {
        "system": "https://mii-termserv.de/fhir/su-termserv/CodeSystem/mii-cs-suts-resource-tags-project",
        "code": "dicom",
        "display": "Digital Imaging and Communications in Medicine"
      },
      {
        "system": "https://mii-termserv.de/fhir/su-termserv/CodeSystem/mii-cs-suts-resource-tags-project",
        "code": "international",
        "display": "International standard terminology"
      },
      {
        "system": "https://mii-termserv.de/fhir/su-termserv/CodeSystem/mii-cs-suts-resource-tags-dataset",
        "code": "dicom",
        "display": "DICOM Terminology"
      },
      {
        "system": "https://mii-termserv.de/fhir/su-termserv/CodeSystem/mii-cs-suts-resource-tags-dataset",
        "code": "standard",
        "display": "International Standards"
      },
      {
        "system": "https://mii-termserv.de/fhir/su-termserv/CodeSystem/mii-cs-suts-resource-tags-license",
        "code": "https://mii-termserv.de/licenses#dicom",
        "display": "DICOM license"
      }
    ]
  },
  "title": "ImagingAgentAdministrationPatientState",
  "text": {
    "status": "generated",
    "div": "<div xmlns=\"http://www.w3.org/1999/xhtml\"><h2>ImagingAgentAdministrationPatientState</h2><tt>http://dicom.nema.org/medical/dicom/current/output/chtml/part16/sect_CID_64.html</tt><p>Transitive closure of CID 64 ImagingAgentAdministrationPatientState</p><div><p><b>SU-TermServ Metadata</b></p><table><tbody><tr><td><b>Projects</b></td><td><ul><li>Digital Imaging and Communications in Medicine</li><li>International standard terminology</li></ul></td></tr><tr><td><b>Datasets</b></td><td><ul><li>DICOM Terminology</li><li>International Standards</li></ul></td></tr><tr><td><b>License</b></td><td><a href=\"https://mii-termserv.de/licenses#dicom\">DICOM license</a></td></tr><tr><td><b>Package Scope</b></td><td><a href=\"https://gitlab.com/groups/mii-termserv/fhir-resources/-/packages/?ForderBy%3Dversion%26sort%3Ddesc%26search%5B%5D%3D@mii-termserv/dicom.terminology\"><code>@mii-termserv/dicom.terminology</code></a></td></tr></tbody></table></div></div>"
  },
  "extension": [
    {
      "url": "http://hl7.org/fhir/StructureDefinition/cqf-scope",
      "valueString": "@mii-termserv/dicom.terminology"
    }
  ]
}