{
  "resourceType": "ValueSet",
  "id": "dicom-cid-12247-PediatricFetalAndCongenitalCardiacSurgicalInterv",
  "url": "http://dicom.nema.org/medical/dicom/current/output/chtml/part16/sect_CID_12247.html",
  "identifier": [
    {
      "system": "urn:ietf:rfc:3986",
      "value": "urn:oid:1.2.840.10008.6.1.828"
    }
  ],
  "version": "20160314",
  "name": "Pediatric,FetalandCongenitalCardiacSurgicalIntervention",
  "status": "active",
  "experimental": false,
  "date": "2024-06-17",
  "publisher": "NEMA MITA DICOM",
  "description": "Transitive closure of CID 12247 Pediatric,FetalandCongenitalCardiacSurgicalIntervention",
  "copyright": "© 2024 NEMA",
  "compose": {
    "include": [
      {
        "system": "http://snomed.info/sct",
        "concept": [
          {
            "code": "44777001",
            "display": "Rastelli operation"
          },
          {
            "code": "233022006",
            "display": "Creation of conduit right atrium to pulmonary trunk"
          },
          {
            "code": "444034006",
            "display": "Right-sided bidirectional Glenn shunt procedure"
          },
          {
            "code": "443989003",
            "display": "Left-sided bidirectional Glenn shunt procedure"
          },
          {
            "code": "37153009",
            "display": "Implantation of heart valve with tissue graft"
          },
          {
            "code": "13662000",
            "display": "Blalock-Taussig shunt, pulmonary-subclavian artery anastomosis"
          },
          {
            "code": "233230003",
            "display": "Hemi-Fontan operation"
          },
          {
            "code": "233139006",
            "display": "Norwood type operation"
          },
          {
            "code": "1179121008",
            "display": "Insertion of atrial baffle"
          },
          {
            "code": "441676000",
            "display": "Patent ductus arteriosus coil or device closure"
          },
          {
            "code": "174900004",
            "display": "Partial anomalous pulmonary venous connection operation"
          },
          {
            "code": "233224003",
            "display": "Central aortopulmonary shunt operation"
          },
          {
            "code": "47432005",
            "display": "Implantation of heart valve prosthesis or synthetic device"
          },
          {
            "code": "274022008",
            "display": "Repair of coarctation of aorta"
          },
          {
            "code": "429620002",
            "display": "Construction of LV to aorta tunnel w RV to PA valved conduit"
          },
          {
            "code": "174830006",
            "display": "Repair of total anomalous pulmonary venous connection"
          },
          {
            "code": "261537001",
            "display": "Insertion of interatrial baffle"
          },
          {
            "code": "30123000",
            "display": "Percutaneous prosthetic closure of atrial septal defect"
          },
          {
            "code": "443829004",
            "display": "Coarctation of the Aorta Angioplasty with Implant of Stent"
          },
          {
            "code": "89814007",
            "display": "Ventricular septal defect device closure"
          },
          {
            "code": "429616001",
            "display": "Radical aortopulmonary reconstruct w RV to PA valveless conduit"
          },
          {
            "code": "174826008",
            "display": "Arterial switch operation"
          },
          {
            "code": "308696000",
            "display": "Coarctation of the Aorta Balloon Angioplasty"
          },
          {
            "code": "233134001",
            "display": "Damus-Stansel-Kaye operation"
          },
          {
            "code": "233199008",
            "display": "Closure of ductus arteriosus with clip"
          },
          {
            "code": "174822005",
            "display": "Atrial inversion operation using atrial wall"
          },
          {
            "code": "444001009",
            "display": "Right Glenn shunt procedure"
          },
          {
            "code": "427886002",
            "display": "Lateral-Caval Fontan procedure"
          },
          {
            "code": "442123009",
            "display": "Sano procedure"
          },
          {
            "code": "174836000",
            "display": "Repair of defect of the atrioventricular septum"
          },
          {
            "code": "76025005",
            "display": "Correction of ventricular septal defect"
          },
          {
            "code": "112811009",
            "display": "Atrial septal defect repair"
          },
          {
            "code": "40250003",
            "display": "Mustard operation"
          },
          {
            "code": "444178004",
            "display": "Left Glenn shunt procedure"
          }
        ]
      }
    ]
  },
  "meta": {
    "tag": [
      {
        "system": "https://mii-termserv.de/fhir/su-termserv/CodeSystem/mii-cs-suts-resource-tags-project",
        "code": "dicom",
        "display": "Digital Imaging and Communications in Medicine"
      },
      {
        "system": "https://mii-termserv.de/fhir/su-termserv/CodeSystem/mii-cs-suts-resource-tags-project",
        "code": "international",
        "display": "International standard terminology"
      },
      {
        "system": "https://mii-termserv.de/fhir/su-termserv/CodeSystem/mii-cs-suts-resource-tags-dataset",
        "code": "dicom",
        "display": "DICOM Terminology"
      },
      {
        "system": "https://mii-termserv.de/fhir/su-termserv/CodeSystem/mii-cs-suts-resource-tags-dataset",
        "code": "standard",
        "display": "International Standards"
      },
      {
        "system": "https://mii-termserv.de/fhir/su-termserv/CodeSystem/mii-cs-suts-resource-tags-license",
        "code": "https://mii-termserv.de/licenses#dicom",
        "display": "DICOM license"
      }
    ]
  },
  "title": "Pediatric,FetalandCongenitalCardiacSurgicalIntervention",
  "text": {
    "status": "generated",
    "div": "<div xmlns=\"http://www.w3.org/1999/xhtml\"><h2>Pediatric,FetalandCongenitalCardiacSurgicalIntervention</h2><tt>http://dicom.nema.org/medical/dicom/current/output/chtml/part16/sect_CID_12247.html</tt><p>Transitive closure of CID 12247 Pediatric,FetalandCongenitalCardiacSurgicalIntervention</p><div><p><b>SU-TermServ Metadata</b></p><table><tbody><tr><td><b>Projects</b></td><td><ul><li>Digital Imaging and Communications in Medicine</li><li>International standard terminology</li></ul></td></tr><tr><td><b>Datasets</b></td><td><ul><li>DICOM Terminology</li><li>International Standards</li></ul></td></tr><tr><td><b>License</b></td><td><a href=\"https://mii-termserv.de/licenses#dicom\">DICOM license</a></td></tr><tr><td><b>Package Scope</b></td><td><a href=\"https://gitlab.com/groups/mii-termserv/fhir-resources/-/packages/?ForderBy%3Dversion%26sort%3Ddesc%26search%5B%5D%3D@mii-termserv/dicom.terminology\"><code>@mii-termserv/dicom.terminology</code></a></td></tr></tbody></table></div></div>"
  },
  "extension": [
    {
      "url": "http://hl7.org/fhir/StructureDefinition/cqf-scope",
      "valueString": "@mii-termserv/dicom.terminology"
    }
  ]
}