{
  "resourceType": "ValueSet",
  "id": "dicom-cid-9555-RadiotherapyTreatmentPlanningPersonRole",
  "url": "http://dicom.nema.org/medical/dicom/current/output/chtml/part16/sect_CID_9555.html",
  "identifier": [
    {
      "system": "urn:ietf:rfc:3986",
      "value": "urn:oid:1.2.840.10008.6.1.1302"
    }
  ],
  "version": "20190715",
  "name": "RadiotherapyTreatmentPlanningPersonRole",
  "status": "active",
  "experimental": false,
  "date": "2024-06-17",
  "publisher": "NEMA MITA DICOM",
  "description": "Transitive closure of CID 9555 RadiotherapyTreatmentPlanningPersonRole",
  "copyright": "© 2024 NEMA",
  "compose": {
    "include": [
      {
        "system": "http://dicom.nema.org/resources/ontology/DCM",
        "concept": [
          {
            "code": "128678",
            "display": "Physics Assistant"
          }
        ]
      },
      {
        "system": "http://ncit.nci.nih.gov",
        "concept": [
          {
            "code": "C93176",
            "display": "Dosimetrist"
          }
        ]
      },
      {
        "system": "http://snomed.info/sct",
        "concept": [
          {
            "code": "405277009",
            "display": "Resident"
          },
          {
            "code": "158965000",
            "display": "Medical Practitioner"
          },
          {
            "code": "309343006",
            "display": "Physician"
          }
        ]
      },
      {
        "system": "http://www.nlm.nih.gov/research/umls",
        "concept": [
          {
            "code": "C1441532",
            "display": "Consulting Physician"
          },
          {
            "code": "C2985483",
            "display": "Radiation Physicist"
          },
          {
            "code": "C1708969",
            "display": "Medical Physicist"
          }
        ]
      }
    ]
  },
  "meta": {
    "tag": [
      {
        "system": "https://mii-termserv.de/fhir/su-termserv/CodeSystem/mii-cs-suts-resource-tags-project",
        "code": "dicom",
        "display": "Digital Imaging and Communications in Medicine"
      },
      {
        "system": "https://mii-termserv.de/fhir/su-termserv/CodeSystem/mii-cs-suts-resource-tags-project",
        "code": "international",
        "display": "International standard terminology"
      },
      {
        "system": "https://mii-termserv.de/fhir/su-termserv/CodeSystem/mii-cs-suts-resource-tags-dataset",
        "code": "dicom",
        "display": "DICOM Terminology"
      },
      {
        "system": "https://mii-termserv.de/fhir/su-termserv/CodeSystem/mii-cs-suts-resource-tags-dataset",
        "code": "standard",
        "display": "International Standards"
      },
      {
        "system": "https://mii-termserv.de/fhir/su-termserv/CodeSystem/mii-cs-suts-resource-tags-license",
        "code": "https://mii-termserv.de/licenses#dicom",
        "display": "DICOM license"
      }
    ]
  },
  "title": "RadiotherapyTreatmentPlanningPersonRole",
  "text": {
    "status": "generated",
    "div": "<div xmlns=\"http://www.w3.org/1999/xhtml\"><h2>RadiotherapyTreatmentPlanningPersonRole</h2><tt>http://dicom.nema.org/medical/dicom/current/output/chtml/part16/sect_CID_9555.html</tt><p>Transitive closure of CID 9555 RadiotherapyTreatmentPlanningPersonRole</p><div><p><b>SU-TermServ Metadata</b></p><table><tbody><tr><td><b>Projects</b></td><td><ul><li>Digital Imaging and Communications in Medicine</li><li>International standard terminology</li></ul></td></tr><tr><td><b>Datasets</b></td><td><ul><li>DICOM Terminology</li><li>International Standards</li></ul></td></tr><tr><td><b>License</b></td><td><a href=\"https://mii-termserv.de/licenses#dicom\">DICOM license</a></td></tr><tr><td><b>Package Scope</b></td><td><a href=\"https://gitlab.com/groups/mii-termserv/fhir-resources/-/packages/?ForderBy%3Dversion%26sort%3Ddesc%26search%5B%5D%3D@mii-termserv/dicom.terminology\"><code>@mii-termserv/dicom.terminology</code></a></td></tr></tbody></table></div></div>"
  },
  "extension": [
    {
      "url": "http://hl7.org/fhir/StructureDefinition/cqf-scope",
      "valueString": "@mii-termserv/dicom.terminology"
    }
  ]
}