{
  "resourceType": "ValueSet",
  "id": "dicom-cid-622-MedicationTypeCodeTypeFromAnesthesiaQualityInitiat",
  "url": "http://dicom.nema.org/medical/dicom/current/output/chtml/part16/sect_CID_622.html",
  "identifier": [
    {
      "system": "urn:ietf:rfc:3986",
      "value": "urn:oid:1.2.840.10008.6.1.1087"
    }
  ],
  "version": "20220922",
  "name": "MedicationTypeCodeTypefromAnesthesiaQualityInitiative",
  "status": "active",
  "experimental": false,
  "date": "2024-06-17",
  "publisher": "NEMA MITA DICOM",
  "description": "Transitive closure of CID 622 MedicationTypeCodeTypefromAnesthesiaQualityInitiative",
  "copyright": "© 2024 NEMA",
  "compose": {
    "include": [
      {
        "system": "http://snomed.info/sct",
        "concept": [
          {
            "code": "373530005",
            "display": "Caloric agent"
          },
          {
            "code": "396345004",
            "display": "Carbapenem antibiotic"
          },
          {
            "code": "373297006",
            "display": "Beta-Lactam antibiotic"
          },
          {
            "code": "14443002",
            "display": "Aminoglycoside antibiotic"
          },
          {
            "code": "88480006",
            "display": "Potassium"
          },
          {
            "code": "373477003",
            "display": "Local anesthetic"
          },
          {
            "code": "372862008",
            "display": "Anticoagulant"
          },
          {
            "code": "373270004",
            "display": "Penicillin antibiotic"
          },
          {
            "code": "18220004",
            "display": "Thyroid hormone"
          },
          {
            "code": "372602008",
            "display": "Metronidazole antibiotic"
          },
          {
            "code": "5540006",
            "display": "Calcium"
          },
          {
            "code": "72717003",
            "display": "Magnesium"
          },
          {
            "code": "77671006",
            "display": "Antidiuretic hormone"
          },
          {
            "code": "410937004",
            "display": "Oxytocic"
          },
          {
            "code": "111139005",
            "display": "Inotropic agent"
          },
          {
            "code": "372813008",
            "display": "Antiarrhythmic"
          },
          {
            "code": "372798009",
            "display": "Barbiturate"
          },
          {
            "code": "372664007",
            "display": "Benzodiazepine"
          },
          {
            "code": "1052201004",
            "display": "Estrogen"
          },
          {
            "code": "96328007",
            "display": "Decongestant"
          },
          {
            "code": "372788003",
            "display": "Sulfonamide antibiotic"
          },
          {
            "code": "470091001",
            "display": "Ocular Lubricant"
          },
          {
            "code": "372695000",
            "display": "Diuretic"
          },
          {
            "code": "372735009",
            "display": "Vancomycin antibiotic"
          },
          {
            "code": "373219008",
            "display": "Antifungal"
          },
          {
            "code": "312064005",
            "display": "Hypoglycemic"
          },
          {
            "code": "116566001",
            "display": "Steroid"
          },
          {
            "code": "764147003",
            "display": "Cephalosporin antibiotic"
          },
          {
            "code": "373294004",
            "display": "Low Molecular Weight Heparin"
          },
          {
            "code": "418760000",
            "display": "Respiratory stimulant"
          },
          {
            "code": "373246003",
            "display": "Anticholinergic"
          },
          {
            "code": "372790002",
            "display": "NeuroMuscular Blocking (NMB) - non depolarizing"
          },
          {
            "code": "74626007",
            "display": "Drug diluent"
          },
          {
            "code": "373288007",
            "display": "General anesthetic"
          },
          {
            "code": "372681003",
            "display": "Hemostatic agent"
          },
          {
            "code": "372480009",
            "display": "Macrolide antibiotic"
          },
          {
            "code": "1182007",
            "display": "Antihypertensive"
          },
          {
            "code": "255631004",
            "display": "Antibiotic"
          },
          {
            "code": "372806008",
            "display": "Antihistamine"
          },
          {
            "code": "86308005",
            "display": "Adrenergic agent"
          },
          {
            "code": "372722000",
            "display": "Quinolone antibiotic"
          },
          {
            "code": "372665008",
            "display": "NSAID"
          },
          {
            "code": "87708000",
            "display": "Vitamin"
          },
          {
            "code": "52017007",
            "display": "Antiemetic"
          },
          {
            "code": "410652009",
            "display": "Blood product"
          },
          {
            "code": "3361000",
            "display": "Anti-heparin agent"
          },
          {
            "code": "372787008",
            "display": "Vasodilator"
          },
          {
            "code": "372906009",
            "display": "Benzodiazepine antagonist"
          },
          {
            "code": "373304005",
            "display": "Calcium channel blocker"
          },
          {
            "code": "421148003",
            "display": "Cholinergic agent"
          },
          {
            "code": "372578001",
            "display": "Plasma Expander"
          },
          {
            "code": "255632006",
            "display": "Anticonvulsant"
          },
          {
            "code": "373254001",
            "display": "Beta-blocker"
          },
          {
            "code": "372580007",
            "display": "Bronchodilator"
          },
          {
            "code": "373206009",
            "display": "Tetracycline antibiotic"
          },
          {
            "code": "372666009",
            "display": "Skeletal muscle relaxant"
          },
          {
            "code": "372656001",
            "display": "Narcotic (opiate) antagonist"
          },
          {
            "code": "372677003",
            "display": "Lincomycin antibiotic"
          },
          {
            "code": "373250005",
            "display": "NeuroMuscular Blocking (NMB) - depolarizing"
          },
          {
            "code": "870406003",
            "display": "Vasoconstrictor"
          },
          {
            "code": "387056004",
            "display": "Linezolid antibiotic"
          },
          {
            "code": "372607002",
            "display": "Gastrointestinal prokinetic"
          },
          {
            "code": "373265006",
            "display": "Analgesic"
          }
        ]
      },
      {
        "system": "http://www.nlm.nih.gov/research/umls",
        "concept": [
          {
            "code": "C0019593",
            "display": "H2 antagonist"
          },
          {
            "code": "C0027409",
            "display": "Narcotic analgesic"
          },
          {
            "code": "C1579431",
            "display": "Antihypoglycemic"
          }
        ]
      }
    ]
  },
  "meta": {
    "tag": [
      {
        "system": "https://mii-termserv.de/fhir/su-termserv/CodeSystem/mii-cs-suts-resource-tags-project",
        "code": "dicom",
        "display": "Digital Imaging and Communications in Medicine"
      },
      {
        "system": "https://mii-termserv.de/fhir/su-termserv/CodeSystem/mii-cs-suts-resource-tags-project",
        "code": "international",
        "display": "International standard terminology"
      },
      {
        "system": "https://mii-termserv.de/fhir/su-termserv/CodeSystem/mii-cs-suts-resource-tags-dataset",
        "code": "dicom",
        "display": "DICOM Terminology"
      },
      {
        "system": "https://mii-termserv.de/fhir/su-termserv/CodeSystem/mii-cs-suts-resource-tags-dataset",
        "code": "standard",
        "display": "International Standards"
      },
      {
        "system": "https://mii-termserv.de/fhir/su-termserv/CodeSystem/mii-cs-suts-resource-tags-license",
        "code": "https://mii-termserv.de/licenses#dicom",
        "display": "DICOM license"
      }
    ]
  },
  "title": "MedicationTypeCodeTypefromAnesthesiaQualityInitiative",
  "text": {
    "status": "generated",
    "div": "<div xmlns=\"http://www.w3.org/1999/xhtml\"><h2>MedicationTypeCodeTypefromAnesthesiaQualityInitiative</h2><tt>http://dicom.nema.org/medical/dicom/current/output/chtml/part16/sect_CID_622.html</tt><p>Transitive closure of CID 622 MedicationTypeCodeTypefromAnesthesiaQualityInitiative</p><div><p><b>SU-TermServ Metadata</b></p><table><tbody><tr><td><b>Projects</b></td><td><ul><li>Digital Imaging and Communications in Medicine</li><li>International standard terminology</li></ul></td></tr><tr><td><b>Datasets</b></td><td><ul><li>DICOM Terminology</li><li>International Standards</li></ul></td></tr><tr><td><b>License</b></td><td><a href=\"https://mii-termserv.de/licenses#dicom\">DICOM license</a></td></tr><tr><td><b>Package Scope</b></td><td><a href=\"https://gitlab.com/groups/mii-termserv/fhir-resources/-/packages/?ForderBy%3Dversion%26sort%3Ddesc%26search%5B%5D%3D@mii-termserv/dicom.terminology\"><code>@mii-termserv/dicom.terminology</code></a></td></tr></tbody></table></div></div>"
  },
  "extension": [
    {
      "url": "http://hl7.org/fhir/StructureDefinition/cqf-scope",
      "valueString": "@mii-termserv/dicom.terminology"
    }
  ]
}