{
  "resourceType": "ValueSet",
  "id": "dicom-cid-10044-RadiosensitiveOrgan",
  "url": "http://dicom.nema.org/medical/dicom/current/output/chtml/part16/sect_CID_10044.html",
  "identifier": [
    {
      "system": "urn:ietf:rfc:3986",
      "value": "urn:oid:1.2.840.10008.6.1.976"
    }
  ],
  "version": "20170914",
  "name": "RadiosensitiveOrgan",
  "status": "active",
  "experimental": false,
  "date": "2024-06-17",
  "publisher": "NEMA MITA DICOM",
  "description": "Transitive closure of CID 10044 RadiosensitiveOrgan",
  "copyright": "© 2024 NEMA",
  "compose": {
    "include": [
      {
        "system": "http://snomed.info/sct",
        "concept": [
          {
            "code": "39607008",
            "display": "Lung"
          },
          {
            "code": "30315005",
            "display": "Small intestine"
          },
          {
            "code": "76752008",
            "display": "Breast"
          },
          {
            "code": "69695003",
            "display": "Stomach"
          },
          {
            "code": "80891009",
            "display": "Heart"
          },
          {
            "code": "39937001",
            "display": "Skin"
          },
          {
            "code": "9875009",
            "display": "Thymus"
          },
          {
            "code": "41216001",
            "display": "Prostate"
          },
          {
            "code": "59441001",
            "display": "Lymph node"
          },
          {
            "code": "71854001",
            "display": "Colon"
          },
          {
            "code": "35039007",
            "display": "Uterus"
          },
          {
            "code": "385294005",
            "display": "Salivary Glands"
          },
          {
            "code": "28231008",
            "display": "Gallbladder"
          },
          {
            "code": "40689003",
            "display": "Testis"
          },
          {
            "code": "32849002",
            "display": "Esophagus"
          },
          {
            "code": "89837001",
            "display": "Bladder"
          },
          {
            "code": "12738006",
            "display": "Brain"
          },
          {
            "code": "78076003",
            "display": "Eye lenses"
          },
          {
            "code": "113277000",
            "display": "Oral mucosa"
          },
          {
            "code": "15497006",
            "display": "Ovary"
          },
          {
            "code": "71616004",
            "display": "Muscle"
          },
          {
            "code": "15776009",
            "display": "Pancreas"
          },
          {
            "code": "14016003",
            "display": "Bone Marrow"
          },
          {
            "code": "10200004",
            "display": "Liver"
          },
          {
            "code": "69748006",
            "display": "Thyroid"
          },
          {
            "code": "78961009",
            "display": "Spleen"
          },
          {
            "code": "64033007",
            "display": "Kidney"
          },
          {
            "code": "23451007",
            "display": "Adrenal gland"
          },
          {
            "code": "425647002",
            "display": "Bone Surface"
          }
        ]
      }
    ]
  },
  "meta": {
    "tag": [
      {
        "system": "https://mii-termserv.de/fhir/su-termserv/CodeSystem/mii-cs-suts-resource-tags-project",
        "code": "dicom",
        "display": "Digital Imaging and Communications in Medicine"
      },
      {
        "system": "https://mii-termserv.de/fhir/su-termserv/CodeSystem/mii-cs-suts-resource-tags-project",
        "code": "international",
        "display": "International standard terminology"
      },
      {
        "system": "https://mii-termserv.de/fhir/su-termserv/CodeSystem/mii-cs-suts-resource-tags-dataset",
        "code": "dicom",
        "display": "DICOM Terminology"
      },
      {
        "system": "https://mii-termserv.de/fhir/su-termserv/CodeSystem/mii-cs-suts-resource-tags-dataset",
        "code": "standard",
        "display": "International Standards"
      },
      {
        "system": "https://mii-termserv.de/fhir/su-termserv/CodeSystem/mii-cs-suts-resource-tags-license",
        "code": "https://mii-termserv.de/licenses#dicom",
        "display": "DICOM license"
      }
    ]
  },
  "title": "RadiosensitiveOrgan",
  "text": {
    "status": "generated",
    "div": "<div xmlns=\"http://www.w3.org/1999/xhtml\"><h2>RadiosensitiveOrgan</h2><tt>http://dicom.nema.org/medical/dicom/current/output/chtml/part16/sect_CID_10044.html</tt><p>Transitive closure of CID 10044 RadiosensitiveOrgan</p><div><p><b>SU-TermServ Metadata</b></p><table><tbody><tr><td><b>Projects</b></td><td><ul><li>Digital Imaging and Communications in Medicine</li><li>International standard terminology</li></ul></td></tr><tr><td><b>Datasets</b></td><td><ul><li>DICOM Terminology</li><li>International Standards</li></ul></td></tr><tr><td><b>License</b></td><td><a href=\"https://mii-termserv.de/licenses#dicom\">DICOM license</a></td></tr><tr><td><b>Package Scope</b></td><td><a href=\"https://gitlab.com/groups/mii-termserv/fhir-resources/-/packages/?ForderBy%3Dversion%26sort%3Ddesc%26search%5B%5D%3D@mii-termserv/dicom.terminology\"><code>@mii-termserv/dicom.terminology</code></a></td></tr></tbody></table></div></div>"
  },
  "extension": [
    {
      "url": "http://hl7.org/fhir/StructureDefinition/cqf-scope",
      "valueString": "@mii-termserv/dicom.terminology"
    }
  ]
}