{
  "resourceType": "ValueSet",
  "id": "dicom-cid-3228-ECGTimingMeasurement",
  "url": "http://dicom.nema.org/medical/dicom/current/output/chtml/part16/sect_CID_3228.html",
  "identifier": [
    {
      "system": "urn:ietf:rfc:3986",
      "value": "urn:oid:1.2.840.10008.6.1.774"
    }
  ],
  "version": "20080927",
  "name": "ECGTimingMeasurement",
  "status": "active",
  "experimental": false,
  "date": "2024-06-17",
  "publisher": "NEMA MITA DICOM",
  "description": "Transitive closure of CID 3228 ECGTimingMeasurement",
  "copyright": "© 2024 NEMA",
  "compose": {
    "include": [
      {
        "system": "urn:iso:std:iso:11073:10101",
        "concept": [
          {
            "code": "2:16184",
            "display": "P duration global"
          },
          {
            "code": "2:16140",
            "display": "PP interval global"
          },
          {
            "code": "2:32768",
            "display": "PP interval per lead"
          },
          {
            "code": "2:16160",
            "display": "QT interval global"
          },
          {
            "code": "2:7936",
            "display": "QRS duration per lead"
          },
          {
            "code": "2:8192",
            "display": "QT interval per lead"
          },
          {
            "code": "2:6656",
            "display": "P duration per lead"
          },
          {
            "code": "2:16156",
            "display": "QRS duration global"
          },
          {
            "code": "2:15872",
            "display": "PR interval global"
          },
          {
            "code": "2:7168",
            "display": "PR interval per lead"
          },
          {
            "code": "2:33024",
            "display": "RR interval per lead"
          },
          {
            "code": "2:16168",
            "display": "RR interval global"
          }
        ]
      }
    ]
  },
  "meta": {
    "tag": [
      {
        "system": "https://mii-termserv.de/fhir/su-termserv/CodeSystem/mii-cs-suts-resource-tags-project",
        "code": "dicom",
        "display": "Digital Imaging and Communications in Medicine"
      },
      {
        "system": "https://mii-termserv.de/fhir/su-termserv/CodeSystem/mii-cs-suts-resource-tags-project",
        "code": "international",
        "display": "International standard terminology"
      },
      {
        "system": "https://mii-termserv.de/fhir/su-termserv/CodeSystem/mii-cs-suts-resource-tags-dataset",
        "code": "dicom",
        "display": "DICOM Terminology"
      },
      {
        "system": "https://mii-termserv.de/fhir/su-termserv/CodeSystem/mii-cs-suts-resource-tags-dataset",
        "code": "standard",
        "display": "International Standards"
      },
      {
        "system": "https://mii-termserv.de/fhir/su-termserv/CodeSystem/mii-cs-suts-resource-tags-license",
        "code": "https://mii-termserv.de/licenses#dicom",
        "display": "DICOM license"
      }
    ]
  },
  "title": "ECGTimingMeasurement",
  "text": {
    "status": "generated",
    "div": "<div xmlns=\"http://www.w3.org/1999/xhtml\"><h2>ECGTimingMeasurement</h2><tt>http://dicom.nema.org/medical/dicom/current/output/chtml/part16/sect_CID_3228.html</tt><p>Transitive closure of CID 3228 ECGTimingMeasurement</p><div><p><b>SU-TermServ Metadata</b></p><table><tbody><tr><td><b>Projects</b></td><td><ul><li>Digital Imaging and Communications in Medicine</li><li>International standard terminology</li></ul></td></tr><tr><td><b>Datasets</b></td><td><ul><li>DICOM Terminology</li><li>International Standards</li></ul></td></tr><tr><td><b>License</b></td><td><a href=\"https://mii-termserv.de/licenses#dicom\">DICOM license</a></td></tr><tr><td><b>Package Scope</b></td><td><a href=\"https://gitlab.com/groups/mii-termserv/fhir-resources/-/packages/?ForderBy%3Dversion%26sort%3Ddesc%26search%5B%5D%3D@mii-termserv/dicom.terminology\"><code>@mii-termserv/dicom.terminology</code></a></td></tr></tbody></table></div></div>"
  },
  "extension": [
    {
      "url": "http://hl7.org/fhir/StructureDefinition/cqf-scope",
      "valueString": "@mii-termserv/dicom.terminology"
    }
  ]
}