{
  "resourceType": "ValueSet",
  "id": "dicom-cid-12125-AbdominopelvicVessel",
  "url": "http://dicom.nema.org/medical/dicom/current/output/chtml/part16/sect_CID_12125.html",
  "identifier": [
    {
      "system": "urn:ietf:rfc:3986",
      "value": "urn:oid:1.2.840.10008.6.1.1355"
    }
  ],
  "version": "20201116",
  "name": "AbdominopelvicVessel",
  "status": "active",
  "experimental": false,
  "date": "2024-06-17",
  "publisher": "NEMA MITA DICOM",
  "description": "Transitive closure of CID 12125 AbdominopelvicVessel",
  "copyright": "© 2024 NEMA",
  "compose": {
    "include": [
      {
        "system": "http://snomed.info/sct",
        "concept": [
          {
            "code": "28205006",
            "display": "Infra-renal Aorta"
          },
          {
            "code": "57850000",
            "display": "Celiac Axis"
          },
          {
            "code": "397407009",
            "display": "First Lumbar Artery"
          },
          {
            "code": "32764006",
            "display": "Portal Vein"
          },
          {
            "code": "976004",
            "display": "Ovarian vein"
          },
          {
            "code": "21807003",
            "display": "Left Branch of Hepatic Artery"
          },
          {
            "code": "64131007",
            "display": "Inferior Vena Cava"
          },
          {
            "code": "18112008",
            "display": "Proper Hepatic Artery"
          },
          {
            "code": "397439002",
            "display": "Ileal vein"
          },
          {
            "code": "7832008",
            "display": "Abdominal aorta"
          },
          {
            "code": "32859001",
            "display": "Inferior Mesenteric Vein"
          },
          {
            "code": "73634005",
            "display": "Common Iliac Artery"
          },
          {
            "code": "272998002",
            "display": "Right Hepatic Vein"
          },
          {
            "code": "23771002",
            "display": "Gastric Artery"
          },
          {
            "code": "12052000",
            "display": "Ovarian Artery"
          },
          {
            "code": "397410002",
            "display": "Fourth Lumbar Artery"
          },
          {
            "code": "397412005",
            "display": "Sixth Lumbar Artery"
          },
          {
            "code": "397409007",
            "display": "Third Lumbar Artery"
          },
          {
            "code": "110568007",
            "display": "Gastric vein"
          },
          {
            "code": "50536004",
            "display": "Umbilical Artery"
          },
          {
            "code": "35819009",
            "display": "Splenic Vein"
          },
          {
            "code": "8993003",
            "display": "Hepatic Vein"
          },
          {
            "code": "70253006",
            "display": "Left Main Branch of Portal Vein"
          },
          {
            "code": "22083002",
            "display": "Splenic Artery"
          },
          {
            "code": "397425002",
            "display": "Inferior Right Hepatic Vein"
          },
          {
            "code": "31688004",
            "display": "Testicular Vein"
          },
          {
            "code": "90771006",
            "display": "Superior Mesenteric Vein"
          },
          {
            "code": "37274004",
            "display": "Gastroduodenal Artery"
          },
          {
            "code": "85383006",
            "display": "Accessory Renal Artery"
          },
          {
            "code": "34635009",
            "display": "Lumbar Artery"
          },
          {
            "code": "397423009",
            "display": "Transjugular Intrahepatic Portosystemic Shunt"
          },
          {
            "code": "1918003",
            "display": "Supra-renal Aorta"
          },
          {
            "code": "273099000",
            "display": "Middle Hepatic Vein"
          },
          {
            "code": "42258001",
            "display": "Superior Mesenteric Artery"
          },
          {
            "code": "73931004",
            "display": "Right Main Branch of Portal Vein"
          },
          {
            "code": "284639000",
            "display": "Umbilical Vein"
          },
          {
            "code": "397411003",
            "display": "Fifth Lumbar Artery"
          },
          {
            "code": "46027005",
            "display": "Common iliac vein"
          },
          {
            "code": "33795007",
            "display": "Inferior Mesenteric Artery"
          },
          {
            "code": "69421009",
            "display": "Right Branch of Hepatic Artery"
          },
          {
            "code": "397408004",
            "display": "Second Lumbar Artery"
          },
          {
            "code": "27175001",
            "display": "Testicular Artery"
          },
          {
            "code": "66559000",
            "display": "Common Hepatic Artery"
          },
          {
            "code": "91079009",
            "display": "Uterine Artery"
          },
          {
            "code": "273202007",
            "display": "Left Hepatic Vein"
          }
        ]
      }
    ]
  },
  "meta": {
    "tag": [
      {
        "system": "https://mii-termserv.de/fhir/su-termserv/CodeSystem/mii-cs-suts-resource-tags-project",
        "code": "dicom",
        "display": "Digital Imaging and Communications in Medicine"
      },
      {
        "system": "https://mii-termserv.de/fhir/su-termserv/CodeSystem/mii-cs-suts-resource-tags-project",
        "code": "international",
        "display": "International standard terminology"
      },
      {
        "system": "https://mii-termserv.de/fhir/su-termserv/CodeSystem/mii-cs-suts-resource-tags-dataset",
        "code": "dicom",
        "display": "DICOM Terminology"
      },
      {
        "system": "https://mii-termserv.de/fhir/su-termserv/CodeSystem/mii-cs-suts-resource-tags-dataset",
        "code": "standard",
        "display": "International Standards"
      },
      {
        "system": "https://mii-termserv.de/fhir/su-termserv/CodeSystem/mii-cs-suts-resource-tags-license",
        "code": "https://mii-termserv.de/licenses#dicom",
        "display": "DICOM license"
      }
    ]
  },
  "title": "AbdominopelvicVessel",
  "text": {
    "status": "generated",
    "div": "<div xmlns=\"http://www.w3.org/1999/xhtml\"><h2>AbdominopelvicVessel</h2><tt>http://dicom.nema.org/medical/dicom/current/output/chtml/part16/sect_CID_12125.html</tt><p>Transitive closure of CID 12125 AbdominopelvicVessel</p><div><p><b>SU-TermServ Metadata</b></p><table><tbody><tr><td><b>Projects</b></td><td><ul><li>Digital Imaging and Communications in Medicine</li><li>International standard terminology</li></ul></td></tr><tr><td><b>Datasets</b></td><td><ul><li>DICOM Terminology</li><li>International Standards</li></ul></td></tr><tr><td><b>License</b></td><td><a href=\"https://mii-termserv.de/licenses#dicom\">DICOM license</a></td></tr><tr><td><b>Package Scope</b></td><td><a href=\"https://gitlab.com/groups/mii-termserv/fhir-resources/-/packages/?ForderBy%3Dversion%26sort%3Ddesc%26search%5B%5D%3D@mii-termserv/dicom.terminology\"><code>@mii-termserv/dicom.terminology</code></a></td></tr></tbody></table></div></div>"
  },
  "extension": [
    {
      "url": "http://hl7.org/fhir/StructureDefinition/cqf-scope",
      "valueString": "@mii-termserv/dicom.terminology"
    }
  ]
}