{
  "resourceType": "ValueSet",
  "id": "dicom-cid-7050-DeidentificationMethod",
  "url": "http://dicom.nema.org/medical/dicom/current/output/chtml/part16/sect_CID_7050.html",
  "identifier": [
    {
      "system": "urn:ietf:rfc:3986",
      "value": "urn:oid:1.2.840.10008.6.1.925"
    }
  ],
  "version": "20170914",
  "name": "DeidentificationMethod",
  "status": "active",
  "experimental": false,
  "date": "2024-06-17",
  "publisher": "NEMA MITA DICOM",
  "description": "Transitive closure of CID 7050 DeidentificationMethod",
  "copyright": "© 2024 NEMA",
  "compose": {
    "include": [
      {
        "system": "http://dicom.nema.org/resources/ontology/DCM",
        "concept": [
          {
            "code": "113110",
            "display": "Retain UIDs Option"
          },
          {
            "code": "113100",
            "display": "Basic Application Confidentiality Profile"
          },
          {
            "code": "113111",
            "display": "Retain Safe Private Option"
          },
          {
            "code": "113101",
            "display": "Clean Pixel Data Option"
          },
          {
            "code": "113112",
            "display": "Retain Institution Identity Option"
          },
          {
            "code": "113102",
            "display": "Clean Recognizable Visual Features Option"
          },
          {
            "code": "113103",
            "display": "Clean Graphics Option"
          },
          {
            "code": "113104",
            "display": "Clean Structured Content Option"
          },
          {
            "code": "113105",
            "display": "Clean Descriptors Option"
          },
          {
            "code": "113106",
            "display": "Retain Longitudinal Temporal Information Full Dates Option"
          },
          {
            "code": "113107",
            "display": "Retain Longitudinal Temporal Information Modified Dates Option"
          },
          {
            "code": "113108",
            "display": "Retain Patient Characteristics Option"
          },
          {
            "code": "113109",
            "display": "Retain Device Identity Option"
          }
        ]
      }
    ]
  },
  "meta": {
    "tag": [
      {
        "system": "https://mii-termserv.de/fhir/su-termserv/CodeSystem/mii-cs-suts-resource-tags-project",
        "code": "dicom",
        "display": "Digital Imaging and Communications in Medicine"
      },
      {
        "system": "https://mii-termserv.de/fhir/su-termserv/CodeSystem/mii-cs-suts-resource-tags-project",
        "code": "international",
        "display": "International standard terminology"
      },
      {
        "system": "https://mii-termserv.de/fhir/su-termserv/CodeSystem/mii-cs-suts-resource-tags-dataset",
        "code": "dicom",
        "display": "DICOM Terminology"
      },
      {
        "system": "https://mii-termserv.de/fhir/su-termserv/CodeSystem/mii-cs-suts-resource-tags-dataset",
        "code": "standard",
        "display": "International Standards"
      },
      {
        "system": "https://mii-termserv.de/fhir/su-termserv/CodeSystem/mii-cs-suts-resource-tags-license",
        "code": "https://mii-termserv.de/licenses#dicom",
        "display": "DICOM license"
      }
    ]
  },
  "title": "DeidentificationMethod",
  "text": {
    "status": "generated",
    "div": "<div xmlns=\"http://www.w3.org/1999/xhtml\"><h2>DeidentificationMethod</h2><tt>http://dicom.nema.org/medical/dicom/current/output/chtml/part16/sect_CID_7050.html</tt><p>Transitive closure of CID 7050 DeidentificationMethod</p><div><p><b>SU-TermServ Metadata</b></p><table><tbody><tr><td><b>Projects</b></td><td><ul><li>Digital Imaging and Communications in Medicine</li><li>International standard terminology</li></ul></td></tr><tr><td><b>Datasets</b></td><td><ul><li>DICOM Terminology</li><li>International Standards</li></ul></td></tr><tr><td><b>License</b></td><td><a href=\"https://mii-termserv.de/licenses#dicom\">DICOM license</a></td></tr><tr><td><b>Package Scope</b></td><td><a href=\"https://gitlab.com/groups/mii-termserv/fhir-resources/-/packages/?ForderBy%3Dversion%26sort%3Ddesc%26search%5B%5D%3D@mii-termserv/dicom.terminology\"><code>@mii-termserv/dicom.terminology</code></a></td></tr></tbody></table></div></div>"
  },
  "extension": [
    {
      "url": "http://hl7.org/fhir/StructureDefinition/cqf-scope",
      "valueString": "@mii-termserv/dicom.terminology"
    }
  ]
}