{
  "resourceType": "ValueSet",
  "id": "dicom-cid-6345-MRIEnhancementPattern",
  "url": "http://dicom.nema.org/medical/dicom/current/output/chtml/part16/sect_CID_6345.html",
  "identifier": [
    {
      "system": "urn:ietf:rfc:3986",
      "value": "urn:oid:1.2.840.10008.6.1.1402"
    }
  ],
  "version": "20210714",
  "name": "MRIEnhancementPattern",
  "status": "active",
  "experimental": false,
  "date": "2024-06-17",
  "publisher": "NEMA MITA DICOM",
  "description": "Transitive closure of CID 6345 MRIEnhancementPattern",
  "copyright": "© 2024 NEMA",
  "compose": {
    "include": [
      {
        "system": "http://dicom.nema.org/resources/ontology/DCM",
        "concept": [
          {
            "code": "122664",
            "display": "Late Contrast Enhancement"
          },
          {
            "code": "130597",
            "display": "Persistent delayed phase: Type 1 curve"
          },
          {
            "code": "130601",
            "display": "Negative DCE"
          },
          {
            "code": "130600",
            "display": "Positive DCE"
          },
          {
            "code": "130599",
            "display": "Washout delayed phase: Type 3 curve"
          },
          {
            "code": "130598",
            "display": "Plateau delayed phase: Type 2 curve"
          },
          {
            "code": "130604",
            "display": "Focal Contrast Enhancement"
          },
          {
            "code": "130603",
            "display": "Diffuse Contrast Enhancement"
          },
          {
            "code": "130602",
            "display": "Early Contrast Enhancement"
          }
        ]
      },
      {
        "system": "http://www.radlex.org",
        "concept": [
          {
            "code": "RID49530",
            "display": "Early phase wash-in"
          },
          {
            "code": "RID34331",
            "display": "Persistent delayed phase"
          },
          {
            "code": "RID34333",
            "display": "Washout delayed phase"
          },
          {
            "code": "RID34332",
            "display": "Plateau delayed phase"
          },
          {
            "code": "RID11081",
            "display": "Delayed phase"
          }
        ]
      }
    ]
  },
  "meta": {
    "tag": [
      {
        "system": "https://mii-termserv.de/fhir/su-termserv/CodeSystem/mii-cs-suts-resource-tags-project",
        "code": "dicom",
        "display": "Digital Imaging and Communications in Medicine"
      },
      {
        "system": "https://mii-termserv.de/fhir/su-termserv/CodeSystem/mii-cs-suts-resource-tags-project",
        "code": "international",
        "display": "International standard terminology"
      },
      {
        "system": "https://mii-termserv.de/fhir/su-termserv/CodeSystem/mii-cs-suts-resource-tags-dataset",
        "code": "dicom",
        "display": "DICOM Terminology"
      },
      {
        "system": "https://mii-termserv.de/fhir/su-termserv/CodeSystem/mii-cs-suts-resource-tags-dataset",
        "code": "standard",
        "display": "International Standards"
      },
      {
        "system": "https://mii-termserv.de/fhir/su-termserv/CodeSystem/mii-cs-suts-resource-tags-license",
        "code": "https://mii-termserv.de/licenses#dicom",
        "display": "DICOM license"
      }
    ]
  },
  "title": "MRIEnhancementPattern",
  "text": {
    "status": "generated",
    "div": "<div xmlns=\"http://www.w3.org/1999/xhtml\"><h2>MRIEnhancementPattern</h2><tt>http://dicom.nema.org/medical/dicom/current/output/chtml/part16/sect_CID_6345.html</tt><p>Transitive closure of CID 6345 MRIEnhancementPattern</p><div><p><b>SU-TermServ Metadata</b></p><table><tbody><tr><td><b>Projects</b></td><td><ul><li>Digital Imaging and Communications in Medicine</li><li>International standard terminology</li></ul></td></tr><tr><td><b>Datasets</b></td><td><ul><li>DICOM Terminology</li><li>International Standards</li></ul></td></tr><tr><td><b>License</b></td><td><a href=\"https://mii-termserv.de/licenses#dicom\">DICOM license</a></td></tr><tr><td><b>Package Scope</b></td><td><a href=\"https://gitlab.com/groups/mii-termserv/fhir-resources/-/packages/?ForderBy%3Dversion%26sort%3Ddesc%26search%5B%5D%3D@mii-termserv/dicom.terminology\"><code>@mii-termserv/dicom.terminology</code></a></td></tr></tbody></table></div></div>"
  },
  "extension": [
    {
      "url": "http://hl7.org/fhir/StructureDefinition/cqf-scope",
      "valueString": "@mii-termserv/dicom.terminology"
    }
  ]
}