{
  "resourceType": "ValueSet",
  "id": "dicom-cid-10067-RadiationAttenuatorMaterial",
  "url": "http://dicom.nema.org/medical/dicom/current/output/chtml/part16/sect_CID_10067.html",
  "identifier": [
    {
      "system": "urn:ietf:rfc:3986",
      "value": "urn:oid:1.2.840.10008.6.1.1161"
    }
  ],
  "version": "20170405",
  "name": "RadiationAttenuatorMaterial",
  "status": "active",
  "experimental": false,
  "date": "2024-06-17",
  "publisher": "NEMA MITA DICOM",
  "description": "Transitive closure of CID 10067 RadiationAttenuatorMaterial",
  "copyright": "© 2024 NEMA",
  "compose": {
    "include": [
      {
        "system": "http://snomed.info/sct",
        "concept": [
          {
            "code": "256501007",
            "display": "Carbon Fiber"
          },
          {
            "code": "12597001",
            "display": "Tin"
          },
          {
            "code": "45215009",
            "display": "Tantalum"
          },
          {
            "code": "59801003",
            "display": "Rhodium"
          },
          {
            "code": "88488004",
            "display": "Lead"
          },
          {
            "code": "66925006",
            "display": "Copper"
          },
          {
            "code": "767776000",
            "display": "Niobium"
          },
          {
            "code": "71128006",
            "display": "Molybdenum"
          },
          {
            "code": "88014003",
            "display": "Beryllium"
          },
          {
            "code": "41967008",
            "display": "Silver"
          },
          {
            "code": "12503006",
            "display": "Aluminum"
          },
          {
            "code": "767775001",
            "display": "Europium"
          }
        ]
      },
      {
        "system": "http://www.nlm.nih.gov/research/umls",
        "concept": [
          {
            "code": "C0064329",
            "display": "Kevlar Aramid Fiber"
          }
        ]
      }
    ]
  },
  "meta": {
    "tag": [
      {
        "system": "https://mii-termserv.de/fhir/su-termserv/CodeSystem/mii-cs-suts-resource-tags-project",
        "code": "dicom",
        "display": "Digital Imaging and Communications in Medicine"
      },
      {
        "system": "https://mii-termserv.de/fhir/su-termserv/CodeSystem/mii-cs-suts-resource-tags-project",
        "code": "international",
        "display": "International standard terminology"
      },
      {
        "system": "https://mii-termserv.de/fhir/su-termserv/CodeSystem/mii-cs-suts-resource-tags-dataset",
        "code": "dicom",
        "display": "DICOM Terminology"
      },
      {
        "system": "https://mii-termserv.de/fhir/su-termserv/CodeSystem/mii-cs-suts-resource-tags-dataset",
        "code": "standard",
        "display": "International Standards"
      },
      {
        "system": "https://mii-termserv.de/fhir/su-termserv/CodeSystem/mii-cs-suts-resource-tags-license",
        "code": "https://mii-termserv.de/licenses#dicom",
        "display": "DICOM license"
      }
    ]
  },
  "title": "RadiationAttenuatorMaterial",
  "text": {
    "status": "generated",
    "div": "<div xmlns=\"http://www.w3.org/1999/xhtml\"><h2>RadiationAttenuatorMaterial</h2><tt>http://dicom.nema.org/medical/dicom/current/output/chtml/part16/sect_CID_10067.html</tt><p>Transitive closure of CID 10067 RadiationAttenuatorMaterial</p><div><p><b>SU-TermServ Metadata</b></p><table><tbody><tr><td><b>Projects</b></td><td><ul><li>Digital Imaging and Communications in Medicine</li><li>International standard terminology</li></ul></td></tr><tr><td><b>Datasets</b></td><td><ul><li>DICOM Terminology</li><li>International Standards</li></ul></td></tr><tr><td><b>License</b></td><td><a href=\"https://mii-termserv.de/licenses#dicom\">DICOM license</a></td></tr><tr><td><b>Package Scope</b></td><td><a href=\"https://gitlab.com/groups/mii-termserv/fhir-resources/-/packages/?ForderBy%3Dversion%26sort%3Ddesc%26search%5B%5D%3D@mii-termserv/dicom.terminology\"><code>@mii-termserv/dicom.terminology</code></a></td></tr></tbody></table></div></div>"
  },
  "extension": [
    {
      "url": "http://hl7.org/fhir/StructureDefinition/cqf-scope",
      "valueString": "@mii-termserv/dicom.terminology"
    }
  ]
}