{
  "resourceType": "ValueSet",
  "id": "dicom-cid-6099-RacialGroup",
  "url": "http://dicom.nema.org/medical/dicom/current/output/chtml/part16/sect_CID_6099.html",
  "identifier": [
    {
      "system": "urn:ietf:rfc:3986",
      "value": "urn:oid:1.2.840.10008.6.1.1278"
    }
  ],
  "version": "20240611",
  "name": "RacialGroup",
  "status": "active",
  "experimental": false,
  "date": "2024-06-17",
  "publisher": "NEMA MITA DICOM",
  "description": "Transitive closure of CID 6099 RacialGroup",
  "copyright": "© 2024 NEMA",
  "compose": {
    "include": [
      {
        "system": "http://ncit.nci.nih.gov",
        "concept": [
          {
            "code": "C41219",
            "display": "Native Hawaiian or other Pacific Islander"
          }
        ]
      },
      {
        "system": "http://snomed.info/sct",
        "concept": [
          {
            "code": "413490006",
            "display": "American Indian or Alaska native"
          },
          {
            "code": "413581001",
            "display": "Asian or Pacific Islander race"
          },
          {
            "code": "413773004",
            "display": "Caucasian race"
          },
          {
            "code": "414408004",
            "display": "Hispanic"
          },
          {
            "code": "413600007",
            "display": "Australian aborigine race"
          },
          {
            "code": "414481008",
            "display": "Indian race"
          },
          {
            "code": "413464008",
            "display": "African race"
          },
          {
            "code": "414752008",
            "display": "Mixed racial group"
          },
          {
            "code": "413582008",
            "display": "Asian race"
          }
        ]
      },
      {
        "system": "http://www.nlm.nih.gov/research/umls",
        "concept": [
          {
            "code": "C5690844",
            "display": "Middle Eastern or North African"
          }
        ]
      }
    ]
  },
  "meta": {
    "tag": [
      {
        "system": "https://mii-termserv.de/fhir/su-termserv/CodeSystem/mii-cs-suts-resource-tags-project",
        "code": "dicom",
        "display": "Digital Imaging and Communications in Medicine"
      },
      {
        "system": "https://mii-termserv.de/fhir/su-termserv/CodeSystem/mii-cs-suts-resource-tags-project",
        "code": "international",
        "display": "International standard terminology"
      },
      {
        "system": "https://mii-termserv.de/fhir/su-termserv/CodeSystem/mii-cs-suts-resource-tags-dataset",
        "code": "dicom",
        "display": "DICOM Terminology"
      },
      {
        "system": "https://mii-termserv.de/fhir/su-termserv/CodeSystem/mii-cs-suts-resource-tags-dataset",
        "code": "standard",
        "display": "International Standards"
      },
      {
        "system": "https://mii-termserv.de/fhir/su-termserv/CodeSystem/mii-cs-suts-resource-tags-license",
        "code": "https://mii-termserv.de/licenses#dicom",
        "display": "DICOM license"
      }
    ]
  },
  "title": "RacialGroup",
  "text": {
    "status": "generated",
    "div": "<div xmlns=\"http://www.w3.org/1999/xhtml\"><h2>RacialGroup</h2><tt>http://dicom.nema.org/medical/dicom/current/output/chtml/part16/sect_CID_6099.html</tt><p>Transitive closure of CID 6099 RacialGroup</p><div><p><b>SU-TermServ Metadata</b></p><table><tbody><tr><td><b>Projects</b></td><td><ul><li>Digital Imaging and Communications in Medicine</li><li>International standard terminology</li></ul></td></tr><tr><td><b>Datasets</b></td><td><ul><li>DICOM Terminology</li><li>International Standards</li></ul></td></tr><tr><td><b>License</b></td><td><a href=\"https://mii-termserv.de/licenses#dicom\">DICOM license</a></td></tr><tr><td><b>Package Scope</b></td><td><a href=\"https://gitlab.com/groups/mii-termserv/fhir-resources/-/packages/?ForderBy%3Dversion%26sort%3Ddesc%26search%5B%5D%3D@mii-termserv/dicom.terminology\"><code>@mii-termserv/dicom.terminology</code></a></td></tr></tbody></table></div></div>"
  },
  "extension": [
    {
      "url": "http://hl7.org/fhir/StructureDefinition/cqf-scope",
      "valueString": "@mii-termserv/dicom.terminology"
    }
  ]
}