{
  "resourceType": "ValueSet",
  "id": "dicom-cid-8112-SpecimenStain",
  "url": "http://dicom.nema.org/medical/dicom/current/output/chtml/part16/sect_CID_8112.html",
  "identifier": [
    {
      "system": "urn:ietf:rfc:3986",
      "value": "urn:oid:1.2.840.10008.6.1.1050"
    }
  ],
  "version": "20240611",
  "name": "SpecimenStain",
  "status": "active",
  "experimental": false,
  "date": "2024-06-17",
  "publisher": "NEMA MITA DICOM",
  "description": "Transitive closure of CID 8112 SpecimenStain",
  "copyright": "© 2024 NEMA",
  "compose": {
    "include": [
      {
        "system": "http://snomed.info/sct",
        "concept": [
          {
            "code": "255803006",
            "display": "may-Grunwald giemsa stain"
          },
          {
            "code": "91295002",
            "display": "fast blue BB salt stain"
          },
          {
            "code": "58631000",
            "display": "eriochrome blue black SE stain"
          },
          {
            "code": "37575004",
            "display": "carmoisine A stain"
          },
          {
            "code": "255798002",
            "display": "field's stain"
          },
          {
            "code": "41750006",
            "display": "brazilin stain"
          },
          {
            "code": "61068006",
            "display": "thioflavine T stain"
          },
          {
            "code": "76925007",
            "display": "alkali blue 5B (4B) stain"
          },
          {
            "code": "385484003",
            "display": "gram stain"
          },
          {
            "code": "28622002",
            "display": "alizarin yellow R stain"
          },
          {
            "code": "406973009",
            "display": "naphthol-AS-D-chloracetate esterase stain"
          },
          {
            "code": "12030009",
            "display": "Sudan II stain"
          },
          {
            "code": "22021002",
            "display": "methyl green stain"
          },
          {
            "code": "47486002",
            "display": "fast red ITR stain"
          },
          {
            "code": "60739006",
            "display": "waxoline blue stain"
          },
          {
            "code": "36879007",
            "display": "water soluble eosin stain"
          },
          {
            "code": "89856006",
            "display": "ponceau S stain"
          },
          {
            "code": "406985001",
            "display": "silver nitrate stain"
          },
          {
            "code": "85981002",
            "display": "chromotrope 2R stain"
          },
          {
            "code": "408742009",
            "display": "rose bengal stain"
          },
          {
            "code": "314900004",
            "display": "Sudan stain"
          },
          {
            "code": "22749001",
            "display": "victoria blue B stain"
          },
          {
            "code": "255808002",
            "display": "periodic acid Schiff stain"
          },
          {
            "code": "40808006",
            "display": "oil red O stain"
          },
          {
            "code": "406955006",
            "display": "butyrate esterase stain"
          },
          {
            "code": "406980006",
            "display": "fouchet stain"
          },
          {
            "code": "13744001",
            "display": "methyl red stain"
          },
          {
            "code": "76048000",
            "display": "azocarmine G (GX) stain"
          },
          {
            "code": "84656005",
            "display": "atebrin FS stain"
          },
          {
            "code": "406974003",
            "display": "peroxidase stain"
          },
          {
            "code": "108880002",
            "display": "fluorexon stain"
          },
          {
            "code": "67956008",
            "display": "neutral red stain"
          },
          {
            "code": "24516006",
            "display": "meldola blue stain"
          },
          {
            "code": "406968003",
            "display": "quinacrine fluorescent stain"
          },
          {
            "code": "25351006",
            "display": "Fluorescein sodium stain"
          },
          {
            "code": "7434003",
            "display": "erythrosin B stain"
          },
          {
            "code": "44488008",
            "display": "bismark brown R stain"
          },
          {
            "code": "255793006",
            "display": "Albert's stain"
          },
          {
            "code": "432003",
            "display": "carminic acid stain"
          },
          {
            "code": "27016007",
            "display": "alizarin yellow GG stain"
          },
          {
            "code": "76439002",
            "display": "fat red 7B stain"
          },
          {
            "code": "65580004",
            "display": "alizarin red S stain"
          },
          {
            "code": "406991004",
            "display": "modified trichrome stain"
          },
          {
            "code": "12001002",
            "display": "thionine stain"
          },
          {
            "code": "82682000",
            "display": "victoria blue 4R stain"
          },
          {
            "code": "16788000",
            "display": "naphthalene black 12B stain"
          },
          {
            "code": "24167004",
            "display": "fast green FCF stain"
          },
          {
            "code": "31260003",
            "display": "methylene violet stain (Bernthsen)"
          },
          {
            "code": "38271009",
            "display": "saffron stain"
          },
          {
            "code": "83600004",
            "display": "spirit soluble eosin stain"
          },
          {
            "code": "60441008",
            "display": "trypan blue stain"
          },
          {
            "code": "255802001",
            "display": "Leishman stain"
          },
          {
            "code": "8342001",
            "display": "brilliant cresyl blue stain"
          },
          {
            "code": "54221006",
            "display": "orange G stain"
          },
          {
            "code": "80305003",
            "display": "pontamine sky blue 6BX stain"
          },
          {
            "code": "11645004",
            "display": "spirit soluble aniline blue stain"
          },
          {
            "code": "29342009",
            "display": "kenacid blue R stain"
          },
          {
            "code": "406992006",
            "display": "verhoeff's hematoxylin stain"
          },
          {
            "code": "76001002",
            "display": "pyronine B stain"
          },
          {
            "code": "75956008",
            "display": "hematein stain"
          },
          {
            "code": "89577003",
            "display": "pontamine sky blue 5BX stain"
          },
          {
            "code": "387239001",
            "display": "methyl violet stain"
          },
          {
            "code": "73251007",
            "display": "auramine G stain"
          },
          {
            "code": "255807007",
            "display": "nonspecific esterase stain"
          },
          {
            "code": "35352008",
            "display": "fluorescent stain"
          },
          {
            "code": "71957009",
            "display": "phloxin B stain"
          },
          {
            "code": "22968009",
            "display": "sunset yellow FCF stain"
          },
          {
            "code": "85190005",
            "display": "bismark brown Y stain"
          },
          {
            "code": "406975002",
            "display": "terminal deoxynucleotidyl transferase stain"
          },
          {
            "code": "255811001",
            "display": "spore stain"
          },
          {
            "code": "406986000",
            "display": "chromic acid stain"
          },
          {
            "code": "43549000",
            "display": "solochrome azurine (BS) stain"
          },
          {
            "code": "85596006",
            "display": "fluorescein stain"
          },
          {
            "code": "11727009",
            "display": "indophenol from naphthol stain"
          },
          {
            "code": "42248000",
            "display": "methyl orange stain"
          },
          {
            "code": "255801008",
            "display": "Jenner-Giemsa stain"
          },
          {
            "code": "86750008",
            "display": "nitrazine yellow stain"
          },
          {
            "code": "34700000",
            "display": "fast blue B salt stain"
          },
          {
            "code": "255792001",
            "display": "acid phosphatase stain"
          },
          {
            "code": "406959000",
            "display": "cresyl violet stain"
          },
          {
            "code": "406993001",
            "display": "protargol S stain"
          },
          {
            "code": "14544006",
            "display": "methyl violet 6B stain"
          },
          {
            "code": "47030008",
            "display": "insoluble berlin blue stain"
          },
          {
            "code": "21951008",
            "display": "alizarin cyanine green stain"
          },
          {
            "code": "14958002",
            "display": "naphthol green B stain"
          },
          {
            "code": "20230008",
            "display": "vital new red stain"
          },
          {
            "code": "54791001",
            "display": "metanil yellow stain"
          },
          {
            "code": "406964001",
            "display": "mucicarmine stain"
          },
          {
            "code": "24900003",
            "display": "procion brilliant blue MRS stain"
          },
          {
            "code": "406981005",
            "display": "aldehyde fuchsin stain"
          },
          {
            "code": "5442001",
            "display": "page blue 83 stain"
          },
          {
            "code": "8429000",
            "display": "brilliant orange stain"
          },
          {
            "code": "255797007",
            "display": "Feulgen reaction stain"
          },
          {
            "code": "72572003",
            "display": "diamond black stain"
          },
          {
            "code": "68263003",
            "display": "janus green B stain"
          },
          {
            "code": "373646006",
            "display": "giemsa stain"
          },
          {
            "code": "406452004",
            "display": "Prussian blue stain"
          },
          {
            "code": "47995002",
            "display": "alcohol soluble nigrosine stain"
          },
          {
            "code": "9010006",
            "display": "methyl blue stain"
          },
          {
            "code": "764166003",
            "display": "carbol fuchsin stain"
          },
          {
            "code": "12710003",
            "display": "hematoxylin stain"
          },
          {
            "code": "58755002",
            "display": "water soluble anthracene brown stain"
          },
          {
            "code": "89148006",
            "display": "fast garnet GBC salt stain"
          },
          {
            "code": "27844007",
            "display": "benzo fast scarlet stain"
          },
          {
            "code": "255806003",
            "display": "neutrophil alkaline phosphatase stain"
          },
          {
            "code": "17693003",
            "display": "acriflavine stain"
          },
          {
            "code": "29252006",
            "display": "acridine orange stain"
          },
          {
            "code": "65445001",
            "display": "ethyl violet stain"
          },
          {
            "code": "89028002",
            "display": "curcumin stain"
          },
          {
            "code": "64991008",
            "display": "soluble berlin blue stain"
          },
          {
            "code": "406953004",
            "display": "Mallory bleach stain"
          },
          {
            "code": "88660000",
            "display": "fast sulfon black F stain"
          },
          {
            "code": "5043000",
            "display": "erythrosin Y stain"
          },
          {
            "code": "72371006",
            "display": "fast violet B salt stain"
          },
          {
            "code": "60920007",
            "display": "fuchsin acid stain"
          },
          {
            "code": "406958008",
            "display": "luxol fast blue stain"
          },
          {
            "code": "111102009",
            "display": "lissamine rhodamine stain"
          },
          {
            "code": "255800009",
            "display": "immunofluorescent stain"
          },
          {
            "code": "25091000",
            "display": "solochrome cyanine R stain"
          },
          {
            "code": "255795004",
            "display": "beta-glucuronidase stain"
          },
          {
            "code": "54432009",
            "display": "alizarin blue S stain"
          },
          {
            "code": "73892005",
            "display": "carmine stain"
          },
          {
            "code": "8836009",
            "display": "gallocyanine stain"
          },
          {
            "code": "406965000",
            "display": "night blue stain"
          },
          {
            "code": "86541009",
            "display": "brilliant crocein stain"
          },
          {
            "code": "409549005",
            "display": "wayson stain"
          },
          {
            "code": "68459007",
            "display": "crystal ponceau stain"
          },
          {
            "code": "55831004",
            "display": "xylene cyanol FF stain"
          },
          {
            "code": "16836001",
            "display": "azure A stain"
          },
          {
            "code": "38902009",
            "display": "solochrome dark blue stain"
          },
          {
            "code": "88625006",
            "display": "water soluble aniline blue stain"
          },
          {
            "code": "406982003",
            "display": "bauer's chromic acid leucofuchsin stain"
          },
          {
            "code": "35094004",
            "display": "tropaeolin O stain"
          },
          {
            "code": "10247008",
            "display": "chrysoidine R stain"
          },
          {
            "code": "255796003",
            "display": "chloroacetate esterase stain"
          },
          {
            "code": "406971006",
            "display": "alkaline phosphatase stain"
          },
          {
            "code": "51567006",
            "display": "sirius red F3B stain"
          },
          {
            "code": "410457007",
            "display": "permethrin"
          },
          {
            "code": "10740006",
            "display": "Sudan blue stain"
          },
          {
            "code": "406952009",
            "display": "colloidal iron stain"
          },
          {
            "code": "46139004",
            "display": "martius yellow stain"
          },
          {
            "code": "255805004",
            "display": "myeloperoxidase stain"
          },
          {
            "code": "34128002",
            "display": "chrome azurol S stain"
          },
          {
            "code": "6701008",
            "display": "lissamine fast red B stain"
          },
          {
            "code": "4656000",
            "display": "alcian blue 8GX stain"
          },
          {
            "code": "25079009",
            "display": "lissamine fast yellow stain"
          },
          {
            "code": "45106005",
            "display": "Congo red stain"
          },
          {
            "code": "29522004",
            "display": "toluidine blue stain"
          },
          {
            "code": "406960005",
            "display": "cresyl echt violet stain"
          },
          {
            "code": "36572009",
            "display": "Sudan black B stain"
          },
          {
            "code": "255813003",
            "display": "Ziehl-Neelsen stain"
          },
          {
            "code": "85066006",
            "display": "azo black stain"
          },
          {
            "code": "406977005",
            "display": "rhodamine stain"
          },
          {
            "code": "77073008",
            "display": "nile blue stain"
          },
          {
            "code": "38707008",
            "display": "celestine blue B stain"
          },
          {
            "code": "8926000",
            "display": "azure B stain"
          },
          {
            "code": "38543004",
            "display": "lissamine green B stain"
          },
          {
            "code": "84217005",
            "display": "titan yellow stain"
          },
          {
            "code": "49687009",
            "display": "coriphosphine stain"
          },
          {
            "code": "15896008",
            "display": "methyl violet 2B stain"
          },
          {
            "code": "406988004",
            "display": "safranin stain"
          },
          {
            "code": "39777001",
            "display": "Sudan III stain"
          },
          {
            "code": "35724001",
            "display": "lacmoid stain"
          },
          {
            "code": "27671009",
            "display": "rhodamine B stain"
          },
          {
            "code": "63929007",
            "display": "alkali blue 6B stain"
          },
          {
            "code": "255794000",
            "display": "auramine stain"
          },
          {
            "code": "69133007",
            "display": "Sudan IV stain"
          },
          {
            "code": "65730007",
            "display": "ponceau 3R stain"
          },
          {
            "code": "64112001",
            "display": "fast blue RR salt stain"
          },
          {
            "code": "406972004",
            "display": "India ink stain"
          },
          {
            "code": "15529003",
            "display": "rosolic acid sodium salt stain"
          },
          {
            "code": "406957003",
            "display": "Van Gieson stain"
          },
          {
            "code": "53511009",
            "display": "tropaeolin OO stain"
          },
          {
            "code": "35609001",
            "display": "azophloxin stain"
          },
          {
            "code": "1346008",
            "display": "blue shade eosin stain"
          },
          {
            "code": "12119009",
            "display": "water soluble nigrosine stain"
          },
          {
            "code": "406966004",
            "display": "orcein stain"
          },
          {
            "code": "406989007",
            "display": "trichrome stain"
          },
          {
            "code": "373682001",
            "display": "wright stain"
          },
          {
            "code": "2159007",
            "display": "azorubin S stain"
          },
          {
            "code": "406983008",
            "display": "hansel stain"
          },
          {
            "code": "11069001",
            "display": "azure C stain"
          },
          {
            "code": "31714001",
            "display": "new fuchsin stain"
          },
          {
            "code": "255799005",
            "display": "Flagellar stain"
          },
          {
            "code": "2088005",
            "display": "page blue G-90 stain"
          },
          {
            "code": "34763001",
            "display": "potassium hydroxide stain"
          },
          {
            "code": "255810000",
            "display": "Romanowsky stain"
          },
          {
            "code": "89139001",
            "display": "light green SF stain"
          },
          {
            "code": "40076005",
            "display": "erie garnet stain"
          },
          {
            "code": "6725000",
            "display": "methylene blue stain"
          },
          {
            "code": "255804000",
            "display": "methyl green pyronin stain"
          },
          {
            "code": "11780008",
            "display": "durazol red stain"
          },
          {
            "code": "406961009",
            "display": "methylene violet stain"
          },
          {
            "code": "40718007",
            "display": "fast red B salt stain"
          },
          {
            "code": "111101002",
            "display": "naphthol yellow S stain"
          },
          {
            "code": "16943008",
            "display": "chrysoidine Y stain"
          },
          {
            "code": "406951002",
            "display": "silver stain"
          },
          {
            "code": "406990003",
            "display": "aniline blue stain"
          },
          {
            "code": "21592006",
            "display": "tartrazine stain"
          },
          {
            "code": "43106008",
            "display": "pyronine G stain"
          },
          {
            "code": "57753006",
            "display": "brilliant yellow stain"
          },
          {
            "code": "48540004",
            "display": "patent blue V sodium salt stain"
          },
          {
            "code": "27120008",
            "display": "malachite green stain"
          },
          {
            "code": "412548006",
            "display": "indigo carmine"
          },
          {
            "code": "81397005",
            "display": "auramine O stain"
          },
          {
            "code": "25941002",
            "display": "orange II stain"
          },
          {
            "code": "17172002",
            "display": "dibromofluorescein stain"
          },
          {
            "code": "22931006",
            "display": "Evans blue stain"
          },
          {
            "code": "310805002",
            "display": "Sudan black stain"
          },
          {
            "code": "78869007",
            "display": "nuclear fast red stain"
          },
          {
            "code": "50062004",
            "display": "fuchsin basic stain"
          },
          {
            "code": "76605005",
            "display": "biebrich scarlet stain"
          },
          {
            "code": "70520000",
            "display": "ponceau xylidine stain"
          },
          {
            "code": "406995008",
            "display": "thioflavine S stain"
          },
          {
            "code": "406967008",
            "display": "phosphotungstic acid-hematoxylin stain"
          },
          {
            "code": "76633005",
            "display": "fast red TR salt stain"
          },
          {
            "code": "11201005",
            "display": "solochrome black 6B stain"
          }
        ]
      }
    ]
  },
  "meta": {
    "tag": [
      {
        "system": "https://mii-termserv.de/fhir/su-termserv/CodeSystem/mii-cs-suts-resource-tags-project",
        "code": "dicom",
        "display": "Digital Imaging and Communications in Medicine"
      },
      {
        "system": "https://mii-termserv.de/fhir/su-termserv/CodeSystem/mii-cs-suts-resource-tags-project",
        "code": "international",
        "display": "International standard terminology"
      },
      {
        "system": "https://mii-termserv.de/fhir/su-termserv/CodeSystem/mii-cs-suts-resource-tags-dataset",
        "code": "dicom",
        "display": "DICOM Terminology"
      },
      {
        "system": "https://mii-termserv.de/fhir/su-termserv/CodeSystem/mii-cs-suts-resource-tags-dataset",
        "code": "standard",
        "display": "International Standards"
      },
      {
        "system": "https://mii-termserv.de/fhir/su-termserv/CodeSystem/mii-cs-suts-resource-tags-license",
        "code": "https://mii-termserv.de/licenses#dicom",
        "display": "DICOM license"
      }
    ]
  },
  "title": "SpecimenStain",
  "text": {
    "status": "generated",
    "div": "<div xmlns=\"http://www.w3.org/1999/xhtml\"><h2>SpecimenStain</h2><tt>http://dicom.nema.org/medical/dicom/current/output/chtml/part16/sect_CID_8112.html</tt><p>Transitive closure of CID 8112 SpecimenStain</p><div><p><b>SU-TermServ Metadata</b></p><table><tbody><tr><td><b>Projects</b></td><td><ul><li>Digital Imaging and Communications in Medicine</li><li>International standard terminology</li></ul></td></tr><tr><td><b>Datasets</b></td><td><ul><li>DICOM Terminology</li><li>International Standards</li></ul></td></tr><tr><td><b>License</b></td><td><a href=\"https://mii-termserv.de/licenses#dicom\">DICOM license</a></td></tr><tr><td><b>Package Scope</b></td><td><a href=\"https://gitlab.com/groups/mii-termserv/fhir-resources/-/packages/?ForderBy%3Dversion%26sort%3Ddesc%26search%5B%5D%3D@mii-termserv/dicom.terminology\"><code>@mii-termserv/dicom.terminology</code></a></td></tr></tbody></table></div></div>"
  },
  "extension": [
    {
      "url": "http://hl7.org/fhir/StructureDefinition/cqf-scope",
      "valueString": "@mii-termserv/dicom.terminology"
    }
  ]
}