{
  "resourceType": "ValueSet",
  "id": "dicom-cid-1002-AnatomicalReferenceBasisHead",
  "url": "http://dicom.nema.org/medical/dicom/current/output/chtml/part16/sect_CID_1002.html",
  "identifier": [
    {
      "system": "urn:ietf:rfc:3986",
      "value": "urn:oid:1.2.840.10008.6.1.1123"
    }
  ],
  "version": "20160905",
  "name": "AnatomicalReferenceBasisHead",
  "status": "active",
  "experimental": false,
  "date": "2024-06-17",
  "publisher": "NEMA MITA DICOM",
  "description": "Transitive closure of CID 1002 AnatomicalReferenceBasisHead",
  "copyright": "© 2024 NEMA",
  "compose": {
    "include": [
      {
        "system": "http://sig.biostr.washington.edu/projects/fm/AboutFM.html",
        "concept": [
          {
            "code": "264779",
            "display": "Nasion"
          }
        ]
      },
      {
        "system": "http://snomed.info/sct",
        "concept": [
          {
            "code": "60911003",
            "display": "Temporal Bone"
          },
          {
            "code": "15924003",
            "display": "Maxillary sinus"
          },
          {
            "code": "42575006",
            "display": "Pituitary Fossa"
          },
          {
            "code": "91609006",
            "display": "Mandible"
          },
          {
            "code": "91716001",
            "display": "Mastoid cells and antra"
          },
          {
            "code": "59066005",
            "display": "Mastoid bone"
          },
          {
            "code": "55060009",
            "display": "Frontal sinus"
          },
          {
            "code": "89546000",
            "display": "Skull"
          },
          {
            "code": "61671002",
            "display": "Internal Auditory Meatus"
          },
          {
            "code": "69105007",
            "display": "Carotid Artery"
          },
          {
            "code": "84301002",
            "display": "External Auditory Meatus"
          },
          {
            "code": "88986008",
            "display": "Vertex of Head"
          },
          {
            "code": "24532009",
            "display": "Foramen Magnum"
          },
          {
            "code": "61242005",
            "display": "Lateral Canthus"
          },
          {
            "code": "363654007",
            "display": "Orbital structure"
          }
        ]
      }
    ]
  },
  "meta": {
    "tag": [
      {
        "system": "https://mii-termserv.de/fhir/su-termserv/CodeSystem/mii-cs-suts-resource-tags-project",
        "code": "dicom",
        "display": "Digital Imaging and Communications in Medicine"
      },
      {
        "system": "https://mii-termserv.de/fhir/su-termserv/CodeSystem/mii-cs-suts-resource-tags-project",
        "code": "international",
        "display": "International standard terminology"
      },
      {
        "system": "https://mii-termserv.de/fhir/su-termserv/CodeSystem/mii-cs-suts-resource-tags-dataset",
        "code": "dicom",
        "display": "DICOM Terminology"
      },
      {
        "system": "https://mii-termserv.de/fhir/su-termserv/CodeSystem/mii-cs-suts-resource-tags-dataset",
        "code": "standard",
        "display": "International Standards"
      },
      {
        "system": "https://mii-termserv.de/fhir/su-termserv/CodeSystem/mii-cs-suts-resource-tags-license",
        "code": "https://mii-termserv.de/licenses#dicom",
        "display": "DICOM license"
      }
    ]
  },
  "title": "AnatomicalReferenceBasisHead",
  "text": {
    "status": "generated",
    "div": "<div xmlns=\"http://www.w3.org/1999/xhtml\"><h2>AnatomicalReferenceBasisHead</h2><tt>http://dicom.nema.org/medical/dicom/current/output/chtml/part16/sect_CID_1002.html</tt><p>Transitive closure of CID 1002 AnatomicalReferenceBasisHead</p><div><p><b>SU-TermServ Metadata</b></p><table><tbody><tr><td><b>Projects</b></td><td><ul><li>Digital Imaging and Communications in Medicine</li><li>International standard terminology</li></ul></td></tr><tr><td><b>Datasets</b></td><td><ul><li>DICOM Terminology</li><li>International Standards</li></ul></td></tr><tr><td><b>License</b></td><td><a href=\"https://mii-termserv.de/licenses#dicom\">DICOM license</a></td></tr><tr><td><b>Package Scope</b></td><td><a href=\"https://gitlab.com/groups/mii-termserv/fhir-resources/-/packages/?ForderBy%3Dversion%26sort%3Ddesc%26search%5B%5D%3D@mii-termserv/dicom.terminology\"><code>@mii-termserv/dicom.terminology</code></a></td></tr></tbody></table></div></div>"
  },
  "extension": [
    {
      "url": "http://hl7.org/fhir/StructureDefinition/cqf-scope",
      "valueString": "@mii-termserv/dicom.terminology"
    }
  ]
}