{
  "resourceType": "ValueSet",
  "id": "dicom-cid-6029-RecommendedFollowupFromBIRADS",
  "url": "http://dicom.nema.org/medical/dicom/current/output/chtml/part16/sect_CID_6029.html",
  "identifier": [
    {
      "system": "urn:ietf:rfc:3986",
      "value": "urn:oid:1.2.840.10008.6.1.359"
    }
  ],
  "version": "20160314",
  "name": "RecommendedFollowupfromBIRADS®",
  "status": "active",
  "experimental": false,
  "date": "2024-06-17",
  "publisher": "NEMA MITA DICOM",
  "description": "Transitive closure of CID 6029 RecommendedFollowupfromBIRADS®",
  "copyright": "© 2024 NEMA",
  "compose": {
    "include": [
      {
        "system": "http://dicom.nema.org/resources/ontology/DCM",
        "concept": [
          {
            "code": "111140",
            "display": "Normal interval follow-up"
          },
          {
            "code": "111141",
            "display": "Any decision to biopsy should be based on clinical assessment"
          },
          {
            "code": "111142",
            "display": "Follow-up at short interval (1-11 months)"
          },
          {
            "code": "111143",
            "display": "Biopsy should be considered"
          },
          {
            "code": "111144",
            "display": "Needle localization and biopsy"
          },
          {
            "code": "111122",
            "display": "Known biopsy proven malignancy - take appropriate action"
          },
          {
            "code": "111145",
            "display": "Histology using core biopsy"
          },
          {
            "code": "111135",
            "display": "Additional projections"
          },
          {
            "code": "111146",
            "display": "Suggestive of malignancy - take appropriate action"
          },
          {
            "code": "111136",
            "display": "Spot magnification view(s)"
          },
          {
            "code": "111147",
            "display": "Cytologic analysis"
          },
          {
            "code": "111148",
            "display": "Biopsy should be strongly considered"
          },
          {
            "code": "111138",
            "display": "Old films for comparison"
          },
          {
            "code": "111149",
            "display": "Highly suggestive of malignancy - take appropriate action"
          }
        ]
      },
      {
        "system": "http://snomed.info/sct",
        "concept": [
          {
            "code": "399055006",
            "display": "Spot compression"
          },
          {
            "code": "241615005",
            "display": "MRI of breast"
          },
          {
            "code": "16310003",
            "display": "Diagnostic ultrasonography"
          },
          {
            "code": "399163009",
            "display": "Magnification views"
          },
          {
            "code": "18102001",
            "display": "Mammary ductogram"
          }
        ]
      }
    ]
  },
  "meta": {
    "tag": [
      {
        "system": "https://mii-termserv.de/fhir/su-termserv/CodeSystem/mii-cs-suts-resource-tags-project",
        "code": "dicom",
        "display": "Digital Imaging and Communications in Medicine"
      },
      {
        "system": "https://mii-termserv.de/fhir/su-termserv/CodeSystem/mii-cs-suts-resource-tags-project",
        "code": "international",
        "display": "International standard terminology"
      },
      {
        "system": "https://mii-termserv.de/fhir/su-termserv/CodeSystem/mii-cs-suts-resource-tags-dataset",
        "code": "dicom",
        "display": "DICOM Terminology"
      },
      {
        "system": "https://mii-termserv.de/fhir/su-termserv/CodeSystem/mii-cs-suts-resource-tags-dataset",
        "code": "standard",
        "display": "International Standards"
      },
      {
        "system": "https://mii-termserv.de/fhir/su-termserv/CodeSystem/mii-cs-suts-resource-tags-license",
        "code": "https://mii-termserv.de/licenses#dicom",
        "display": "DICOM license"
      }
    ]
  },
  "title": "RecommendedFollowupfromBIRADS®",
  "text": {
    "status": "generated",
    "div": "<div xmlns=\"http://www.w3.org/1999/xhtml\"><h2>RecommendedFollowupfromBIRADS®</h2><tt>http://dicom.nema.org/medical/dicom/current/output/chtml/part16/sect_CID_6029.html</tt><p>Transitive closure of CID 6029 RecommendedFollowupfromBIRADS®</p><div><p><b>SU-TermServ Metadata</b></p><table><tbody><tr><td><b>Projects</b></td><td><ul><li>Digital Imaging and Communications in Medicine</li><li>International standard terminology</li></ul></td></tr><tr><td><b>Datasets</b></td><td><ul><li>DICOM Terminology</li><li>International Standards</li></ul></td></tr><tr><td><b>License</b></td><td><a href=\"https://mii-termserv.de/licenses#dicom\">DICOM license</a></td></tr><tr><td><b>Package Scope</b></td><td><a href=\"https://gitlab.com/groups/mii-termserv/fhir-resources/-/packages/?ForderBy%3Dversion%26sort%3Ddesc%26search%5B%5D%3D@mii-termserv/dicom.terminology\"><code>@mii-termserv/dicom.terminology</code></a></td></tr></tbody></table></div></div>"
  },
  "extension": [
    {
      "url": "http://hl7.org/fhir/StructureDefinition/cqf-scope",
      "valueString": "@mii-termserv/dicom.terminology"
    }
  ]
}