{
  "resourceType": "ValueSet",
  "id": "dicom-cid-8124-MicroscopyFilter",
  "url": "http://dicom.nema.org/medical/dicom/current/output/chtml/part16/sect_CID_8124.html",
  "identifier": [
    {
      "system": "urn:ietf:rfc:3986",
      "value": "urn:oid:1.2.840.10008.6.1.901"
    }
  ],
  "version": "20100824",
  "name": "MicroscopyFilter",
  "status": "active",
  "experimental": false,
  "date": "2024-06-17",
  "publisher": "NEMA MITA DICOM",
  "description": "Transitive closure of CID 8124 MicroscopyFilter",
  "copyright": "© 2024 NEMA",
  "compose": {
    "include": [
      {
        "system": "http://dicom.nema.org/resources/ontology/DCM",
        "concept": [
          {
            "code": "111609",
            "display": "No filter"
          }
        ]
      },
      {
        "system": "http://snomed.info/sct",
        "concept": [
          {
            "code": "445084008",
            "display": "Blue optical filter"
          },
          {
            "code": "445633006",
            "display": "Nomarski prism"
          },
          {
            "code": "445465004",
            "display": "Green optical filter"
          },
          {
            "code": "445635004",
            "display": "Hoffman modulator"
          },
          {
            "code": "445634000",
            "display": "Condenser annulus"
          },
          {
            "code": "445391002",
            "display": "Polarizing optical filter"
          },
          {
            "code": "445278001",
            "display": "Violet optical filter"
          },
          {
            "code": "445169002",
            "display": "Infrared optical filter"
          },
          {
            "code": "445624009",
            "display": "Darkfield stop"
          },
          {
            "code": "445623003",
            "display": "Rheinberg filter"
          },
          {
            "code": "445254006",
            "display": "Ultraviolet optical filter"
          },
          {
            "code": "445316008",
            "display": "Dichroic beamsplitter"
          },
          {
            "code": "445625005",
            "display": "Phase contrast plate"
          },
          {
            "code": "445279009",
            "display": "Red optical filter"
          },
          {
            "code": "445663002",
            "display": "de Sénarmont compensator"
          }
        ]
      }
    ]
  },
  "meta": {
    "tag": [
      {
        "system": "https://mii-termserv.de/fhir/su-termserv/CodeSystem/mii-cs-suts-resource-tags-project",
        "code": "dicom",
        "display": "Digital Imaging and Communications in Medicine"
      },
      {
        "system": "https://mii-termserv.de/fhir/su-termserv/CodeSystem/mii-cs-suts-resource-tags-project",
        "code": "international",
        "display": "International standard terminology"
      },
      {
        "system": "https://mii-termserv.de/fhir/su-termserv/CodeSystem/mii-cs-suts-resource-tags-dataset",
        "code": "dicom",
        "display": "DICOM Terminology"
      },
      {
        "system": "https://mii-termserv.de/fhir/su-termserv/CodeSystem/mii-cs-suts-resource-tags-dataset",
        "code": "standard",
        "display": "International Standards"
      },
      {
        "system": "https://mii-termserv.de/fhir/su-termserv/CodeSystem/mii-cs-suts-resource-tags-license",
        "code": "https://mii-termserv.de/licenses#dicom",
        "display": "DICOM license"
      }
    ]
  },
  "title": "MicroscopyFilter",
  "text": {
    "status": "generated",
    "div": "<div xmlns=\"http://www.w3.org/1999/xhtml\"><h2>MicroscopyFilter</h2><tt>http://dicom.nema.org/medical/dicom/current/output/chtml/part16/sect_CID_8124.html</tt><p>Transitive closure of CID 8124 MicroscopyFilter</p><div><p><b>SU-TermServ Metadata</b></p><table><tbody><tr><td><b>Projects</b></td><td><ul><li>Digital Imaging and Communications in Medicine</li><li>International standard terminology</li></ul></td></tr><tr><td><b>Datasets</b></td><td><ul><li>DICOM Terminology</li><li>International Standards</li></ul></td></tr><tr><td><b>License</b></td><td><a href=\"https://mii-termserv.de/licenses#dicom\">DICOM license</a></td></tr><tr><td><b>Package Scope</b></td><td><a href=\"https://gitlab.com/groups/mii-termserv/fhir-resources/-/packages/?ForderBy%3Dversion%26sort%3Ddesc%26search%5B%5D%3D@mii-termserv/dicom.terminology\"><code>@mii-termserv/dicom.terminology</code></a></td></tr></tbody></table></div></div>"
  },
  "extension": [
    {
      "url": "http://hl7.org/fhir/StructureDefinition/cqf-scope",
      "valueString": "@mii-termserv/dicom.terminology"
    }
  ]
}