{
  "resourceType": "ValueSet",
  "id": "dicom-cid-3630-CardiovascularAnatomicLocation",
  "url": "http://dicom.nema.org/medical/dicom/current/output/chtml/part16/sect_CID_3630.html",
  "identifier": [
    {
      "system": "urn:ietf:rfc:3986",
      "value": "urn:oid:1.2.840.10008.6.1.175"
    }
  ],
  "version": "20030327",
  "name": "CardiovascularAnatomicLocation",
  "status": "active",
  "experimental": false,
  "date": "2024-06-17",
  "publisher": "NEMA MITA DICOM",
  "description": "Transitive closure of CID 3630 CardiovascularAnatomicLocation",
  "copyright": "© 2024 NEMA",
  "compose": {
    "include": [
      {
        "system": "http://snomed.info/sct",
        "concept": [
          {
            "code": "9454009",
            "display": "Subclavian vein"
          },
          {
            "code": "86117002",
            "display": "internal carotid artery"
          },
          {
            "code": "39057004",
            "display": "Pulmonary valve"
          },
          {
            "code": "59011009",
            "display": "basilar artery"
          },
          {
            "code": "34202007",
            "display": "Aortic Valve"
          },
          {
            "code": "44830000",
            "display": "lateral plantar artery"
          },
          {
            "code": "128565007",
            "display": "Right ventricle apex"
          },
          {
            "code": "64131007",
            "display": "Inferior Vena cava"
          },
          {
            "code": "78480002",
            "display": "Right pulmonary artery"
          },
          {
            "code": "70238003",
            "display": "Left ventricle inflow"
          },
          {
            "code": "128559007",
            "display": "geniculate artery"
          },
          {
            "code": "34340008",
            "display": "Central venous system"
          },
          {
            "code": "69105007",
            "display": "Carotid Artery"
          },
          {
            "code": "253276007",
            "display": "Common atrium"
          },
          {
            "code": "50536004",
            "display": "Umbilical artery"
          },
          {
            "code": "14944004",
            "display": "Neo-aorta (primitive aorta)"
          },
          {
            "code": "128551005",
            "display": "Aortic fistula"
          },
          {
            "code": "13418002",
            "display": "Left ventricle outflow tract"
          },
          {
            "code": "45631007",
            "display": "radial artery"
          },
          {
            "code": "69833005",
            "display": "Right femoral artery"
          },
          {
            "code": "72021004",
            "display": "superior thyroid artery"
          },
          {
            "code": "10293006",
            "display": "Iliac artery"
          },
          {
            "code": "113270003",
            "display": "Left femoral artery"
          },
          {
            "code": "61959006",
            "display": "Truncus Arteriosus Communis"
          },
          {
            "code": "51114001",
            "display": "Artery"
          },
          {
            "code": "128553008",
            "display": "Antecubital Vein"
          },
          {
            "code": "32062004",
            "display": "Common carotid artery"
          },
          {
            "code": "15825003",
            "display": "Aorta"
          },
          {
            "code": "83330001",
            "display": "patent ductus arteriosus"
          },
          {
            "code": "15672000",
            "display": "superficial temporal artery"
          },
          {
            "code": "128583004",
            "display": "mesenteric vein"
          },
          {
            "code": "29092000",
            "display": "Vein"
          },
          {
            "code": "128556000",
            "display": "Fistula coronary to left ventricle"
          },
          {
            "code": "122972007",
            "display": "Pulmonary vein"
          },
          {
            "code": "41801008",
            "display": "Coronary Artery"
          },
          {
            "code": "32672002",
            "display": "Descending aorta"
          },
          {
            "code": "111289009",
            "display": "Pulmonary arteriovenous fistula"
          },
          {
            "code": "36765005",
            "display": "Subclavian Artery"
          },
          {
            "code": "181351007",
            "display": "tibial artery"
          },
          {
            "code": "8017000",
            "display": "Right ventricle inflow"
          },
          {
            "code": "53549008",
            "display": "ophthalmic artery"
          },
          {
            "code": "86570000",
            "display": "mesenteric artery"
          },
          {
            "code": "74156002",
            "display": "medial plantar artery"
          },
          {
            "code": "43899006",
            "display": "popliteal artery"
          },
          {
            "code": "128567004",
            "display": "Pulmonary venous atrium"
          },
          {
            "code": "20115005",
            "display": "Brachial vein"
          },
          {
            "code": "128586007",
            "display": "Pulmonary chamber in cor triatriatum"
          },
          {
            "code": "128448001",
            "display": "Pulmonary capillary wedge"
          },
          {
            "code": "48345005",
            "display": "Superior vena cava"
          },
          {
            "code": "87878005",
            "display": "Left ventricle"
          },
          {
            "code": "17388009",
            "display": "anterior spinal artery"
          },
          {
            "code": "76015000",
            "display": "Hepatic artery"
          },
          {
            "code": "35819009",
            "display": "splenic vein"
          },
          {
            "code": "8821006",
            "display": "peroneal artery"
          },
          {
            "code": "44627009",
            "display": "Right ventricle outflow tract"
          },
          {
            "code": "362072009",
            "display": "Saphenous vein"
          },
          {
            "code": "12691009",
            "display": "brachiocephalic trunk"
          },
          {
            "code": "2841007",
            "display": "Renal artery"
          },
          {
            "code": "128589000",
            "display": "Systemic collateral Artery to lung"
          },
          {
            "code": "23074001",
            "display": "facial artery"
          },
          {
            "code": "34635009",
            "display": "lumbar artery"
          },
          {
            "code": "128564006",
            "display": "Left ventricle apex"
          },
          {
            "code": "30288003",
            "display": "Ventricular Septal defect"
          },
          {
            "code": "72107004",
            "display": "Azygos vein"
          },
          {
            "code": "81040000",
            "display": "Pulmonary artery"
          },
          {
            "code": "7657000",
            "display": "Femoral artery"
          },
          {
            "code": "17137000",
            "display": "Brachial artery"
          },
          {
            "code": "373095005",
            "display": "Fistula coronary to right atrium"
          },
          {
            "code": "91134007",
            "display": "Mitral Valve"
          },
          {
            "code": "128558004",
            "display": "Fistula coronary to right ventricle"
          },
          {
            "code": "128569001",
            "display": "posterior medial tributary"
          },
          {
            "code": "7305005",
            "display": "Coarctation of aorta"
          },
          {
            "code": "181347005",
            "display": "Common Femoral Artery"
          },
          {
            "code": "128584005",
            "display": "Pulmonary artery conduit"
          },
          {
            "code": "46030003",
            "display": "Tricuspid valve"
          },
          {
            "code": "73829009",
            "display": "Right Atrium"
          },
          {
            "code": "8012006",
            "display": "anterior communicating artery"
          },
          {
            "code": "128555001",
            "display": "Fistula coronary to left atrium"
          },
          {
            "code": "53085002",
            "display": "Right ventricle"
          },
          {
            "code": "113262008",
            "display": "Thoracic aorta"
          },
          {
            "code": "45503006",
            "display": "Common ventricle"
          },
          {
            "code": "70142008",
            "display": "Atrial Septal defect"
          },
          {
            "code": "371829003",
            "display": "Pulmonary vein wedge"
          },
          {
            "code": "90219004",
            "display": "Coronary sinus"
          },
          {
            "code": "67937003",
            "display": "Axillary Artery"
          },
          {
            "code": "50408007",
            "display": "Left pulmonary artery"
          },
          {
            "code": "8993003",
            "display": "hepatic vein"
          },
          {
            "code": "69327007",
            "display": "Internal mammary artery"
          },
          {
            "code": "85234005",
            "display": "Vertebral artery"
          },
          {
            "code": "128566008",
            "display": "Pulmonary vein confluence"
          },
          {
            "code": "128587003",
            "display": "Saphenofemoral junction"
          },
          {
            "code": "12123001",
            "display": "Internal jugular vein"
          },
          {
            "code": "284639000",
            "display": "Umbilical vein"
          },
          {
            "code": "83419000",
            "display": "Femoral vein"
          },
          {
            "code": "8887007",
            "display": "Innominate vein"
          },
          {
            "code": "91707000",
            "display": "Neonatal pulmonary artery (primitive PA)"
          },
          {
            "code": "181349008",
            "display": "Superficial Femoral Artery"
          },
          {
            "code": "32764006",
            "display": "portal vein"
          },
          {
            "code": "43119007",
            "display": "posterior communicating artery"
          },
          {
            "code": "128563000",
            "display": "Juxtaposed appendage"
          },
          {
            "code": "57034009",
            "display": "Aortic Arch"
          },
          {
            "code": "56400007",
            "display": "Renal vein"
          },
          {
            "code": "128548003",
            "display": "Boyd perforating vein"
          },
          {
            "code": "7832008",
            "display": "Abdominal aorta"
          },
          {
            "code": "20699002",
            "display": "cephalic vein"
          },
          {
            "code": "113264009",
            "display": "lingual artery"
          },
          {
            "code": "110568007",
            "display": "gastric vein"
          },
          {
            "code": "128981007",
            "display": "Baffle"
          },
          {
            "code": "59749000",
            "display": "lacrimal artery"
          },
          {
            "code": "19715009",
            "display": "Basilic vein"
          },
          {
            "code": "31145008",
            "display": "occipital artery"
          },
          {
            "code": "128568009",
            "display": "Systemic venous atrium"
          },
          {
            "code": "128560002",
            "display": "Hunterian perforating vein"
          },
          {
            "code": "54247002",
            "display": "Ascending aorta"
          },
          {
            "code": "128585006",
            "display": "Anomalous pulmonary vein"
          },
          {
            "code": "31677005",
            "display": "Profunda Femoris Artery"
          },
          {
            "code": "82471001",
            "display": "Left atrium"
          },
          {
            "code": "88556005",
            "display": "cerebral artery"
          },
          {
            "code": "68705008",
            "display": "Axillary vein"
          },
          {
            "code": "60734001",
            "display": "Great saphenous vein"
          },
          {
            "code": "128449009",
            "display": "Pulmonary artery wedge"
          },
          {
            "code": "128554002",
            "display": "Dodd perforating vein"
          }
        ]
      }
    ]
  },
  "meta": {
    "tag": [
      {
        "system": "https://mii-termserv.de/fhir/su-termserv/CodeSystem/mii-cs-suts-resource-tags-project",
        "code": "dicom",
        "display": "Digital Imaging and Communications in Medicine"
      },
      {
        "system": "https://mii-termserv.de/fhir/su-termserv/CodeSystem/mii-cs-suts-resource-tags-project",
        "code": "international",
        "display": "International standard terminology"
      },
      {
        "system": "https://mii-termserv.de/fhir/su-termserv/CodeSystem/mii-cs-suts-resource-tags-dataset",
        "code": "dicom",
        "display": "DICOM Terminology"
      },
      {
        "system": "https://mii-termserv.de/fhir/su-termserv/CodeSystem/mii-cs-suts-resource-tags-dataset",
        "code": "standard",
        "display": "International Standards"
      },
      {
        "system": "https://mii-termserv.de/fhir/su-termserv/CodeSystem/mii-cs-suts-resource-tags-license",
        "code": "https://mii-termserv.de/licenses#dicom",
        "display": "DICOM license"
      }
    ]
  },
  "title": "CardiovascularAnatomicLocation",
  "text": {
    "status": "generated",
    "div": "<div xmlns=\"http://www.w3.org/1999/xhtml\"><h2>CardiovascularAnatomicLocation</h2><tt>http://dicom.nema.org/medical/dicom/current/output/chtml/part16/sect_CID_3630.html</tt><p>Transitive closure of CID 3630 CardiovascularAnatomicLocation</p><div><p><b>SU-TermServ Metadata</b></p><table><tbody><tr><td><b>Projects</b></td><td><ul><li>Digital Imaging and Communications in Medicine</li><li>International standard terminology</li></ul></td></tr><tr><td><b>Datasets</b></td><td><ul><li>DICOM Terminology</li><li>International Standards</li></ul></td></tr><tr><td><b>License</b></td><td><a href=\"https://mii-termserv.de/licenses#dicom\">DICOM license</a></td></tr><tr><td><b>Package Scope</b></td><td><a href=\"https://gitlab.com/groups/mii-termserv/fhir-resources/-/packages/?ForderBy%3Dversion%26sort%3Ddesc%26search%5B%5D%3D@mii-termserv/dicom.terminology\"><code>@mii-termserv/dicom.terminology</code></a></td></tr></tbody></table></div></div>"
  },
  "extension": [
    {
      "url": "http://hl7.org/fhir/StructureDefinition/cqf-scope",
      "valueString": "@mii-termserv/dicom.terminology"
    }
  ]
}