{
  "resourceType": "CodeSystem",
  "status": "active",
  "content": "not-present",
  "name": "ABDATA_Wirkstoffgruppe14",
  "id": "abdata-wg14",
  "title": "ABDATA Wirkstoffgruppe 14",
  "description": "Die sogenannte WG14-Nummer (Wirkstoffgruppe 2014) wird von ABDATA neben der eigentlichen Standardverordnungszeile zum Zweck der eindeutigen Identifizierung erstellt und besteht aus fünf Ziffern sowie einer Prüfziffer an der sechsten Stelle. Jeder Code entspricht genau einer bestimmten Standardverordnungszeile. Über Eingabe dieses Codes in die Apotheken-Software erhält man unmittelbar eine PZN-basierte Liste aller dazugehörigen Fertigarzneimittel. Innerhalb der Zeile folgen die Wirkstoffbezeichnung, Stärke, Darreichungsform, Mengenangabe sowie Normgröße N1, N2 oder N3 – sofern vorhanden",
  "version": "1.0.0",
  "url": "http://fhir.de/CodeSystem/abdata/wg14",
  "meta": {
    "tag": [
      {
        "system": "https://mii-termserv.de/fhir/su-termserv/CodeSystem/mii-cs-suts-resource-tags-dataset",
        "code": "medication-germany",
        "display": "Resources in use for medication in Germany"
      },
      {
        "system": "https://mii-termserv.de/fhir/su-termserv/CodeSystem/mii-cs-suts-resource-tags-project",
        "code": "unavailable",
        "display": "Unavailable"
      },
      {
        "system": "https://mii-termserv.de/fhir/su-termserv/CodeSystem/mii-cs-suts-resource-tags-dataset",
        "code": "unavailable",
        "display": "Unavailable"
      },
      {
        "system": "https://mii-termserv.de/fhir/su-termserv/CodeSystem/mii-cs-suts-resource-tags-license",
        "code": "https://mii-termserv.de/licenses#unavailable",
        "display": "Unavailable"
      }
    ]
  },
  "copyright": "ABDATA Pharma-Daten-Service der Avoxa - Mediengruppe Deutscher Apotheker GmbH",
  "valueSet": "http://fhir.de/ValueSet/abdata/wg14",
  "extension": [
    {
      "url": "http://hl7.org/fhir/StructureDefinition/cqf-scope",
      "valueString": "@mii-termserv/de.sutermserv.placeholders"
    }
  ],
  "experimental": false,
  "text": {
    "status": "generated",
    "div": "<div xmlns=\"http://www.w3.org/1999/xhtml\"><h2>ABDATA Wirkstoffgruppe 14</h2><tt>http://fhir.de/CodeSystem/abdata/wg14</tt><p>Die sogenannte WG14-Nummer (Wirkstoffgruppe 2014) wird von ABDATA neben der eigentlichen Standardverordnungszeile zum Zweck der eindeutigen Identifizierung erstellt und besteht aus fünf Ziffern sowie einer Prüfziffer an der sechsten Stelle. Jeder Code entspricht genau einer bestimmten Standardverordnungszeile. Über Eingabe dieses Codes in die Apotheken-Software erhält man unmittelbar eine PZN-basierte Liste aller dazugehörigen Fertigarzneimittel. Innerhalb der Zeile folgen die Wirkstoffbezeichnung, Stärke, Darreichungsform, Mengenangabe sowie Normgröße N1, N2 oder N3 – sofern vorhanden</p><div><p><b>SU-TermServ Metadata</b></p><table><tbody><tr><td><b>Project</b></td><td>Unavailable</td></tr><tr><td><b>Dataset</b></td><td>Unavailable</td></tr><tr><td><b>License</b></td><td><a href=\"https://mii-termserv.de/licenses#unavailable\">Unavailable</a></td></tr><tr><td><b>Package Scope</b></td><td><a href=\"https://gitlab.com/groups/mii-termserv/fhir-resources/-/packages/?ForderBy%3Dversion%26sort%3Ddesc%26search%5B%5D%3D@mii-termserv/de.sutermserv.placeholders\"><code>@mii-termserv/de.sutermserv.placeholders</code></a></td></tr></tbody></table></div></div>"
  }
}