{
  "resourceType": "CodeSystem",
  "status": "active",
  "content": "not-present",
  "name": "BCP47",
  "id": "bcp47",
  "title": "BCP47 Tags for Identifying Languages and Matching of Language Tags",
  "description": "BCP13 is an internet standard for assigning language tags. It is comprised of two RFCs, RFC 4647 and RFC 5646. Language tag registration is carried out by the Internet Assigned Numbers Authority (IANA) For more details, see the the BCP47 document: https://www.rfc-editor.org/info/bcp47.",
  "version": "1.0.0",
  "url": "urn:ietf:bcp:47",
  "meta": {
    "tag": [
      {
        "system": "https://mii-termserv.de/fhir/su-termserv/CodeSystem/mii-cs-suts-resource-tags-project",
        "code": "international",
        "display": "International standard terminology"
      },
      {
        "system": "https://mii-termserv.de/fhir/su-termserv/CodeSystem/mii-cs-suts-resource-tags-dataset",
        "code": "standard",
        "display": "International Standards"
      },
      {
        "system": "https://mii-termserv.de/fhir/su-termserv/CodeSystem/mii-cs-suts-resource-tags-license",
        "code": "https://mii-termserv.de/licenses#ietf-iana",
        "display": "IETF/IANA license terms"
      },
      {
        "system": "https://mii-termserv.de/fhir/su-termserv/CodeSystem/mii-cs-suts-resource-tags-project",
        "code": "unavailable",
        "display": "Unavailable"
      },
      {
        "system": "https://mii-termserv.de/fhir/su-termserv/CodeSystem/mii-cs-suts-resource-tags-dataset",
        "code": "unavailable",
        "display": "Unavailable"
      },
      {
        "system": "https://mii-termserv.de/fhir/su-termserv/CodeSystem/mii-cs-suts-resource-tags-license",
        "code": "https://mii-termserv.de/licenses#unavailable",
        "display": "Unavailable"
      }
    ]
  },
  "copyright": "IANA maintains the Language Subtag Registry. They may be freely used, see https://www.iana.org/help/licensing-terms for more information.",
  "extension": [
    {
      "url": "http://hl7.org/fhir/StructureDefinition/cqf-scope",
      "valueString": "@mii-termserv/de.sutermserv.placeholders"
    }
  ],
  "experimental": false,
  "text": {
    "status": "generated",
    "div": "<div xmlns=\"http://www.w3.org/1999/xhtml\"><h2>BCP47 Tags for Identifying Languages and Matching of Language Tags</h2><tt>urn:ietf:bcp:47</tt><p>BCP13 is an internet standard for assigning language tags. It is comprised of two RFCs, RFC 4647 and RFC 5646. Language tag registration is carried out by the Internet Assigned Numbers Authority (IANA) For more details, see the the BCP47 document: https://www.rfc-editor.org/info/bcp47.</p><div><p><b>SU-TermServ Metadata</b></p><table><tbody><tr><td><b>Project</b></td><td>Unavailable</td></tr><tr><td><b>Dataset</b></td><td>Unavailable</td></tr><tr><td><b>License</b></td><td><a href=\"https://mii-termserv.de/licenses#unavailable\">Unavailable</a></td></tr><tr><td><b>Package Scope</b></td><td><a href=\"https://gitlab.com/groups/mii-termserv/fhir-resources/-/packages/?ForderBy%3Dversion%26sort%3Ddesc%26search%5B%5D%3D@mii-termserv/de.sutermserv.placeholders\"><code>@mii-termserv/de.sutermserv.placeholders</code></a></td></tr></tbody></table></div></div>"
  }
}