{
  "resourceType": "CodeSystem",
  "status": "active",
  "content": "not-present",
  "name": "RxNorm",
  "id": "rxnorm",
  "title": "RxNorm",
  "description": "RxNorm is a complex terminology for the coding of pharmaceutical products and substances for the use in the United States.",
  "version": "1.0.0",
  "url": "http://www.nlm.nih.gov/research/umls/rxnorm",
  "meta": {
    "tag": [
      {
        "system": "https://mii-termserv.de/fhir/su-termserv/CodeSystem/mii-cs-suts-resource-tags-project",
        "code": "unavailable",
        "display": "Unavailable"
      },
      {
        "system": "https://mii-termserv.de/fhir/su-termserv/CodeSystem/mii-cs-suts-resource-tags-dataset",
        "code": "unavailable",
        "display": "Unavailable"
      },
      {
        "system": "https://mii-termserv.de/fhir/su-termserv/CodeSystem/mii-cs-suts-resource-tags-license",
        "code": "https://mii-termserv.de/licenses#unavailable",
        "display": "Unavailable"
      }
    ]
  },
  "copyright": "National Library of Medicine, National Institutes of Health, U.S. Department of Health and Human Services",
  "extension": [
    {
      "url": "http://hl7.org/fhir/StructureDefinition/cqf-scope",
      "valueString": "@mii-termserv/de.sutermserv.placeholders"
    }
  ],
  "experimental": false,
  "text": {
    "status": "generated",
    "div": "<div xmlns=\"http://www.w3.org/1999/xhtml\"><h2>RxNorm</h2><tt>http://www.nlm.nih.gov/research/umls/rxnorm</tt><p>RxNorm is a complex terminology for the coding of pharmaceutical products and substances for the use in the United States.</p><div><p><b>SU-TermServ Metadata</b></p><table><tbody><tr><td><b>Project</b></td><td>Unavailable</td></tr><tr><td><b>Dataset</b></td><td>Unavailable</td></tr><tr><td><b>License</b></td><td><a href=\"https://mii-termserv.de/licenses#unavailable\">Unavailable</a></td></tr><tr><td><b>Package Scope</b></td><td><a href=\"https://gitlab.com/groups/mii-termserv/fhir-resources/-/packages/?ForderBy%3Dversion%26sort%3Ddesc%26search%5B%5D%3D@mii-termserv/de.sutermserv.placeholders\"><code>@mii-termserv/de.sutermserv.placeholders</code></a></td></tr></tbody></table></div></div>"
  }
}