{
  "resourceType": "CodeSystem",
  "status": "active",
  "content": "not-present",
  "name": "ISO3166Part1",
  "id": "iso-3166-part-1",
  "title": "ISO 3166-1",
  "description": "ISO 3166-1 establishes codes that represent the current names of countries, dependencies, and other areas of particular geopolitical interest, on the basis of country names obtained from the United Nations.",
  "version": "1.0.0",
  "url": "urn:iso:std:iso:3166",
  "meta": {
    "tag": [
      {
        "system": "https://mii-termserv.de/fhir/su-termserv/CodeSystem/mii-cs-suts-resource-tags-project",
        "code": "international",
        "display": "International standard terminology"
      },
      {
        "system": "https://mii-termserv.de/fhir/su-termserv/CodeSystem/mii-cs-suts-resource-tags-dataset",
        "code": "standard",
        "display": "International Standards"
      },
      {
        "system": "https://mii-termserv.de/fhir/su-termserv/CodeSystem/mii-cs-suts-resource-tags-license",
        "code": "https://mii-termserv.de/licenses#iso",
        "display": "ISO standards licenses"
      },
      {
        "system": "https://mii-termserv.de/fhir/su-termserv/CodeSystem/mii-cs-suts-resource-tags-project",
        "code": "unavailable",
        "display": "Unavailable"
      },
      {
        "system": "https://mii-termserv.de/fhir/su-termserv/CodeSystem/mii-cs-suts-resource-tags-dataset",
        "code": "unavailable",
        "display": "Unavailable"
      },
      {
        "system": "https://mii-termserv.de/fhir/su-termserv/CodeSystem/mii-cs-suts-resource-tags-license",
        "code": "https://mii-termserv.de/licenses#unavailable",
        "display": "Unavailable"
      }
    ]
  },
  "copyright": "ISO maintains the copyright on the country codes, and controls its use carefully. For futher details see the ISO 3166 web page: https://www.iso.org/iso-3166-country-codes.html",
  "extension": [
    {
      "url": "http://hl7.org/fhir/StructureDefinition/cqf-scope",
      "valueString": "@mii-termserv/de.sutermserv.placeholders"
    }
  ],
  "experimental": false,
  "text": {
    "status": "generated",
    "div": "<div xmlns=\"http://www.w3.org/1999/xhtml\"><h2>ISO 3166-1</h2><tt>urn:iso:std:iso:3166</tt><p>ISO 3166-1 establishes codes that represent the current names of countries, dependencies, and other areas of particular geopolitical interest, on the basis of country names obtained from the United Nations.</p><div><p><b>SU-TermServ Metadata</b></p><table><tbody><tr><td><b>Project</b></td><td>Unavailable</td></tr><tr><td><b>Dataset</b></td><td>Unavailable</td></tr><tr><td><b>License</b></td><td><a href=\"https://mii-termserv.de/licenses#unavailable\">Unavailable</a></td></tr><tr><td><b>Package Scope</b></td><td><a href=\"https://gitlab.com/groups/mii-termserv/fhir-resources/-/packages/?ForderBy%3Dversion%26sort%3Ddesc%26search%5B%5D%3D@mii-termserv/de.sutermserv.placeholders\"><code>@mii-termserv/de.sutermserv.placeholders</code></a></td></tr></tbody></table></div></div>"
  }
}