{
  "resourceType": "CodeSystem",
  "status": "active",
  "content": "not-present",
  "name": "ATC_DIMDI",
  "id": "atc-dimdi",
  "title": "ATC DIMDI",
  "description": "The canonical URL for the ATC CodeSystem was changed from http://fhir.de/CodeSystem/dimdi/atc to http://fhir.de/CodeSystem/bfarm/atc. The code system will not be made available as FHIR using the old URI at this time.",
  "url": "http://fhir.de/CodeSystem/dimdi/atc",
  "meta": {
    "tag": [
      {
        "system": "https://mii-termserv.de/fhir/su-termserv/CodeSystem/mii-cs-suts-resource-tags-project",
        "code": "bfarm",
        "display": "Bundesinstitut für Arzneimittel und Medizinprodukte"
      },
      {
        "system": "https://mii-termserv.de/fhir/su-termserv/CodeSystem/mii-cs-suts-resource-tags-dataset",
        "code": "bfarm",
        "display": "Bundesinstitut für Arzneimittel und Medizinprodukte"
      },
      {
        "system": "https://mii-termserv.de/fhir/su-termserv/CodeSystem/mii-cs-suts-resource-tags-license",
        "code": "https://mii-termserv.de/licenses#bfarm",
        "display": "BfArM license terms"
      },
      {
        "system": "https://mii-termserv.de/fhir/su-termserv/CodeSystem/mii-cs-suts-resource-tags-project",
        "code": "unavailable",
        "display": "Unavailable"
      },
      {
        "system": "https://mii-termserv.de/fhir/su-termserv/CodeSystem/mii-cs-suts-resource-tags-dataset",
        "code": "unavailable",
        "display": "Unavailable"
      },
      {
        "system": "https://mii-termserv.de/fhir/su-termserv/CodeSystem/mii-cs-suts-resource-tags-license",
        "code": "https://mii-termserv.de/licenses#unavailable",
        "display": "Unavailable"
      }
    ]
  },
  "valueSet": "http://fhir.de/ValueSet/dimdi/atc",
  "extension": [
    {
      "url": "http://hl7.org/fhir/StructureDefinition/cqf-scope",
      "valueString": "@mii-termserv/de.sutermserv.placeholders"
    }
  ],
  "experimental": false,
  "text": {
    "status": "generated",
    "div": "<div xmlns=\"http://www.w3.org/1999/xhtml\"><h2>ATC DIMDI</h2><tt>http://fhir.de/CodeSystem/dimdi/atc</tt><p>The canonical URL for the ATC CodeSystem was changed from http://fhir.de/CodeSystem/dimdi/atc to http://fhir.de/CodeSystem/bfarm/atc. The code system will not be made available as FHIR using the old URI at this time.</p><div><p><b>SU-TermServ Metadata</b></p><table><tbody><tr><td><b>Project</b></td><td>Unavailable</td></tr><tr><td><b>Dataset</b></td><td>Unavailable</td></tr><tr><td><b>License</b></td><td><a href=\"https://mii-termserv.de/licenses#unavailable\">Unavailable</a></td></tr><tr><td><b>Package Scope</b></td><td><a href=\"https://gitlab.com/groups/mii-termserv/fhir-resources/-/packages/?ForderBy%3Dversion%26sort%3Ddesc%26search%5B%5D%3D@mii-termserv/de.sutermserv.placeholders\"><code>@mii-termserv/de.sutermserv.placeholders</code></a></td></tr></tbody></table></div></div>"
  }
}