{
  "resourceType": "CodeSystem",
  "id": "KBV-CS-SFHIR-BAR2-RECHTSGRUNDLAGE-1.11.0",
  "url": "https://fhir.kbv.de/CodeSystem/KBV_CS_SFHIR_BAR2_RECHTSGRUNDLAGE",
  "identifier": [
    {
      "system": "urn:ietf:rfc:3986",
      "value": "urn:oid:1.2.276.0.76.3.1.1.5.2.69"
    }
  ],
  "version": "1.03",
  "name": "KBV_CS_SFHIR_BAR2_RECHTSGRUNDLAGE",
  "status": "active",
  "date": "2023-01-01",
  "publisher": "Kassenärztliche Bundesvereinigung",
  "contact": [
    {
      "telecom": [
        {
          "system": "url",
          "value": "http://www.kbv.de"
        }
      ]
    }
  ],
  "description": "Statusformen der Teilnahme an der vertragsärztlichen Versorgung, BAR-Schlüsselverzeichnis, Anlage 25",
  "copyright": "Kassenärztliche Bundesvereinigung",
  "caseSensitive": true,
  "content": "complete",
  "concept": [
    {
      "code": "00",
      "display": "Missing Value"
    },
    {
      "code": "01",
      "display": "Zulassung nach §§ 19 / 24 Ärzte-ZV"
    },
    {
      "code": "05",
      "display": "Anstellung nach § 402 SGB V (ehemals § 311 SGB V, angestellte Einrichtungsärzte, neue Bundesländer)"
    },
    {
      "code": "06",
      "display": "Angestellter Arzt nach §95 Abs. 2 Satz 7 SGB V (Medizinische Versorgungszentren)"
    },
    {
      "code": "10",
      "display": "Ermächtigung nach § 31 Abs. 1 Nr. 1 Ärzte-ZV"
    },
    {
      "code": "13",
      "display": "Psychotherapie-Ermächtigung nach § 95 Abs. 11 SGB V mit dem Ziel einer nachfolgenden Zulassung"
    },
    {
      "code": "15",
      "display": "Ermächtigung nach § 31 Abs. 1 Nr. 2 Ärzte-ZV"
    },
    {
      "code": "18",
      "display": "Weitere Leistungserbringer"
    },
    {
      "code": "19",
      "display": "Ermächtigung nach § 31a Abs. 1 Nr. 1 Ärzte-ZV;obsolet"
    },
    {
      "code": "20",
      "display": "Ermächtigung nach § 31 Abs. 2 Ärzte-ZV i.V.m. § 5 / Anlagen 9.1+9.2 BMV"
    },
    {
      "code": "21",
      "display": "Ermächtigung nach § 31a Ärzte-ZV i. V. m. § 5/Anlage 9.1 BMV-Ä"
    },
    {
      "code": "23",
      "display": "KV-Ermächtigung Fachzahnarzt §6 BMV-Ä"
    },
    {
      "code": "24",
      "display": "KV-Ermächtigung Fachwissenschaftler §7 BMV-Ä"
    },
    {
      "code": "28",
      "display": "Ermächtigung nach 31 Abs. 2 Ärzte-ZV i.V.m. § 6 BMV (Fachzahnärzte § 10a, Absatz 1 BÄO)"
    },
    {
      "code": "29",
      "display": "Angestellter Arzt nach § 32b Ärzte-ZV (vor 1998)"
    },
    {
      "code": "30",
      "display": "Ermächtigung nach § 31 Abs. 3 Ärzte-ZV"
    },
    {
      "code": "39",
      "display": "Angestellter Arzt nach § 32b Ärzte-ZV i. V. m. § 95 Abs. 9 SGB V"
    },
    {
      "code": "40",
      "display": "Ermächtigung nach § 31 Abs. 5 Ärzte-ZV i.V.m. § 8 BMV"
    },
    {
      "code": "48",
      "display": "Ermächtigung nach § 31 Abs. 1 Ärzte-ZV i.V.m. § 31 Abs. 3 Ärzte-ZV"
    },
    {
      "code": "49",
      "display": "Ermächtigung nach § 31 Abs. 2 Ärzte-ZV i.V.m. § 31 Abs. 3 Ärzte-ZV"
    },
    {
      "code": "50",
      "display": "Sicherstellungs-/Entlastungs-Assistent nach §32 Abs. 2 SGB V"
    },
    {
      "code": "51",
      "display": "Angestellter Arzt nach § 32b Ärzte-ZV i. V. m. § 95 Abs. 9a SGB V"
    },
    {
      "code": "52",
      "display": "Angestellter Arzt nach § 24 Abs. 3 Satz 9 Ärzte-ZV i.V.m. § 95 Abs. 9 SGB V (Anstellung im fremden KV-Bezirk)"
    },
    {
      "code": "53",
      "display": "Vertreter eines angestellten Arztes nach § 32b Abs. 6 Ärzte-ZV"
    },
    {
      "code": "54",
      "display": "Ermächtigung nach § 24 Abs. 3 Satz 7 Ärzte-ZV (Ermächtigung im fremden KV-Bezirk)"
    },
    {
      "code": "60",
      "display": "Anstellung in KV-Eigeneinrichtung nach § 105 Abs. 1c SGB V"
    },
    {
      "code": "61",
      "display": "Anstellung in Kommunaler Eigeneinrichtung nach § 105 Abs. 5 SGB V"
    },
    {
      "code": "62",
      "display": "Ermächtigung nach § 31a Abs. 1 Nr. 1 Ärzte-ZV (Krankenhaus)"
    },
    {
      "code": "63",
      "display": "Ermächtigung nach § 31a Abs. 1 Nr. 2 Ärzte-ZV (Vorsorge- oder Rehabilitationseinrichtung)"
    },
    {
      "code": "64",
      "display": "Ermächtigung nach § 31a Abs. 1 Nr. 3 Ärzte-ZV (stationäre Pflegeeinrichtung)"
    },
    {
      "code": "65",
      "display": "Ermächtigung nach § 31 Abs. 1 Satz 2 Ärzte-ZV"
    },
    {
      "code": "66",
      "display": "Anstellung in nach § 119b Satz 3 SGB V ermächtigter stationärer Pflegeeinrichtung"
    },
    {
      "code": "67",
      "display": "Ermächtigung nach § 118a SGB V (Geriatrische Versorgung)"
    },
    {
      "code": "68",
      "display": "Ermächtigung nach § 31 Abs. 2 Ärzte-ZV i.V.m. § 5 Abs. 2 Satz 2 BMV-Ä (Zweitmeinungsverfahren)"
    },
    {
      "code": "76",
      "display": "Nur EK-Vertragsarzt (§§ 7,2 / 8,5 EKV alt) gem. ÜV Art. 33 § 3a Abs. 2 GSG (Besitzstandswahrung)"
    },
    {
      "code": "92",
      "display": "Codes zur internen Verwendung in den Landesarztregistern. Keine Meldung an das Bundesarztregister."
    },
    {
      "code": "93",
      "display": "Codes zur internen Verwendung in den Landesarztregistern. Keine Meldung an das Bundesarztregister."
    },
    {
      "code": "94",
      "display": "Codes zur internen Verwendung in den Landesarztregistern. Keine Meldung an das Bundesarztregister."
    },
    {
      "code": "95",
      "display": "Codes zur internen Verwendung in den Landesarztregistern. Keine Meldung an das Bundesarztregister."
    }
  ],
  "extension": [
    {
      "url": "http://hl7.org/fhir/StructureDefinition/cqf-scope",
      "valueString": "@mii-termserv/de.kbv.schluesseltabellen"
    }
  ],
  "meta": {
    "tag": [
      {
        "system": "https://mii-termserv.de/fhir/su-termserv/CodeSystem/mii-cs-suts-resource-tags-project",
        "code": "kbv",
        "display": "Kassenärztliche Bundesvereinigung"
      },
      {
        "system": "https://mii-termserv.de/fhir/su-termserv/CodeSystem/mii-cs-suts-resource-tags-dataset",
        "code": "kbv-schluesseltabellen",
        "display": "KBV Schlüsseltabellen"
      },
      {
        "system": "https://mii-termserv.de/fhir/su-termserv/CodeSystem/mii-cs-suts-resource-tags-license",
        "code": "https://mii-termserv.de/licenses#kbv-schluesseltabellen",
        "display": "KBV license for Schlüsseltabellen"
      }
    ]
  },
  "title": "KBV_CS_SFHIR_BAR2_RECHTSGRUNDLAGE",
  "text": {
    "status": "generated",
    "div": "<div xmlns=\"http://www.w3.org/1999/xhtml\"><h2>KBV_CS_SFHIR_BAR2_RECHTSGRUNDLAGE</h2><tt>https://fhir.kbv.de/CodeSystem/KBV_CS_SFHIR_BAR2_RECHTSGRUNDLAGE</tt><p>Statusformen der Teilnahme an der vertragsärztlichen Versorgung, BAR-Schlüsselverzeichnis, Anlage 25</p><div><p><b>SU-TermServ Metadata</b></p><table><tbody><tr><td><b>Project</b></td><td>Kassenärztliche Bundesvereinigung</td></tr><tr><td><b>Dataset</b></td><td>KBV Schlüsseltabellen</td></tr><tr><td><b>License</b></td><td><a href=\"https://mii-termserv.de/licenses#kbv-schluesseltabellen\">KBV license for Schlüsseltabellen</a></td></tr><tr><td><b>Package Scope</b></td><td><a href=\"https://gitlab.com/groups/mii-termserv/fhir-resources/-/packages/?ForderBy%3Dversion%26sort%3Ddesc%26search%5B%5D%3D@mii-termserv/de.kbv.schluesseltabellen\"><code>@mii-termserv/de.kbv.schluesseltabellen</code></a></td></tr></tbody></table></div></div>"
  },
  "count": 39
}