{
  "resourceType": "CodeSystem",
  "id": "KBV-CS-SFHIR-BAR2-ANRECHNUNGSUBGRUPPE-1.11.0",
  "url": "https://fhir.kbv.de/CodeSystem/KBV_CS_SFHIR_BAR2_ANRECHNUNGSUBGRUPPE",
  "identifier": [
    {
      "system": "urn:ietf:rfc:3986",
      "value": "urn:oid:1.2.276.0.76.3.1.1.5.2.80"
    }
  ],
  "version": "1.01",
  "name": "KBV_CS_SFHIR_BAR2_ANRECHNUNGSUBGRUPPE",
  "status": "active",
  "date": "2022-01-01",
  "publisher": "Kassenärztliche Bundesvereinigung",
  "contact": [
    {
      "telecom": [
        {
          "system": "url",
          "value": "http://www.kbv.de"
        }
      ]
    }
  ],
  "description": "Kennziffern für die Anrechnung in einer Subgruppe einer Bedarfsplanungsgruppe nach BAR-Schlüsselverzeichnis, Anlage 42",
  "copyright": "Kassenärztliche Bundesvereinigung",
  "caseSensitive": true,
  "content": "complete",
  "concept": [
    {
      "code": "01",
      "display": "Bei Psychotherapeuten: Zählt als ärztlicher Psychotherapeut"
    },
    {
      "code": "02",
      "display": "Bei Psychotherapeuten: Zählt als Kinder- und Jug.-psychotherapeut"
    },
    {
      "code": "03",
      "display": "Bei Psychotherapeuten: Zählt als Psychosomatiker (und als ärztlicher Psychotherapeut)"
    },
    {
      "code": "04",
      "display": "Bei Nervenärzten: Zählt als Nervenarzt bzw. als Arzt mit doppelter Facharztanerkennung in den Gebieten Neurologie und Psychiatrie"
    },
    {
      "code": "05",
      "display": "Bei Nervenärzten: Zählt als Neurologe"
    },
    {
      "code": "06",
      "display": "Bei Nervenärzten: Zählt als Psychiater"
    },
    {
      "code": "07",
      "display": "Bei Fachinternisten: Zählt als Rheumatologe"
    },
    {
      "code": "08",
      "display": "Bei Fachinternisten: Zählt als Kardiologe"
    },
    {
      "code": "09",
      "display": "Bei Fachinternisten: Zählt als Gastroenterologe"
    },
    {
      "code": "10",
      "display": "Bei Fachinternisten: Zählt als Pneumologe"
    },
    {
      "code": "11",
      "display": "Bei Fachinternisten: Zählt als Nephrologe"
    }
  ],
  "extension": [
    {
      "url": "http://hl7.org/fhir/StructureDefinition/cqf-scope",
      "valueString": "@mii-termserv/de.kbv.schluesseltabellen"
    }
  ],
  "meta": {
    "tag": [
      {
        "system": "https://mii-termserv.de/fhir/su-termserv/CodeSystem/mii-cs-suts-resource-tags-project",
        "code": "kbv",
        "display": "Kassenärztliche Bundesvereinigung"
      },
      {
        "system": "https://mii-termserv.de/fhir/su-termserv/CodeSystem/mii-cs-suts-resource-tags-dataset",
        "code": "kbv-schluesseltabellen",
        "display": "KBV Schlüsseltabellen"
      },
      {
        "system": "https://mii-termserv.de/fhir/su-termserv/CodeSystem/mii-cs-suts-resource-tags-license",
        "code": "https://mii-termserv.de/licenses#kbv-schluesseltabellen",
        "display": "KBV license for Schlüsseltabellen"
      }
    ]
  },
  "title": "KBV_CS_SFHIR_BAR2_ANRECHNUNGSUBGRUPPE",
  "text": {
    "status": "generated",
    "div": "<div xmlns=\"http://www.w3.org/1999/xhtml\"><h2>KBV_CS_SFHIR_BAR2_ANRECHNUNGSUBGRUPPE</h2><tt>https://fhir.kbv.de/CodeSystem/KBV_CS_SFHIR_BAR2_ANRECHNUNGSUBGRUPPE</tt><p>Kennziffern für die Anrechnung in einer Subgruppe einer Bedarfsplanungsgruppe nach BAR-Schlüsselverzeichnis, Anlage 42</p><div><p><b>SU-TermServ Metadata</b></p><table><tbody><tr><td><b>Project</b></td><td>Kassenärztliche Bundesvereinigung</td></tr><tr><td><b>Dataset</b></td><td>KBV Schlüsseltabellen</td></tr><tr><td><b>License</b></td><td><a href=\"https://mii-termserv.de/licenses#kbv-schluesseltabellen\">KBV license for Schlüsseltabellen</a></td></tr><tr><td><b>Package Scope</b></td><td><a href=\"https://gitlab.com/groups/mii-termserv/fhir-resources/-/packages/?ForderBy%3Dversion%26sort%3Ddesc%26search%5B%5D%3D@mii-termserv/de.kbv.schluesseltabellen\"><code>@mii-termserv/de.kbv.schluesseltabellen</code></a></td></tr></tbody></table></div></div>"
  },
  "count": 11
}