{
  "resourceType": "CodeSystem",
  "id": "KBV-CS-SFHIR-KBV-GELTUNGSBEREICHTYP-1.11.0",
  "url": "https://fhir.kbv.de/CodeSystem/KBV_CS_SFHIR_KBV_GELTUNGSBEREICHTYP",
  "identifier": [
    {
      "system": "urn:ietf:rfc:3986",
      "value": "urn:oid:1.2.276.0.76.5.107"
    }
  ],
  "version": "1.01",
  "name": "KBV_CS_SFHIR_KBV_GELTUNGSBEREICHTYP",
  "status": "active",
  "date": "2008-10-20",
  "publisher": "Kassenärztliche Bundesvereinigung",
  "contact": [
    {
      "telecom": [
        {
          "system": "url",
          "value": "http://www.kbv.de"
        }
      ]
    }
  ],
  "description": "Klassifizierung von Geltungsbereich-Typen. Der Geltungsbereichstyp wird im Header der jeweiligen Schnittstelle angegeben. In der EHD-Richtlinie wird diese Angabe im Element \"scope.type_cd\" gemacht.",
  "copyright": "Kassenärztliche Bundesvereinigung",
  "caseSensitive": true,
  "content": "complete",
  "concept": [
    {
      "code": "KVG",
      "display": "KV-Geltungsbereich"
    },
    {
      "code": "SE",
      "display": "Screening-Einheit"
    }
  ],
  "extension": [
    {
      "url": "http://hl7.org/fhir/StructureDefinition/cqf-scope",
      "valueString": "@mii-termserv/de.kbv.schluesseltabellen"
    }
  ],
  "meta": {
    "tag": [
      {
        "system": "https://mii-termserv.de/fhir/su-termserv/CodeSystem/mii-cs-suts-resource-tags-project",
        "code": "kbv",
        "display": "Kassenärztliche Bundesvereinigung"
      },
      {
        "system": "https://mii-termserv.de/fhir/su-termserv/CodeSystem/mii-cs-suts-resource-tags-dataset",
        "code": "kbv-schluesseltabellen",
        "display": "KBV Schlüsseltabellen"
      },
      {
        "system": "https://mii-termserv.de/fhir/su-termserv/CodeSystem/mii-cs-suts-resource-tags-license",
        "code": "https://mii-termserv.de/licenses#kbv-schluesseltabellen",
        "display": "KBV license for Schlüsseltabellen"
      }
    ]
  },
  "title": "KBV_CS_SFHIR_KBV_GELTUNGSBEREICHTYP",
  "text": {
    "status": "generated",
    "div": "<div xmlns=\"http://www.w3.org/1999/xhtml\"><h2>KBV_CS_SFHIR_KBV_GELTUNGSBEREICHTYP</h2><tt>https://fhir.kbv.de/CodeSystem/KBV_CS_SFHIR_KBV_GELTUNGSBEREICHTYP</tt><p>Klassifizierung von Geltungsbereich-Typen. Der Geltungsbereichstyp wird im Header der jeweiligen Schnittstelle angegeben. In der EHD-Richtlinie wird diese Angabe im Element &quot;scope.type_cd&quot; gemacht.</p><div><p><b>SU-TermServ Metadata</b></p><table><tbody><tr><td><b>Project</b></td><td>Kassenärztliche Bundesvereinigung</td></tr><tr><td><b>Dataset</b></td><td>KBV Schlüsseltabellen</td></tr><tr><td><b>License</b></td><td><a href=\"https://mii-termserv.de/licenses#kbv-schluesseltabellen\">KBV license for Schlüsseltabellen</a></td></tr><tr><td><b>Package Scope</b></td><td><a href=\"https://gitlab.com/groups/mii-termserv/fhir-resources/-/packages/?ForderBy%3Dversion%26sort%3Ddesc%26search%5B%5D%3D@mii-termserv/de.kbv.schluesseltabellen\"><code>@mii-termserv/de.kbv.schluesseltabellen</code></a></td></tr></tbody></table></div></div>"
  },
  "count": 2
}