{
  "resourceType": "CodeSystem",
  "id": "KBV-CS-SFHIR-BAR2-ARZTNRFACHGRUPPE-1.11.0",
  "url": "https://fhir.kbv.de/CodeSystem/KBV_CS_SFHIR_BAR2_ARZTNRFACHGRUPPE",
  "identifier": [
    {
      "system": "urn:ietf:rfc:3986",
      "value": "urn:oid:1.2.276.0.76.3.1.1.5.2.23"
    }
  ],
  "version": "1.03",
  "name": "KBV_CS_SFHIR_BAR2_ARZTNRFACHGRUPPE",
  "status": "active",
  "date": "2022-03-01",
  "publisher": "Kassenärztliche Bundesvereinigung",
  "contact": [
    {
      "telecom": [
        {
          "system": "url",
          "value": "http://www.kbv.de"
        }
      ]
    }
  ],
  "description": "zweistellige Fachgruppencodierung für die 8.+9. Stelle der LANR, BAR-Schlüsselverzeichnis, Anlage 35",
  "copyright": "Kassenärztliche Bundesvereinigung",
  "caseSensitive": true,
  "content": "complete",
  "concept": [
    {
      "code": "00",
      "display": "ungültiger Wert"
    },
    {
      "code": "01",
      "display": "Allgemeinmedizin"
    },
    {
      "code": "02",
      "display": "hausärztliche Praktische Ärztin/Praktischer Arzt/Ärztin ohne Facharzt-Weiterbildung/Arzt ohne Facharzt-Weiterbildung"
    },
    {
      "code": "03",
      "display": "hausärztliche Innere Medizin"
    },
    {
      "code": "04",
      "display": "Anästhesiologie"
    },
    {
      "code": "05",
      "display": "Augenheilkunde"
    },
    {
      "code": "06",
      "display": "Chirurgie"
    },
    {
      "code": "07",
      "display": "Gefäßchirurgie"
    },
    {
      "code": "08",
      "display": "Visceralchirurgie"
    },
    {
      "code": "09",
      "display": "Kinderchirurgie"
    },
    {
      "code": "10",
      "display": "Orthopädie (und Unfallchirurgie)"
    },
    {
      "code": "11",
      "display": "SP Unfallchirurgie"
    },
    {
      "code": "12",
      "display": "Rheumatologie (der ehemaligen Orthopädie)"
    },
    {
      "code": "13",
      "display": "Plastische Chirurgie"
    },
    {
      "code": "14",
      "display": "Thoraxchirurgie"
    },
    {
      "code": "15",
      "display": "Frauenheilkunde"
    },
    {
      "code": "16",
      "display": "Gynäkologische Endokrinologie und Reproduktionsmedizin"
    },
    {
      "code": "17",
      "display": "Gynäkologische Onkologie"
    },
    {
      "code": "18",
      "display": "Spezielle Geburtshilfe und Perinatalmedizin"
    },
    {
      "code": "19",
      "display": "Hals-Nasen-Ohrenheilkunde"
    },
    {
      "code": "20",
      "display": "Phoniatrie/Pädaudiologie"
    },
    {
      "code": "21",
      "display": "Haut- und Geschlechtskrankheiten"
    },
    {
      "code": "22",
      "display": "Humangenetik"
    },
    {
      "code": "23",
      "display": "fachärztliche Innere Medizin"
    },
    {
      "code": "24",
      "display": "Angiologie"
    },
    {
      "code": "25",
      "display": "Endokrinologie/Diabetologie"
    },
    {
      "code": "26",
      "display": "Gastroenterologie"
    },
    {
      "code": "27",
      "display": "Hämatologie/Onkologie"
    },
    {
      "code": "28",
      "display": "Kardiologie"
    },
    {
      "code": "29",
      "display": "Nephrologie"
    },
    {
      "code": "30",
      "display": "Pneumologie"
    },
    {
      "code": "31",
      "display": "Rheumatologie (der Inneren Medizin)"
    },
    {
      "code": "32",
      "display": "Geriatrie"
    },
    {
      "code": "33",
      "display": "Infektiologie"
    },
    {
      "code": "34",
      "display": "hausärztliche Kinder- und Jugendmedizin"
    },
    {
      "code": "35",
      "display": "hausärztliche Kinder-Hämatologie"
    },
    {
      "code": "36",
      "display": "hausärztliche Kinder-Kardiologie"
    },
    {
      "code": "37",
      "display": "hausärztliche Neonatologie"
    },
    {
      "code": "38",
      "display": "hausärztliche Neuropädiatrie/Kinderneuropsychiatrie"
    },
    {
      "code": "39",
      "display": "hausärztliche Kinder-Pneumologie"
    },
    {
      "code": "40",
      "display": "fachärztliche Kinder- und Jugendmedizin"
    },
    {
      "code": "41",
      "display": "fachärztliche Kinder-Hämatologie"
    },
    {
      "code": "42",
      "display": "fachärztliche Kinder-Kardiologie"
    },
    {
      "code": "43",
      "display": "fachärztliche Neonatologie"
    },
    {
      "code": "44",
      "display": "fachärztliche Neuropädiatrie/Kinderneuropsychiatrie"
    },
    {
      "code": "45",
      "display": "fachärztliche Kinder-Pneumologie"
    },
    {
      "code": "46",
      "display": "Kinder- und Jugendmedizin mit Schwerpunkt u. Teilnahme an der HA/FA-Versorgung"
    },
    {
      "code": "47",
      "display": "Kinder- und Jugendpsychiatrie und -psychotherapie"
    },
    {
      "code": "48",
      "display": "Laboratoriumsmedizin"
    },
    {
      "code": "49",
      "display": "Mikrobiologie, Virologie und Infektionsepidemiologie"
    },
    {
      "code": "50",
      "display": "Mund-Kiefer-Gesichtschirurgie"
    },
    {
      "code": "51",
      "display": "Nervenheilkunde/Neurologie/Psychiatrie"
    },
    {
      "code": "52",
      "display": "Neurochirurgie"
    },
    {
      "code": "53",
      "display": "Neurologie"
    },
    {
      "code": "54",
      "display": "Nuklearmedizin"
    },
    {
      "code": "55",
      "display": "Neuropathologie"
    },
    {
      "code": "56",
      "display": "Pathologie"
    },
    {
      "code": "57",
      "display": "Physikalische und Rehabilitative Medizin/Physiotherapie"
    },
    {
      "code": "58",
      "display": "Psychiatrie/Psychiatrie und Psychotherapie"
    },
    {
      "code": "59",
      "display": "Forensische Psychiatrie"
    },
    {
      "code": "60",
      "display": "Psychosomatische Medizin und Psychotherapie"
    },
    {
      "code": "61",
      "display": "Psychotherapeutisch tätige Ärztin/Psychotherapeutisch tätiger Arzt"
    },
    {
      "code": "62",
      "display": "Radiologie"
    },
    {
      "code": "63",
      "display": "Kinderradiologie"
    },
    {
      "code": "64",
      "display": "Neuroradiologie"
    },
    {
      "code": "65",
      "display": "Strahlentherapie"
    },
    {
      "code": "66",
      "display": "Transfusionsmedizin"
    },
    {
      "code": "67",
      "display": "Urologie"
    },
    {
      "code": "68",
      "display": "Psychologische Psychotherapeutin/Psychologischer Psychotherapeut"
    },
    {
      "code": "69",
      "display": "Kinder- und Jugendlichen-Psychotherapeutin/Kinder- und Jugendlichen-Psychotherapeut"
    },
    {
      "code": "70",
      "display": "zur freien Verfügung für die KVen"
    },
    {
      "code": "71",
      "display": "zur freien Verfügung für die KVen"
    },
    {
      "code": "72",
      "display": "zur freien Verfügung für die KVen"
    },
    {
      "code": "73",
      "display": "zur freien Verfügung für die KVen"
    },
    {
      "code": "74",
      "display": "zur freien Verfügung für die KVen"
    },
    {
      "code": "75",
      "display": "zur freien Verfügung für die KVen"
    },
    {
      "code": "76",
      "display": "zur freien Verfügung für die KVen"
    },
    {
      "code": "77",
      "display": "zur freien Verfügung für die KVen"
    },
    {
      "code": "78",
      "display": "zur freien Verfügung für die KVen"
    },
    {
      "code": "79",
      "display": "zur freien Verfügung für die KVen"
    },
    {
      "code": "80",
      "display": "zur freien Verfügung für die KVen"
    },
    {
      "code": "81",
      "display": "zur freien Verfügung für die KVen"
    },
    {
      "code": "82",
      "display": "zur freien Verfügung für die KVen"
    },
    {
      "code": "83",
      "display": "zur freien Verfügung für die KVen"
    },
    {
      "code": "84",
      "display": "zur freien Verfügung für die KVen"
    },
    {
      "code": "85",
      "display": "Weiterbildungsassistentinnen/Weiterbildungsassistenten (keine Meldung an das Bundesarztregister)"
    },
    {
      "code": "86",
      "display": "zur freien Verfügung für die KVen"
    },
    {
      "code": "87",
      "display": "Ärztinnen/Ärzte ohne Facharztbezeichnung (im vertragsärztlichen Bereich nicht relevant)"
    },
    {
      "code": "88",
      "display": "zur freien Verfügung für die KVen"
    },
    {
      "code": "89",
      "display": "zur freien Verfügung für die KVen"
    },
    {
      "code": "90",
      "display": "zur freien Verfügung für die KVen"
    },
    {
      "code": "91",
      "display": "Zahnärztinnen/Zahnärzte in der vertragszahnärztlichen Versorgung (im vertragsärztlichen Bereich nicht relevant)"
    },
    {
      "code": "92",
      "display": "zur freien Verfügung für die KVen"
    },
    {
      "code": "93",
      "display": "zur freien Verfügung für die KVen"
    },
    {
      "code": "94",
      "display": "zur freien Verfügung für die KVen"
    },
    {
      "code": "95",
      "display": "zur freien Verfügung für die KVen"
    },
    {
      "code": "96",
      "display": "zur freien Verfügung für die KVen"
    },
    {
      "code": "97",
      "display": "zur freien Verfügung für die KVen"
    },
    {
      "code": "98",
      "display": "zur freien Verfügung für die KVen"
    },
    {
      "code": "99",
      "display": "weitere Fachgruppen"
    }
  ],
  "extension": [
    {
      "url": "http://hl7.org/fhir/StructureDefinition/cqf-scope",
      "valueString": "@mii-termserv/de.kbv.schluesseltabellen"
    }
  ],
  "meta": {
    "tag": [
      {
        "system": "https://mii-termserv.de/fhir/su-termserv/CodeSystem/mii-cs-suts-resource-tags-project",
        "code": "kbv",
        "display": "Kassenärztliche Bundesvereinigung"
      },
      {
        "system": "https://mii-termserv.de/fhir/su-termserv/CodeSystem/mii-cs-suts-resource-tags-dataset",
        "code": "kbv-schluesseltabellen",
        "display": "KBV Schlüsseltabellen"
      },
      {
        "system": "https://mii-termserv.de/fhir/su-termserv/CodeSystem/mii-cs-suts-resource-tags-license",
        "code": "https://mii-termserv.de/licenses#kbv-schluesseltabellen",
        "display": "KBV license for Schlüsseltabellen"
      }
    ]
  },
  "title": "KBV_CS_SFHIR_BAR2_ARZTNRFACHGRUPPE",
  "text": {
    "status": "generated",
    "div": "<div xmlns=\"http://www.w3.org/1999/xhtml\"><h2>KBV_CS_SFHIR_BAR2_ARZTNRFACHGRUPPE</h2><tt>https://fhir.kbv.de/CodeSystem/KBV_CS_SFHIR_BAR2_ARZTNRFACHGRUPPE</tt><p>zweistellige Fachgruppencodierung für die 8.+9. Stelle der LANR, BAR-Schlüsselverzeichnis, Anlage 35</p><div><p><b>SU-TermServ Metadata</b></p><table><tbody><tr><td><b>Project</b></td><td>Kassenärztliche Bundesvereinigung</td></tr><tr><td><b>Dataset</b></td><td>KBV Schlüsseltabellen</td></tr><tr><td><b>License</b></td><td><a href=\"https://mii-termserv.de/licenses#kbv-schluesseltabellen\">KBV license for Schlüsseltabellen</a></td></tr><tr><td><b>Package Scope</b></td><td><a href=\"https://gitlab.com/groups/mii-termserv/fhir-resources/-/packages/?ForderBy%3Dversion%26sort%3Ddesc%26search%5B%5D%3D@mii-termserv/de.kbv.schluesseltabellen\"><code>@mii-termserv/de.kbv.schluesseltabellen</code></a></td></tr></tbody></table></div></div>"
  },
  "count": 100
}