{
  "resourceType": "CodeSystem",
  "id": "KBV-CS-SFHIR-VDX-AST-KTG-1.11.0",
  "url": "https://fhir.kbv.de/CodeSystem/KBV_CS_SFHIR_VDX_AST_KTG",
  "identifier": [
    {
      "system": "urn:ietf:rfc:3986",
      "value": "urn:oid:1.2.276.0.76.3.1.1.5.1.33"
    }
  ],
  "version": "1.02",
  "name": "KBV_CS_SFHIR_VDX_AST_KTG",
  "status": "active",
  "date": "2009-07-01",
  "publisher": "Kassenärztliche Bundesvereinigung",
  "contact": [
    {
      "telecom": [
        {
          "system": "url",
          "value": "http://www.kbv.de"
        }
      ]
    }
  ],
  "description": "Kostenträgergruppen gemäß Schlüsselverzeichnis der Abrechnungsstatistik (Ast) 4.2. Kostenträger: Arten/Gruppen von KBV Dezernat 3",
  "copyright": "Kassenärztliche Bundesvereinigung",
  "caseSensitive": true,
  "content": "complete",
  "property": [
    {
      "code": "summenschluessel",
      "type": "integer"
    }
  ],
  "concept": [
    {
      "code": "09",
      "display": "Primärkassen",
      "property": [
        {
          "code": "summenschluessel",
          "valueInteger": 29
        }
      ]
    },
    {
      "code": "19",
      "display": "Ersatzkassen",
      "property": [
        {
          "code": "summenschluessel",
          "valueInteger": 29
        }
      ]
    },
    {
      "code": "95",
      "display": "Besondere Kostenträger",
      "property": [
        {
          "code": "summenschluessel",
          "valueInteger": 99
        }
      ]
    }
  ],
  "extension": [
    {
      "url": "http://hl7.org/fhir/StructureDefinition/cqf-scope",
      "valueString": "@mii-termserv/de.kbv.schluesseltabellen"
    }
  ],
  "meta": {
    "tag": [
      {
        "system": "https://mii-termserv.de/fhir/su-termserv/CodeSystem/mii-cs-suts-resource-tags-project",
        "code": "kbv",
        "display": "Kassenärztliche Bundesvereinigung"
      },
      {
        "system": "https://mii-termserv.de/fhir/su-termserv/CodeSystem/mii-cs-suts-resource-tags-dataset",
        "code": "kbv-schluesseltabellen",
        "display": "KBV Schlüsseltabellen"
      },
      {
        "system": "https://mii-termserv.de/fhir/su-termserv/CodeSystem/mii-cs-suts-resource-tags-license",
        "code": "https://mii-termserv.de/licenses#kbv-schluesseltabellen",
        "display": "KBV license for Schlüsseltabellen"
      }
    ]
  },
  "title": "KBV_CS_SFHIR_VDX_AST_KTG",
  "text": {
    "status": "generated",
    "div": "<div xmlns=\"http://www.w3.org/1999/xhtml\"><h2>KBV_CS_SFHIR_VDX_AST_KTG</h2><tt>https://fhir.kbv.de/CodeSystem/KBV_CS_SFHIR_VDX_AST_KTG</tt><p>Kostenträgergruppen gemäß Schlüsselverzeichnis der Abrechnungsstatistik (Ast) 4.2. Kostenträger: Arten/Gruppen von KBV Dezernat 3</p><div><p><b>SU-TermServ Metadata</b></p><table><tbody><tr><td><b>Project</b></td><td>Kassenärztliche Bundesvereinigung</td></tr><tr><td><b>Dataset</b></td><td>KBV Schlüsseltabellen</td></tr><tr><td><b>License</b></td><td><a href=\"https://mii-termserv.de/licenses#kbv-schluesseltabellen\">KBV license for Schlüsseltabellen</a></td></tr><tr><td><b>Package Scope</b></td><td><a href=\"https://gitlab.com/groups/mii-termserv/fhir-resources/-/packages/?ForderBy%3Dversion%26sort%3Ddesc%26search%5B%5D%3D@mii-termserv/de.kbv.schluesseltabellen\"><code>@mii-termserv/de.kbv.schluesseltabellen</code></a></td></tr></tbody></table></div></div>"
  },
  "count": 3
}