{
  "resourceType": "CodeSystem",
  "id": "KBV-CS-SFHIR-KTS-KTABRECHNUNGSBEREICH-1.11.0",
  "url": "https://fhir.kbv.de/CodeSystem/KBV_CS_SFHIR_KTS_KTABRECHNUNGSBEREICH",
  "identifier": [
    {
      "system": "urn:ietf:rfc:3986",
      "value": "urn:oid:1.2.276.0.76.5.239"
    }
  ],
  "version": "1.00",
  "name": "KBV_CS_SFHIR_KTS_KTABRECHNUNGSBEREICH",
  "status": "active",
  "date": "2003-02-12",
  "publisher": "Kassenärztliche Bundesvereinigung",
  "contact": [
    {
      "telecom": [
        {
          "system": "url",
          "value": "http://www.kbv.de"
        }
      ]
    }
  ],
  "description": "Kostenträgerabrechnungsbereich (KTAB): gibt die vertragliche Vereinbarung oder gesetzliche Bestimmung an, nach der eine Abrechnung vollzogen wird. In Verbindung mit der VKNR bildet der KTAB ein eindeutiges Identifizierungsmerkmal eines Kostenträgers. HL7 - Prefered OID 2.16.840.1.113883.3.7.1.16",
  "copyright": "Kassenärztliche Bundesvereinigung",
  "caseSensitive": true,
  "content": "complete",
  "concept": [
    {
      "code": "00",
      "display": "Primärabrechnung"
    },
    {
      "code": "01",
      "display": "Sozialversicherungsabkommen"
    },
    {
      "code": "02",
      "display": "Bundesversorgungsgesetz"
    },
    {
      "code": "03",
      "display": "Bundesentschädigungsgesetz"
    },
    {
      "code": "04",
      "display": "Grenzgänger"
    },
    {
      "code": "05",
      "display": "Rheinschiffer"
    },
    {
      "code": "06",
      "display": "Sozialhilfeträger"
    },
    {
      "code": "07",
      "display": "Bundesvertriebenengesetz"
    },
    {
      "code": "08",
      "display": "Asylstelle"
    },
    {
      "code": "09",
      "display": "Schwangerschaftsabbruch"
    },
    {
      "code": "11",
      "display": "Wohnausländer"
    }
  ],
  "extension": [
    {
      "url": "http://hl7.org/fhir/StructureDefinition/cqf-scope",
      "valueString": "@mii-termserv/de.kbv.schluesseltabellen"
    }
  ],
  "meta": {
    "tag": [
      {
        "system": "https://mii-termserv.de/fhir/su-termserv/CodeSystem/mii-cs-suts-resource-tags-project",
        "code": "kbv",
        "display": "Kassenärztliche Bundesvereinigung"
      },
      {
        "system": "https://mii-termserv.de/fhir/su-termserv/CodeSystem/mii-cs-suts-resource-tags-dataset",
        "code": "kbv-schluesseltabellen",
        "display": "KBV Schlüsseltabellen"
      },
      {
        "system": "https://mii-termserv.de/fhir/su-termserv/CodeSystem/mii-cs-suts-resource-tags-license",
        "code": "https://mii-termserv.de/licenses#kbv-schluesseltabellen",
        "display": "KBV license for Schlüsseltabellen"
      }
    ]
  },
  "title": "KBV_CS_SFHIR_KTS_KTABRECHNUNGSBEREICH",
  "text": {
    "status": "generated",
    "div": "<div xmlns=\"http://www.w3.org/1999/xhtml\"><h2>KBV_CS_SFHIR_KTS_KTABRECHNUNGSBEREICH</h2><tt>https://fhir.kbv.de/CodeSystem/KBV_CS_SFHIR_KTS_KTABRECHNUNGSBEREICH</tt><p>Kostenträgerabrechnungsbereich (KTAB): gibt die vertragliche Vereinbarung oder gesetzliche Bestimmung an, nach der eine Abrechnung vollzogen wird. In Verbindung mit der VKNR bildet der KTAB ein eindeutiges Identifizierungsmerkmal eines Kostenträgers. HL7 - Prefered OID 2.16.840.1.113883.3.7.1.16</p><div><p><b>SU-TermServ Metadata</b></p><table><tbody><tr><td><b>Project</b></td><td>Kassenärztliche Bundesvereinigung</td></tr><tr><td><b>Dataset</b></td><td>KBV Schlüsseltabellen</td></tr><tr><td><b>License</b></td><td><a href=\"https://mii-termserv.de/licenses#kbv-schluesseltabellen\">KBV license for Schlüsseltabellen</a></td></tr><tr><td><b>Package Scope</b></td><td><a href=\"https://gitlab.com/groups/mii-termserv/fhir-resources/-/packages/?ForderBy%3Dversion%26sort%3Ddesc%26search%5B%5D%3D@mii-termserv/de.kbv.schluesseltabellen\"><code>@mii-termserv/de.kbv.schluesseltabellen</code></a></td></tr></tbody></table></div></div>"
  },
  "count": 11
}