{
  "resourceType": "CodeSystem",
  "id": "KBV-CS-SFHIR-ITA-DATENEMPFAENGER-1.11.0",
  "url": "https://fhir.kbv.de/CodeSystem/KBV_CS_SFHIR_ITA_DATENEMPFAENGER",
  "identifier": [
    {
      "system": "urn:ietf:rfc:3986",
      "value": "urn:oid:1.2.276.0.76.5.102"
    }
  ],
  "version": "1.00",
  "name": "KBV_CS_SFHIR_ITA_DATENEMPFAENGER",
  "status": "active",
  "date": "2006-01-01",
  "publisher": "Kassenärztliche Bundesvereinigung",
  "contact": [
    {
      "telecom": [
        {
          "system": "url",
          "value": "http://www.kbv.de"
        }
      ]
    }
  ],
  "description": "Klassifizierung der Datenempfänger. Datenempfänger werden nach bestimmten Kriterien eingruppiert. Der Datenempfängertyp wird in Schnittstellen im Header angegeben - laut EHD-Richtlinie wird die Angabe im Element intended_recipient.type_cd gemacht.",
  "copyright": "Kassenärztliche Bundesvereinigung",
  "caseSensitive": true,
  "content": "complete",
  "concept": [
    {
      "code": "OWNER",
      "display": "Owner"
    },
    {
      "code": "RECEIVER",
      "display": "Receiver"
    },
    {
      "code": "TRC",
      "display": "Tracker"
    }
  ],
  "extension": [
    {
      "url": "http://hl7.org/fhir/StructureDefinition/cqf-scope",
      "valueString": "@mii-termserv/de.kbv.schluesseltabellen"
    }
  ],
  "meta": {
    "tag": [
      {
        "system": "https://mii-termserv.de/fhir/su-termserv/CodeSystem/mii-cs-suts-resource-tags-project",
        "code": "kbv",
        "display": "Kassenärztliche Bundesvereinigung"
      },
      {
        "system": "https://mii-termserv.de/fhir/su-termserv/CodeSystem/mii-cs-suts-resource-tags-dataset",
        "code": "kbv-schluesseltabellen",
        "display": "KBV Schlüsseltabellen"
      },
      {
        "system": "https://mii-termserv.de/fhir/su-termserv/CodeSystem/mii-cs-suts-resource-tags-license",
        "code": "https://mii-termserv.de/licenses#kbv-schluesseltabellen",
        "display": "KBV license for Schlüsseltabellen"
      }
    ]
  },
  "title": "KBV_CS_SFHIR_ITA_DATENEMPFAENGER",
  "text": {
    "status": "generated",
    "div": "<div xmlns=\"http://www.w3.org/1999/xhtml\"><h2>KBV_CS_SFHIR_ITA_DATENEMPFAENGER</h2><tt>https://fhir.kbv.de/CodeSystem/KBV_CS_SFHIR_ITA_DATENEMPFAENGER</tt><p>Klassifizierung der Datenempfänger. Datenempfänger werden nach bestimmten Kriterien eingruppiert. Der Datenempfängertyp wird in Schnittstellen im Header angegeben - laut EHD-Richtlinie wird die Angabe im Element intended_recipient.type_cd gemacht.</p><div><p><b>SU-TermServ Metadata</b></p><table><tbody><tr><td><b>Project</b></td><td>Kassenärztliche Bundesvereinigung</td></tr><tr><td><b>Dataset</b></td><td>KBV Schlüsseltabellen</td></tr><tr><td><b>License</b></td><td><a href=\"https://mii-termserv.de/licenses#kbv-schluesseltabellen\">KBV license for Schlüsseltabellen</a></td></tr><tr><td><b>Package Scope</b></td><td><a href=\"https://gitlab.com/groups/mii-termserv/fhir-resources/-/packages/?ForderBy%3Dversion%26sort%3Ddesc%26search%5B%5D%3D@mii-termserv/de.kbv.schluesseltabellen\"><code>@mii-termserv/de.kbv.schluesseltabellen</code></a></td></tr></tbody></table></div></div>"
  },
  "count": 3
}