{
  "resourceType": "CodeSystem",
  "id": "KBV-CS-SFHIR-VDX-KSS-1.11.0",
  "url": "https://fhir.kbv.de/CodeSystem/KBV_CS_SFHIR_VDX_KSS",
  "identifier": [
    {
      "system": "urn:ietf:rfc:3986",
      "value": "urn:oid:1.2.276.0.76.3.1.1.5.1.29"
    }
  ],
  "version": "1.17",
  "name": "KBV_CS_SFHIR_VDX_KSS",
  "status": "active",
  "date": "2023-01-01",
  "publisher": "Kassenärztliche Bundesvereinigung",
  "contact": [
    {
      "telecom": [
        {
          "system": "url",
          "value": "http://www.kbv.de"
        }
      ]
    }
  ],
  "description": "Schlüssel für Kassenspezifische Leistungsbereiche in der Schnittstelle vdx_kt",
  "copyright": "Kassenärztliche Bundesvereinigung",
  "caseSensitive": true,
  "content": "complete",
  "concept": [
    {
      "code": "01",
      "display": "Künstliche Befruchtung"
    },
    {
      "code": "03",
      "display": "Sachkosten i.Z. mit der Durchführung von endoskopischen Gelenkeingriffen"
    },
    {
      "code": "04",
      "display": "Kostenpauschale für Radionuclide"
    },
    {
      "code": "05",
      "display": "U1 bis J1"
    },
    {
      "code": "06",
      "display": "Früherkennungs-Koloskopie"
    },
    {
      "code": "07",
      "display": "Schmerztherapie"
    },
    {
      "code": "08",
      "display": "Polysomnografie Abschnitt 9"
    },
    {
      "code": "09",
      "display": "Mammographie-Screening"
    },
    {
      "code": "10",
      "display": "Laborleistungen # 01700, 01701"
    },
    {
      "code": "11",
      "display": "Laborleistungen MuVo"
    },
    {
      "code": "12",
      "display": "Leistungen der Akupunktur"
    },
    {
      "code": "13",
      "display": "Substitution"
    },
    {
      "code": "14",
      "display": "Phototherapeutische Keratektomien"
    },
    {
      "code": "15",
      "display": "MRT-Angiographien"
    },
    {
      "code": "17",
      "display": "Chlamydien-Screening"
    },
    {
      "code": "18",
      "display": "Hautkrebs-Screening"
    },
    {
      "code": "19",
      "display": "Gesundheitsuntersuchung"
    },
    {
      "code": "20",
      "display": "SAPV"
    },
    {
      "code": "22",
      "display": "Zuschläge PFG"
    },
    {
      "code": "23",
      "display": "Medikationsplan"
    },
    {
      "code": "24",
      "display": "Palliativmedizinische Versorgung"
    },
    {
      "code": "25",
      "display": "Kryokonservierung"
    },
    {
      "code": "26",
      "display": "Komplexversorgung bei psychischen Erkrankungen"
    },
    {
      "code": "27",
      "display": "Leistungen im Rahmen außerklinischer Intensivpflege"
    }
  ],
  "extension": [
    {
      "url": "http://hl7.org/fhir/StructureDefinition/cqf-scope",
      "valueString": "@mii-termserv/de.kbv.schluesseltabellen"
    }
  ],
  "meta": {
    "tag": [
      {
        "system": "https://mii-termserv.de/fhir/su-termserv/CodeSystem/mii-cs-suts-resource-tags-project",
        "code": "kbv",
        "display": "Kassenärztliche Bundesvereinigung"
      },
      {
        "system": "https://mii-termserv.de/fhir/su-termserv/CodeSystem/mii-cs-suts-resource-tags-dataset",
        "code": "kbv-schluesseltabellen",
        "display": "KBV Schlüsseltabellen"
      },
      {
        "system": "https://mii-termserv.de/fhir/su-termserv/CodeSystem/mii-cs-suts-resource-tags-license",
        "code": "https://mii-termserv.de/licenses#kbv-schluesseltabellen",
        "display": "KBV license for Schlüsseltabellen"
      }
    ]
  },
  "title": "KBV_CS_SFHIR_VDX_KSS",
  "text": {
    "status": "generated",
    "div": "<div xmlns=\"http://www.w3.org/1999/xhtml\"><h2>KBV_CS_SFHIR_VDX_KSS</h2><tt>https://fhir.kbv.de/CodeSystem/KBV_CS_SFHIR_VDX_KSS</tt><p>Schlüssel für Kassenspezifische Leistungsbereiche in der Schnittstelle vdx_kt</p><div><p><b>SU-TermServ Metadata</b></p><table><tbody><tr><td><b>Project</b></td><td>Kassenärztliche Bundesvereinigung</td></tr><tr><td><b>Dataset</b></td><td>KBV Schlüsseltabellen</td></tr><tr><td><b>License</b></td><td><a href=\"https://mii-termserv.de/licenses#kbv-schluesseltabellen\">KBV license for Schlüsseltabellen</a></td></tr><tr><td><b>Package Scope</b></td><td><a href=\"https://gitlab.com/groups/mii-termserv/fhir-resources/-/packages/?ForderBy%3Dversion%26sort%3Ddesc%26search%5B%5D%3D@mii-termserv/de.kbv.schluesseltabellen\"><code>@mii-termserv/de.kbv.schluesseltabellen</code></a></td></tr></tbody></table></div></div>"
  },
  "count": 24
}