{
  "resourceType": "CodeSystem",
  "url": "http://ihe-d.de/CodeSystems/FacharzttitelDerAerztekammern",
  "version": "2021-10-15T12:13:26",
  "name": "FacharzttitelDerAerztekammern",
  "id": "ihe-d-FacharzttitelDerAerztekammern-v3.0.0",
  "title": "Facharzttitel Der Aerztekammern",
  "status": "active",
  "experimental": false,
  "publisher": "IHE Deutschland e.V.",
  "caseSensitive": true,
  "content": "complete",
  "concept": [
    {
      "code": "011001",
      "display": "FA Allgemeinmedizin"
    },
    {
      "code": "012901",
      "display": "SP Geriatrie",
      "definition": "FA Allgemeinmedizin mit SP Geriatrie"
    },
    {
      "code": "021001",
      "display": "FA Anästhesiologie"
    },
    {
      "code": "021002",
      "display": "FA Anästhesiologie und Intensivtherapie"
    },
    {
      "code": "031001",
      "display": "FA Anatomie"
    },
    {
      "code": "041001",
      "display": "FA Arbeitshygiene"
    },
    {
      "code": "041002",
      "display": "FA Arbeitsmedizin"
    },
    {
      "code": "051001",
      "display": "FA Augenheilkunde"
    },
    {
      "code": "061001",
      "display": "FA Biochemie"
    },
    {
      "code": "071107",
      "display": "FA Allgemeinchirurgie"
    },
    {
      "code": "071101",
      "display": "FA Allgemeine Chirurgie"
    },
    {
      "code": "071001",
      "display": "FA Chirurgie"
    },
    {
      "code": "071102",
      "display": "FA Gefäßchirurgie"
    },
    {
      "code": "071002",
      "display": "FA Herzchirurgie"
    },
    {
      "code": "071202",
      "display": "FA Kinder- und Jugendchirurgie"
    },
    {
      "code": "071003",
      "display": "FA Kinderchirurgie"
    },
    {
      "code": "071004",
      "display": "FA Orthopädie"
    },
    {
      "code": "071103",
      "display": "FA Orthopädie und Unfallchirurgie"
    },
    {
      "code": "071005",
      "display": "FA Plastische Chirurgie"
    },
    {
      "code": "071106",
      "display": "FA Plastische und Ästhetische Chirurgie"
    },
    {
      "code": "071201",
      "display": "FA Plastische; Rekonstruktive und Ästhetische Chirurgie"
    },
    {
      "code": "071104",
      "display": "FA Thoraxchirurgie"
    },
    {
      "code": "071105",
      "display": "FA Visceralchirurgie"
    },
    {
      "code": "071108",
      "display": "FA Viszeralchirurgie"
    },
    {
      "code": "072001",
      "display": "SP Gefäßchirurgie"
    },
    {
      "code": "072002",
      "display": "SP Rheumatologie (Orthopädie)",
      "definition": "FA Chirurgie mit SP Rheumatologie (Orthopädie)"
    },
    {
      "code": "072003",
      "display": "SP Thoraxchirurgie in der Chirurgie",
      "definition": "FA Chirurgie mit SP Thoraxchirurgie in der Chirurgie"
    },
    {
      "code": "072004",
      "display": "SP Thoraxchirurgie in der Herzchirurgie",
      "definition": "FA Chirurgie mit SP Thoraxchirurgie in der Herzchirurgie"
    },
    {
      "code": "072005",
      "display": "SP Unfallchirurgie",
      "definition": "FA Chirurgie mit SP Unfallchirurgie"
    },
    {
      "code": "072006",
      "display": "SP Visceralchirurgie",
      "definition": "FA Chirurgie mit SP Visceralchirurgie"
    },
    {
      "code": "073001",
      "display": "TG Echokardiologie herznaher Gefäße",
      "definition": "FA Chirurgie mit TG Echokardiologie herznaher Gefäße"
    },
    {
      "code": "073002",
      "display": "TG Gefäßchirurgie",
      "definition": "FA Chirurgie mit TG Gefäßchirurgie"
    },
    {
      "code": "073003",
      "display": "TG Herz- und Gefäßchirurgie",
      "definition": "FA Chirurgie mit TG Herz- und Gefäßchirurgie"
    },
    {
      "code": "073004",
      "display": "TG Kinderchirurgie",
      "definition": "FA Chirurgie mit TG Kinderchirurgie"
    },
    {
      "code": "073005",
      "display": "TG Plastische Chirurgie",
      "definition": "FA Chirurgie mit TG Plastische Chirurgie"
    },
    {
      "code": "073006",
      "display": "TG Rheumatologie (Orthopädie)",
      "definition": "FA Chirurgie mit TG Rheumatologie (Orthopädie)"
    },
    {
      "code": "073007",
      "display": "TG Thorax- und Kardiovaskularchirurgie",
      "definition": "FA Chirurgie mit TG Thorax- und Kardiovaskularchirurgie"
    },
    {
      "code": "073008",
      "display": "TG Thoraxchirurgie",
      "definition": "FA Chirurgie mit TG Thoraxchirurgie"
    },
    {
      "code": "073009",
      "display": "TG Unfallchirurgie",
      "definition": "FA Chirurgie mit TG Unfallchirurgie"
    },
    {
      "code": "081001",
      "display": "FA Frauenheilkunde"
    },
    {
      "code": "081002",
      "display": "FA Frauenheilkunde und Geburtshilfe"
    },
    {
      "code": "081003",
      "display": "FA Gynäkologie und Geburtshilfe"
    },
    {
      "code": "082101",
      "display": "SP Gynäkologische Endokrinologie und Reproduktionsmedizin",
      "definition": "FA Frauenheilkunde und Geburtshilfe mit SP Gynäkologische Endokrinologie und Reproduktionsmedizin"
    },
    {
      "code": "082102",
      "display": "SP Gynäkologische Onkologie",
      "definition": "FA Frauenheilkunde und Geburtshilfe mit SP Gynäkologische Onkologie"
    },
    {
      "code": "082103",
      "display": "SP Spezielle Geburtshilfe und Perinatalmedizin",
      "definition": "FA Frauenheilkunde und Geburtshilfe mit SP Spezielle Geburtshilfe und Perinatalmedizin"
    },
    {
      "code": "091001",
      "display": "FA Hals-Nasen-Ohrenheilkunde"
    },
    {
      "code": "091002",
      "display": "FA Phoniatrie und Pädaudiologie"
    },
    {
      "code": "091101",
      "display": "FA Sprach-; Stimm- und kindliche Hörstörungen"
    },
    {
      "code": "093001",
      "display": "TG Audiologie",
      "definition": "FA Hals- Nasen- Ohrenheilkunde mit TG Audiologie"
    },
    {
      "code": "093002",
      "display": "TG Phoniatrie",
      "definition": "FA Hals- Nasen- Ohrenheilkunde mit TG Phoniatrie"
    },
    {
      "code": "093003",
      "display": "TG Phoniatrie und Pädaudiologie",
      "definition": "FA Hals- Nasen- Ohrenheilkunde mit TG Phoniatrie und Pädaudiologie"
    },
    {
      "code": "101001",
      "display": "FA Dermatologie und Venerologie"
    },
    {
      "code": "101002",
      "display": "FA Haut- und Geschlechtskrankheiten"
    },
    {
      "code": "111001",
      "display": "FA Humangenetik"
    },
    {
      "code": "121001",
      "display": "FA Hygiene"
    },
    {
      "code": "121002",
      "display": "FA Hygiene und Umweltmedizin"
    },
    {
      "code": "131001",
      "display": "FA Immunologie"
    },
    {
      "code": "141002",
      "display": "FA Innere Medizin"
    },
    {
      "code": "141110",
      "display": "FA Innere Medizin und Angiologie"
    },
    {
      "code": "141111",
      "display": "FA Innere Medizin und Endokrinologie und Diabetologie"
    },
    {
      "code": "141112",
      "display": "FA Innere Medizin und Gastroenterologie"
    },
    {
      "code": "141903",
      "display": "FA Innere Medizin und Geriatrie"
    },
    {
      "code": "141113",
      "display": "FA Innere Medizin und Hämatologie und Onkologie"
    },
    {
      "code": "141904",
      "display": "FA Innere Medizin und Infektiologie"
    },
    {
      "code": "141114",
      "display": "FA Innere Medizin und Kardiologie"
    },
    {
      "code": "141115",
      "display": "FA Innere Medizin und Nephrologie"
    },
    {
      "code": "141116",
      "display": "FA Innere Medizin und Pneumologie"
    },
    {
      "code": "141117",
      "display": "FA Innere Medizin und Rheumatologie"
    },
    {
      "code": "141102",
      "display": "FA Innere Medizin und Schwerpunkt Angiologie"
    },
    {
      "code": "141103",
      "display": "FA Innere Medizin und Schwerpunkt Endokrinologie und Diabetologie"
    },
    {
      "code": "141104",
      "display": "FA Innere Medizin und Schwerpunkt Gastroenterologie"
    },
    {
      "code": "141901",
      "display": "FA Innere Medizin und Schwerpunkt Geriatrie"
    },
    {
      "code": "141902",
      "display": "FA Innere Medizin und Schwerpunkt gesamte Innere Medizin"
    },
    {
      "code": "141105",
      "display": "FA Innere Medizin und Schwerpunkt Hämatologie und Onkologie"
    },
    {
      "code": "141106",
      "display": "FA Innere Medizin und Schwerpunkt Kardiologie"
    },
    {
      "code": "141107",
      "display": "FA Innere Medizin und Schwerpunkt Nephrologie"
    },
    {
      "code": "141108",
      "display": "FA Innere Medizin und Schwerpunkt Pneumologie"
    },
    {
      "code": "141109",
      "display": "FA Innere Medizin und Schwerpunkt Rheumatologie"
    },
    {
      "code": "141003",
      "display": "FA Internist/Lungen- und Bronchialheilkunde"
    },
    {
      "code": "141005",
      "display": "FA Lungen- und Bronchialheilkunde"
    },
    {
      "code": "141004",
      "display": "FA Lungenheilkunde"
    },
    {
      "code": "142001",
      "display": "SP Angiologie"
    },
    {
      "code": "142002",
      "display": "SP Endokrinologie"
    },
    {
      "code": "142901",
      "display": "SP Endokrinologie und Diabetologie",
      "definition": "FA Innere Medizin mit SP Endokrinologie und Diabetologie"
    },
    {
      "code": "142003",
      "display": "SP Gastroenterologie"
    },
    {
      "code": "142004",
      "display": "SP Geriatrie",
      "definition": "FA Innere Medizin mit SP Geriatrie"
    },
    {
      "code": "142005",
      "display": "SP Hämatologie und Internistische Onkologie",
      "definition": "FA Innere Medizin mit SP Hämatologie und Internistische Onkologie"
    },
    {
      "code": "142006",
      "display": "SP Infektiologie",
      "definition": "FA Innere Medizin mit SP Infektiologie"
    },
    {
      "code": "142007",
      "display": "SP Kardiologie",
      "definition": "FA Innere Medizin mit SP Kardiologie"
    },
    {
      "code": "142008",
      "display": "SP Nephrologie",
      "definition": "FA Innere Medizin mit SP Nephrologie"
    },
    {
      "code": "142009",
      "display": "SP Pneumologie",
      "definition": "FA Innere Medizin mit SP Pneumologie"
    },
    {
      "code": "142010",
      "display": "SP Rheumatologie",
      "definition": "FA Innere Medizin mit SP Rheumatologie"
    },
    {
      "code": "143001",
      "display": "TG Diabetologie",
      "definition": "FA Innere Medizin mit TG Diabetologie"
    },
    {
      "code": "143002",
      "display": "TG Endokrinologie",
      "definition": "FA Innere Medizin mit TG Endokrinologie"
    },
    {
      "code": "143003",
      "display": "TG Gastroenterologie",
      "definition": "FA Innere Medizin mit TG Gastroenterologie"
    },
    {
      "code": "143004",
      "display": "TG Hämatologie",
      "definition": "FA Innere Medizin mit TG Hämatologie"
    },
    {
      "code": "143005",
      "display": "TG Infektions- und Tropenmedizin",
      "definition": "FA Innere Medizin mit TG Infektions- und Tropenmedizin"
    },
    {
      "code": "143006",
      "display": "TG Kardiologie",
      "definition": "FA Innere Medizin mit TG Kardiologie"
    },
    {
      "code": "143901",
      "display": "TG Kardiologie und Angiologie",
      "definition": "FA Innere Medizin mit TG Kardiologie und Angiologie"
    },
    {
      "code": "143007",
      "display": "TG Lungen- und Bronchialheilkunde",
      "definition": "FA Innere Medizin mit TG Lungen- und Bronchialheilkunde"
    },
    {
      "code": "143008",
      "display": "TG Nephrologie",
      "definition": "FA Innere Medizin mit TG Nephrologie"
    },
    {
      "code": "143009",
      "display": "TG Rheumatologie",
      "definition": "FA Innere Medizin mit TG Rheumatologie"
    },
    {
      "code": "151002",
      "display": "FA Kinder- und Jugendmedizin"
    },
    {
      "code": "151001",
      "display": "FA Kinderheilkunde"
    },
    {
      "code": "152901",
      "display": "SP Endokrinologie und Diabetologie in der Kinder- und Jugendmedizin"
    },
    {
      "code": "152902",
      "display": "SP Gastroenterologie in der Kinder- und Jugendmedizin"
    },
    {
      "code": "152001",
      "display": "SP Infektiologie",
      "definition": "FA Kinder- und Jugendmedizin mit SP Infektiologie"
    },
    {
      "code": "152201",
      "display": "SP Kinder- und Jugend-Hämatologie und -Onkologie",
      "definition": "FA Kinder- und Jugendmedizin mit SP Kinder- und Jugend-Hämatologie und -Onkologie"
    },
    {
      "code": "152202",
      "display": "SP Kinder- und Jugend-Kardiologie",
      "definition": "FA Kinder- und Jugendmedizin mit SP Kinder- und Jugend-Kardiologie"
    },
    {
      "code": "152101",
      "display": "SP Kinder-Hämatologie und -Onkologie",
      "definition": "FA Kinder- und Jugendmedizin mit SP Kinder-Hämatologie und -Onkologie"
    },
    {
      "code": "152002",
      "display": "SP Kinder-Kardiologie",
      "definition": "FA Kinder- und Jugendmedizin mit SP Kinder-Kardiologie"
    },
    {
      "code": "152906",
      "display": "SP Kinderpneumologie",
      "definition": "FA Kinder- und Jugendmedizin mit SP Kinderpneumologie"
    },
    {
      "code": "152003",
      "display": "SP Neonatologie",
      "definition": "FA Kinder- und Jugendmedizin mit SP Neonatologie"
    },
    {
      "code": "152903",
      "display": "SP Nephrologie",
      "definition": "FA Kinder- und Jugendmedizin mit SP Nephrologie"
    },
    {
      "code": "152102",
      "display": "SP Neuropädiatrie",
      "definition": "FA Kinder- und Jugendmedizin mit SP Neuropädiatrie"
    },
    {
      "code": "152904",
      "display": "SP Pädiatrische Rheumatologie",
      "definition": "FA Kinder- und Jugendmedizin mit SP Pädiatrische Rheumatologie"
    },
    {
      "code": "152905",
      "display": "SP Pulmologie in der Kinder- und Jugendmedizin",
      "definition": "FA Kinder- und Jugendmedizin mit SP Pulmologie in der Kinder- und Jugendmedizin"
    },
    {
      "code": "153001",
      "display": "TG Kinderdiabetologie",
      "definition": "FA Kinder- und Jugendmedizin mit TG Kinderdiabetologie"
    },
    {
      "code": "153002",
      "display": "TG Kindergastroenterologie",
      "definition": "FA Kinder- und Jugendmedizin mit TG Kindergastroenterologie"
    },
    {
      "code": "153003",
      "display": "TG Kinderhämatologie",
      "definition": "FA Kinder- und Jugendmedizin mit TG Kinderhämatologie"
    },
    {
      "code": "153004",
      "display": "TG Kinderkardiologie",
      "definition": "FA Kinder- und Jugendmedizin mit TG Kinderkardiologie"
    },
    {
      "code": "153005",
      "display": "TG Kinderlungen- und -bronchialheilkunde",
      "definition": "FA Kinder- und Jugendmedizin mit TG Kinderlungen- und -bronchialheilkunde"
    },
    {
      "code": "153006",
      "display": "TG Kinderneonatologie",
      "definition": "FA Kinder- und Jugendmedizin mit TG Kinderneonatologie"
    },
    {
      "code": "153007",
      "display": "TG Kindernephrologie",
      "definition": "FA Kinder- und Jugendmedizin mit TG Kindernephrologie"
    },
    {
      "code": "153008",
      "display": "TG Kinderneuropsychiatrie",
      "definition": "FA Kinder- und Jugendmedizin mit TG Kinderneuropsychiatrie"
    },
    {
      "code": "161001",
      "display": "FA Kinder- und Jugendpsychiatrie"
    },
    {
      "code": "161002",
      "display": "FA Kinder- und Jugendpsychiatrie und -psychotherapie"
    },
    {
      "code": "171001",
      "display": "FA Laboratoriumsmedizin"
    },
    {
      "code": "173001",
      "display": "TG Medizinische Mikrobiologie",
      "definition": "FA Laboratoriumsmedizin mit TG Medizinische Mikrobiologie"
    },
    {
      "code": "181001",
      "display": "FA Mikrobiologie"
    },
    {
      "code": "181002",
      "display": "FA Mikrobiologie und Infektionsepidemiologie"
    },
    {
      "code": "181101",
      "display": "FA Mikrobiologie; Virologie und Infektionsepidemiologie"
    },
    {
      "code": "191001",
      "display": "FA Kieferchirurgie"
    },
    {
      "code": "191002",
      "display": "FA Mund-Kiefer-Gesichtschirurgie"
    },
    {
      "code": "191901",
      "display": "FA Oralchirurgie"
    },
    {
      "code": "201001",
      "display": "FA Nervenheilkunde"
    },
    {
      "code": "201002",
      "display": "FA Nervenheilkunde (Neurologie und Psychiatrie)"
    },
    {
      "code": "201003",
      "display": "FA Neurologie und Psychiatrie (Nervenarzt)"
    },
    {
      "code": "203001",
      "display": "TG Kinderneuropsychiatrie",
      "definition": "FA Nervenheilkunde mit TG Kinderneuropsychiatrie"
    },
    {
      "code": "211001",
      "display": "FA Neurochirurgie"
    },
    {
      "code": "221001",
      "display": "FA Neurologie"
    },
    {
      "code": "222901",
      "display": "SP Geriatrie",
      "definition": "FA Neurologie mit SP Geriatrie"
    },
    {
      "code": "231001",
      "display": "FA Nuklearmedizin"
    },
    {
      "code": "241001",
      "display": "FA Öffentliches Gesundheitswesen"
    },
    {
      "code": "251001",
      "display": "FA Neuropathologie"
    },
    {
      "code": "251002",
      "display": "FA Pathobiochemie und Labordiagnostik"
    },
    {
      "code": "251003",
      "display": "FA Pathologie"
    },
    {
      "code": "251004",
      "display": "FA Pathologische Anatomie"
    },
    {
      "code": "251005",
      "display": "FA Pathologische Physiologie"
    },
    {
      "code": "253001",
      "display": "TG Neuropathologie",
      "definition": "FA Pathologie mit TG Neuropathologie"
    },
    {
      "code": "261001",
      "display": "FA Klinische Pharmakologie"
    },
    {
      "code": "261002",
      "display": "FA Pharmakologie"
    },
    {
      "code": "261003",
      "display": "FA Pharmakologie und Toxikologie"
    },
    {
      "code": "263001",
      "display": "TG Klinische Pharmakologie",
      "definition": "FA Pharmakologie mit TG Klinische Pharmakologie"
    },
    {
      "code": "381201",
      "display": "Phoniatrie und Pädaudiologie"
    },
    {
      "code": "271001",
      "display": "FA Physikalische und Rehabilitative Medizin"
    },
    {
      "code": "271002",
      "display": "FA Physiotherapie"
    },
    {
      "code": "281001",
      "display": "FA Physiologie"
    },
    {
      "code": "291001",
      "display": "FA Psychiatrie"
    },
    {
      "code": "291002",
      "display": "FA Psychiatrie und Psychotherapie"
    },
    {
      "code": "292101",
      "display": "SP Forensische Psychiatrie"
    },
    {
      "code": "292901",
      "display": "SP Geriatrie",
      "definition": "FA Psychiatrie und Psychotherapie mit SP Geriatrie"
    },
    {
      "code": "301101",
      "display": "FA Psychosomatische Medizin und Psychotherapie"
    },
    {
      "code": "301001",
      "display": "FA Psychotherapeutische Medizin"
    },
    {
      "code": "301002",
      "display": "FA Psychotherapie"
    },
    {
      "code": "311001",
      "display": "FA Diagnostische Radiologie"
    },
    {
      "code": "311002",
      "display": "FA Radiologie"
    },
    {
      "code": "311003",
      "display": "FA Radiologische Diagnostik"
    },
    {
      "code": "312201",
      "display": "SP Kinder- und Jugendradiologie",
      "definition": "FA Radiologie mit SP Kinder- und Jugendradiologie"
    },
    {
      "code": "312001",
      "display": "SP Kinderradiologie",
      "definition": "FA Radiologie mit SP Kinderradiologie"
    },
    {
      "code": "312002",
      "display": "SP Neuroradiologie",
      "definition": "FA Radiologie mit SP Neuroradiologie"
    },
    {
      "code": "313001",
      "display": "TG Kinderradiologie",
      "definition": "FA Radiologie mit TG Kinderradiologie"
    },
    {
      "code": "313002",
      "display": "TG Neuroradiologie",
      "definition": "FA Radiologie mit TG Neuroradiologie"
    },
    {
      "code": "313003",
      "display": "TG Strahlentherapie",
      "definition": "FA Radiologie mit TG Strahlentherapie"
    },
    {
      "code": "321001",
      "display": "FA Rechtsmedizin"
    },
    {
      "code": "351001",
      "display": "FA Strahlentherapie"
    },
    {
      "code": "361001",
      "display": "FA Blutspende- und Transfusionswesen"
    },
    {
      "code": "361002",
      "display": "FA Transfusionsmedizin"
    },
    {
      "code": "371001",
      "display": "FA Urologie"
    },
    {
      "code": "011002",
      "display": "FA Praktischer Arzt"
    },
    {
      "code": "011101",
      "display": "FA Innere und Allgemeinmedizin (Hausarzt)"
    },
    {
      "code": "142902",
      "display": "SP Geriatrie",
      "definition": "Facharzt für Innere Medizin mit Schwerpunkt Geriatrie"
    },
    {
      "code": "331001",
      "display": "FA Sozialhygiene"
    },
    {
      "code": "341001",
      "display": "FA Sportmedizin"
    },
    {
      "code": "590001",
      "display": "Biomathematik"
    },
    {
      "code": "590002",
      "display": "Biophysik"
    },
    {
      "code": "590003",
      "display": "Geschichte der Medizin"
    },
    {
      "code": "590004",
      "display": "Industrietoxikologie"
    },
    {
      "code": "590005",
      "display": "Kieferchirurgie"
    },
    {
      "code": "590006",
      "display": "Klinische Strahlenphysik"
    },
    {
      "code": "590007",
      "display": "Medizinische Genetik"
    },
    {
      "code": "590008",
      "display": "Medizinische Informatik"
    },
    {
      "code": "590009",
      "display": "Medizinische Physik und Biophysik"
    },
    {
      "code": "590010",
      "display": "Medizinische Wissenschaftsinformation"
    },
    {
      "code": "590011",
      "display": "Pathologische Biochemie"
    },
    {
      "code": "000001",
      "display": "Ärztin/Arzt"
    },
    {
      "code": "000011",
      "display": "Praktische Ärztin/Praktischer Arzt (EWG-Recht ab 86/457/EWG)"
    }
  ],
  "count": 197,
  "meta": {
    "tag": [
      {
        "system": "https://mii-termserv.de/fhir/su-termserv/CodeSystem/mii-cs-suts-resource-tags-project",
        "code": "ihe",
        "display": "Integrating the Healthcare Enterprise"
      },
      {
        "system": "https://mii-termserv.de/fhir/su-termserv/CodeSystem/mii-cs-suts-resource-tags-dataset",
        "code": "ihe-d",
        "display": "Integrating the Healthcare Enterprise Germany"
      },
      {
        "system": "https://mii-termserv.de/fhir/su-termserv/CodeSystem/mii-cs-suts-resource-tags-license",
        "code": "https://mii-termserv.de/licenses#ihe",
        "display": "Integrating the Healthcare Enterprise (IHE) license"
      }
    ]
  },
  "extension": [
    {
      "url": "http://hl7.org/fhir/StructureDefinition/cqf-scope",
      "valueString": "@mii-termserv/de.ihe-d.terminology"
    }
  ],
  "text": {
    "status": "generated",
    "div": "<div xmlns=\"http://www.w3.org/1999/xhtml\"><h2>Facharzttitel Der Aerztekammern</h2><tt>http://ihe-d.de/CodeSystems/FacharzttitelDerAerztekammern</tt><div><p><b>SU-TermServ Metadata</b></p><table><tbody><tr><td><b>Project</b></td><td>Integrating the Healthcare Enterprise</td></tr><tr><td><b>Dataset</b></td><td>Integrating the Healthcare Enterprise Germany</td></tr><tr><td><b>License</b></td><td><a href=\"https://mii-termserv.de/licenses#ihe\">Integrating the Healthcare Enterprise (IHE) license</a></td></tr><tr><td><b>Package Scope</b></td><td><a href=\"https://gitlab.com/groups/mii-termserv/fhir-resources/-/packages/?ForderBy%3Dversion%26sort%3Ddesc%26search%5B%5D%3D@mii-termserv/de.ihe-d.terminology\"><code>@mii-termserv/de.ihe-d.terminology</code></a></td></tr></tbody></table></div></div>"
  }
}