{
  "resourceType": "ValueSet",
  "id": "ihe-d-1.2.276.0.76.11.39--20210706211831-v3.0.0",
  "meta": {
    "profile": [
      "http://hl7.org/fhir/StructureDefinition/shareablevalueset"
    ],
    "tag": [
      {
        "system": "https://mii-termserv.de/fhir/su-termserv/CodeSystem/mii-cs-suts-resource-tags-project",
        "code": "ihe",
        "display": "Integrating the Healthcare Enterprise"
      },
      {
        "system": "https://mii-termserv.de/fhir/su-termserv/CodeSystem/mii-cs-suts-resource-tags-dataset",
        "code": "ihe-d",
        "display": "Integrating the Healthcare Enterprise Germany"
      },
      {
        "system": "https://mii-termserv.de/fhir/su-termserv/CodeSystem/mii-cs-suts-resource-tags-license",
        "code": "https://mii-termserv.de/licenses#ihe",
        "display": "Integrating the Healthcare Enterprise (IHE) license"
      }
    ]
  },
  "extension": [
    {
      "url": "http://hl7.org/fhir/StructureDefinition/cqf-scope",
      "valueString": "@mii-termserv/de.ihe-d.terminology"
    }
  ],
  "url": "http://ihe-d.de/ValueSets/IHEXDScontentTypeCode",
  "identifier": [
    {
      "use": "official",
      "system": "urn:ietf:rfc:3986",
      "value": "urn:oid:1.2.276.0.76.11.39"
    }
  ],
  "version": "2021-07-06T21:18:31",
  "name": "IHEXDScontentTypeCode",
  "title": "IHE XDS contentTypeCode",
  "status": "active",
  "experimental": false,
  "publisher": "IHE Deutschland e.V.",
  "description": "**contentTypeCode (XDSSubmissionSet)**\r\nThe code specifying the type of clinical activity that resulted in placing XDS Documents in a SubmissionSet.",
  "immutable": false,
  "compose": {
    "include": [
      {
        "system": "http://ihe-d.de/CodeSystems/GrundDerUebermittlung",
        "concept": [
          {
            "code": "1",
            "display": "Patientenkontakt"
          },
          {
            "code": "2",
            "display": "Verlegung"
          },
          {
            "code": "3",
            "display": "Entlassung"
          },
          {
            "code": "4",
            "display": "Überweisung/Einweisung"
          },
          {
            "code": "5",
            "display": "Aufnahme"
          },
          {
            "code": "6",
            "display": "Anforderung"
          },
          {
            "code": "7",
            "display": "Auf Anfrage"
          },
          {
            "extension": [
              {
                "url": "http://hl7.org/fhir/StructureDefinition/valueset-concept-comments",
                "valueString": "Regelmäßige Übertragungen (z.B. Implantate, Fitnesstracker), auch wenn durch den Patienten ursprünglich veranlasst, werden über das Konzept 11 (\"Monitoring\") abgebildet."
              }
            ],
            "code": "8",
            "display": "Veranlassung durch Patient"
          },
          {
            "code": "9",
            "display": "Konsil/Zweitmeinung"
          },
          {
            "code": "10",
            "display": "Systemwechsel/Archivierung"
          },
          {
            "code": "11",
            "display": "Monitoring"
          }
        ]
      }
    ]
  },
  "text": {
    "status": "generated",
    "div": "<div xmlns=\"http://www.w3.org/1999/xhtml\"><h2>IHE XDS contentTypeCode</h2><tt>http://ihe-d.de/ValueSets/IHEXDScontentTypeCode</tt><p>**contentTypeCode (XDSSubmissionSet)**\r\nThe code specifying the type of clinical activity that resulted in placing XDS Documents in a SubmissionSet.</p><div><p><b>SU-TermServ Metadata</b></p><table><tbody><tr><td><b>Project</b></td><td>Integrating the Healthcare Enterprise</td></tr><tr><td><b>Dataset</b></td><td>Integrating the Healthcare Enterprise Germany</td></tr><tr><td><b>License</b></td><td><a href=\"https://mii-termserv.de/licenses#ihe\">Integrating the Healthcare Enterprise (IHE) license</a></td></tr><tr><td><b>Package Scope</b></td><td><a href=\"https://gitlab.com/groups/mii-termserv/fhir-resources/-/packages/?ForderBy%3Dversion%26sort%3Ddesc%26search%5B%5D%3D@mii-termserv/de.ihe-d.terminology\"><code>@mii-termserv/de.ihe-d.terminology</code></a></td></tr></tbody></table></div></div>"
  }
}