{
  "resourceType": "CodeSystem",
  "url": "http://ihe-d.de/CodeSystems/AerztlicheFachrichtungen",
  "version": "2019-04-05T08:35:59",
  "name": "AerztlicheFachrichtungen",
  "id": "ihe-d-AerztlicheFachrichtungen-v3.0.0",
  "title": "Aerztliche Fachrichtungen",
  "status": "active",
  "experimental": false,
  "publisher": "IHE Deutschland e.V.",
  "caseSensitive": true,
  "content": "complete",
  "concept": [
    {
      "code": "ALLG",
      "display": "Allgemeinmedizin",
      "definition": "Die Allgemeinmedizin beinhaltet die Grundversorgung eines Patienten bei körperlichen und/oder seelischen Gesundheitsstörungen. Weiterhin gehören die Aspekte der Prävention und Rehabilitation in den Versorgungsbereich der Allgemeinmedizin.Nutzungshinweis: Dazu zählen auch hausärztlich tätige Praxen von Praktischen Ärzten."
    },
    {
      "code": "ANAE",
      "display": "Anästhesiologie",
      "definition": "Das Fachgebiet der Anästhesiologie umfasst neben den Anästhesieverfahren selbst die Aufrechterhaltung der Vitalfunktionen eines Patienten während eines Eingriffs."
    },
    {
      "code": "ARBE",
      "display": "Arbeitsmedizin",
      "definition": "Die Arbeitsmedizin ist ein präventivmedizinisches Fachgebiet und umfasst einerseits die Wechselbeziehungen zwischen Arbeits- und Lebenswelten, andererseits auch die Gesundheit und Krankheiten. Der wesentliche Aspekt ist hierbei der Erhalt und die Förderung der physischen und psychischen Gesundheit und Leistungsfähigkeit des arbeitenden Menschen.Nutzungshinweis: Das Konzept umfasst auch die Musikermedizin, auch wenn Patienten aus diesem Bereich nicht notwendigerweise professionelle Musiker sind."
    },
    {
      "code": "AUGE",
      "display": "Augenheilkunde",
      "definition": "Das Fachgebiet der Augenheilkunde  umfasst die Diagnose und Behandlung aller Erkrankungen bzw. Funktionsstörungen des Sehorgans, seiner Anhangsorgane sowie des Sehsinnes."
    },
    {
      "code": "CHIR",
      "display": "Chirurgie",
      "definition": "Die Chirurgie umfasst alle operativen Therapien von Krankheiten sowie von Verletzungen. Teilgebiete der Chirurgie etablierten sich als \"Spezialdisziplin\". Nutzungshinweis: Teilgebiete für die keine eigenen Konzepte aufgeführt sind, z.B. die Handchirurgie, können mit diesem Konzept abgedeckt werden."
    },
    {
      "code": "ALCH",
      "display": "Allgemeinchirurgie",
      "definition": "Allgemeinchirurgie war früher der Oberbergriff für die gesamte Chirurgie. Bedingt durch die Spezialisierungen in der Chirurgie entwickelte sich die Allgemeinchirurgie als \"Auffangbecken\", in welchem alle Eingriffe durchgeführt werden, die nicht durch eine Spezialisierung abgedeckt werden."
    },
    {
      "code": "GFCH",
      "display": "Gefäßchirurgie",
      "definition": "Die Gefäßchirurgie ist eine Spezialisierung des Fachgebietes Chirurgie. Das Fachgebiet umfasst die Behandlung der Blutgefäße bei Verschlusserkrankungen oder auch Aneurysmen."
    },
    {
      "code": "HZCH",
      "display": "Herzchirurgie",
      "definition": "Die Herzchirurgie ist eine Spezialisierung des Fachgebietes Chirurgie. Das Fachgebiet umfasst die Therapie von Erkrankungen sowie von Verletzungen des Herzens und der herznahen Gefäße."
    },
    {
      "code": "KDCH",
      "display": "Kinderchirurgie",
      "definition": "Die Kinderchirurgie ist eine Spezialisierung des Fachgebietes Chirurgie. Das Fachgebiet umfasst die operative und konservative Therapie von Erkrankungen, Verletzungen, Fehlbildungen im Kindesalter inkl. der Pränatalchirurgie."
    },
    {
      "code": "ORTH",
      "display": "Orthopädie",
      "definition": "Die Orthopädie ist eine Spezialisierung des Fachgebietes Chirurgie. Das Fachgebiet umfasst die Erkrankungen und Fehlbildungen des Stütz- und Bewegungsapparates. Nutzungshinweis: Falls die Wirbelsäulenchirurgie organisatorisch als Teil der Orthopädie (und nicht als Teil der Neurochirurgie) geführt wird, deckt dieses Konzept auch die Wirbelsäulenchirurgie ab."
    },
    {
      "code": "PLCH",
      "display": "Plastische und Ästhetische Chirurgie",
      "definition": "Die Plastische Chirurgie ist eine Spezialisierung des Fachgebietes Chirurgie. Das Fachgebiet umfasst formverändernde oder wiederherstellende Eingriffe am menschlichen Körper."
    },
    {
      "code": "THCH",
      "display": "Thoraxchirurgie",
      "definition": "Die Thoraxchirurgie ist eine Spezialisierung des Fachgebietes Chirurgie. Das Fachgebiet umfasst diagnostische und therapeutische Eingriffe an den Organen des Brustkorbs ausgenommen dem Herzen. D.h. es umfasst die Versorgung von Erkrankungen und Verletzungen der Lunge, der Pleura, des Bronchialsystems, des Mediastinums und der Thoraxwand."
    },
    {
      "code": "UNFC",
      "display": "Unfallchirurgie",
      "definition": "Die Unfallchirurgie ist eine Spezialisierung des Fachgebietes Chirurgie. Das Fachgebiet umfasst die Versorgung von Verletzungen sowie die  Behandlung von Mehrfachverletzten einschließlich des entsprechenden Traumamanagements."
    },
    {
      "code": "VICH",
      "display": "Viszeralchirurgie",
      "definition": "Die Viszeralchirurgie ist eine Spezialisierung des Fachgebietes Chirurgie. Das Fachgebiet umfasst die Eingriffe an den Organen des Bauchraumes sowie die operative Behandlung der Schilddrüse und der Nebenschilddrüse."
    },
    {
      "code": "FRAU",
      "display": "Frauenheilkunde und Geburtshilfe",
      "definition": "Die Frauenheilkunde beinhaltet die Diagnose und Therapie der Erkrankungen des weiblichen Sexual- und Fortpflanzungstraktes. Die Fachrichtung der Geburtshilfe befasst sich mit der Überwachung von Schwangerschaften sowie der Vorbereitung, Durchführung und Nachbehandlung von Geburten."
    },
    {
      "code": "GEND",
      "display": "Gynäkologische Endokrinologie und Reproduktionsmedizin",
      "definition": "Die gynäkologische Endokrinologie befasst sich mit der Diagnostik und Therapie von Hormonstörungen. Die Reproduktionsmedizin befasst sich mit Fragen bei unerfülltem Kinderwunsch."
    },
    {
      "code": "GONK",
      "display": "Gynäkologische Onkologie",
      "definition": "Die gynäkologische Onkologie befasst sich mit  Vorsorge, Diagnostik, Therapie und Nachsorge von Krebserkrankungen bei der Brust bzw. des weiblichen Genitals."
    },
    {
      "code": "PERI",
      "display": "Perinatalmedizin",
      "definition": "Die Perinatalmedizin befasst sich mit den Erkrankungen und Gefährdungen von Mutter und Kind im perinatalen Zeitraum, dies ist der Zeitraum zwischen der 24. Schwangerschaftswoche und dem 7. Tag nach der Geburt."
    },
    {
      "code": "GERI",
      "display": "Geriatrie",
      "definition": "Das Fachgebiet der Geriatrie beschäftigt sich mit der Versorgung von akuten und chronischen Erkrankungen sowie der Rehabilitation und Prävention alter Patienten."
    },
    {
      "code": "HNOH",
      "display": "Hals-Nasen-Ohrenheilkunde",
      "definition": "Das Gebiet der Hals-Nasen-Ohrenkunde befasst sich mit Erkrankungen, Verletzungen, Fehlbildungen sowie Funktionsstörungen im Kopf-, Halsbereich, insbesondere der Ohren, der oberen und unteren Luftwege sowie der Speiseröhre."
    },
    {
      "code": "HRST",
      "display": "Sprach-, Stimm- und kindliche Hörstörungen",
      "definition": "Das Fachgebiet Sprach-, Stimm- und kindliche Hörstörungen umfasst die Diagnostik, Therapie und Forschung in den Bereichen Stimmstörungen, kindliche Hörstörungen, Wahrnehmungsstörungen, Störungen der Sprech- und Sprachentwicklung, erworbenen Sprech- und Sprachstörungen (z.B. Aphasien) und Schluckstörungen."
    },
    {
      "code": "HAUT",
      "display": "Haut- und Geschlechtskrankheiten",
      "definition": "Das Konzept umfasst sowohl die Dermatologie, wie auch die Phlebologie und die Venerologie. Das Gebiet der Dermatologie befasst sich mit Diagnose und Therapie von Erkrankungen der Haut. Das Gebiet der Phlebologie umfasst die Erkennung und Behandlung von Gefäßerkrankungen. Die Venerologie beinhaltet die Diagnose und Therapie der sexuell übertragbaren Erkrankungen."
    },
    {
      "code": "HUMA",
      "display": "Humangenetik",
      "definition": "Die Humangenetik beschäftigt sich mit dem Erbgut des Menschen. Zum Themenumfeld in der Humangenetik gehören insbesondere die Aufklärung, Erkennung und Behandlung genetisch bedingter Erkrankungen, einschließlich der genetischen Beratungen von Patienten, Angehörigen und behandelnden Ärzten. Nutzungshinweis:  Falls die Pädiatrische Genetik organisatorisch als Teil der Humangenetik (und nicht als Teil der Pädiatrie) geführt wird, deckt dieses Konzept auch die Pädiatrische Genetik ab."
    },
    {
      "code": "HYGI",
      "display": "Hygiene und Umweltmedizin",
      "definition": "Die Hygiene beschäftigt sich mit krankmachenden Einwirkungen auf den Organismus und versucht diese durch verschiedene Maßnahmen (Aufklärung, Reinigung, Desinfektion, Sterilisation, Grenzwerte) auszuschalten. Die Umweltmedizin beschäftigt sich mit Fragestellungen, die hinsichtlich Prävention, Diagnose und Therapie von Erkrankungen mit Umweltfaktoren in Verbindung gebracht werden."
    },
    {
      "code": "INNE",
      "display": "Innere Medizin",
      "definition": "Das Gebiet der Inneren Medizin befasst sich mit der Prävention, Diagnostik, nicht-operativen Therapie und der Rehabilitation bei Erkrankungen sämtlicher Organsysteme des Körpers. Die Innere Medizin beinhaltet mehrere Teilgebiete, die sich im Rahmen von Spezialisierungen entwickelten.Nutzungshinweis: Teilgebiete, für die keine eigenen Konzepte aufgeführt sind wie z.B. die klinische Immunologie, außerhalb der Rheumatologie, können mit diesem Konzept abgedeckt werden. Dazu zählen auch hausärztlich tätige Arztpraxen für Innere Medizin."
    },
    {
      "code": "ANGI",
      "display": "Angiologie",
      "definition": "Die Angiologie ist eine Spezialisierung des Fachgebietes Innere Medizin. Das Gebiet beschäftigt sich mit der Funktion und den Erkrankungen der Arterien, Venen und Lymphgefäße, insbesondere mit Diagnose und Therapie der verschiedenen Gefäßerkrankungen."
    },
    {
      "code": "ENDO",
      "display": "Endokrinologie und Diabetologie",
      "definition": "Endokrinologie und Diabetologie ist eine Spezialisierung des Fachgebietes Innere Medizin. Die Endokrinologie beschäftigt sich mit der der Funktion sowie den (krankhaften) Störungen der hormonproduzierenden Organe. Dazu zählt auch die Diabetologie."
    },
    {
      "code": "GAST",
      "display": "Gastroenterologie",
      "definition": "Die Gastroenterologie ist eine Spezialisierung des Fachgebietes Innere Medizin. Das Gebiet beschäftigt sich mit den Erkrankungen des Magen-Darm-Traktes, der Leber und der zum Verdauungstrakt gehörenden Hormondrüsen wie der Bauchspeicheldrüse.Nutzungshinweis: Das Konzept umfasst auch die Hepatologie."
    },
    {
      "code": "HAEM",
      "display": "Hämatologie und internistische Onkologie",
      "definition": "Die Hämatologie und internistische Onkologie ist eine Spezialisierung des Fachgebietes Innere Medizin. Dieses medizinische Teilgebiet beschäftigt sich mit gut- und bösartigen Erkrankungen des Blutes, der Lymphknoten und des lymphatischen Systems sowie bösartigen soliden Tumoren."
    },
    {
      "code": "KARD",
      "display": "Kardiologie",
      "definition": "Die Kardiologie ist eine Spezialisierung des Fachgebietes Innere Medizin. Das Gebiet befasst sich mit Diagnose und Therapie von Herz-Kreislauf-Erkrankungen."
    },
    {
      "code": "NEPH",
      "display": "Nephrologie",
      "definition": "Die Nephrologie ist eine Spezialisierung des Fachgebietes Innere Medizin. Das Gebiet beschäftigt mit Diagnostik und Therapie von Erkrankungen der Nieren."
    },
    {
      "code": "PNEU",
      "display": "Pneumologie",
      "definition": "Die Pneumologie ist eine Spezialisierung des Fachgebietes Innere Medizin. Das Gebiet beschäftigt sich mit der  Prophylaxe, Diagnose und nicht-operativen Therapie von Erkrankungen der Lunge, der Bronchien und der Pleura."
    },
    {
      "code": "RHEU",
      "display": "Rheumatologie",
      "definition": "Die Rheumatologie ist eine Spezialisierung des Fachgebietes Innere Medizin. Das Konzept umfasst auch die Fachrichtung 'orthopädische Rheumatologie'.  Das Gebiet beschäftigt sich mit Diagnose und Therapie der rheumatischen Erkrankungen, d.h. Erkrankungen  im Bereich der Gelenke, Gelenkkapseln, Sehnen, Knochen, Muskeln und des Bindegewebes, die nicht durch eine akute Verletzung oder einen Tumor hervorgerufen werden."
    },
    {
      "code": "INTM",
      "display": "Intensivmedizin",
      "definition": "Das Fachgebiet der Intensivmedizin beschäftigt sich mit der Diagnostik und Therapie lebensbedrohlicher Zustände sowie Krankheiten, die derartige Zustände beinhalten.Nutzungshinweis: Falls eine Intermediate Care Unit organisatorisch als Teil der Intensivmedizin (und nicht als Teil der jeweiligen Fachabteilung) geführt wird, deckt dieses Konzept auch die Intermediate Care Unit ab."
    },
    {
      "code": "INTZ",
      "display": "Interdisziplinäre Zusammenarbeit",
      "definition": "Interdisziplinäre Zusammenarbeit bezeichnet die Kooperationen verschiedener ärztlichen Fachrichtungen, die in einem gemeinsamen organisatorischen Rahmen an klinischen und wissenschaftlichen Fragestellungen arbeiten. Wenn möglich sollten die untergeordneten Fachrichtungen verwendet werden."
    },
    {
      "code": "INTO",
      "display": "Interdisziplinäre Onkologie",
      "definition": "Das Gebiet der Onkologie beschäftigt sich mit der Prävention, der Diagnostik, der Therapie und der Nachsorge von Krebserkrankungen. Hierbei ist oftmals eine fächerübergreifende (\"interdisziplinäre\") Zusammenarbeit erforderlich, woraus sich interdisziplinäre Behandlungszentren entwickelten."
    },
    {
      "code": "INTS",
      "display": "Interdisziplinäre Schmerzmedizin",
      "definition": "Das Fachgebiet der Schmerzmedizin beschäftigt sich mit der Diagnostik und Therapie des chronischen Schmerzes."
    },
    {
      "code": "TRPL",
      "display": "Transplantationsmedizin",
      "definition": "Die Transplantationsmedizin befasst sich mit der Übertragung von Zellen, Geweben, Organen oder Organsystemen von einem Organismus auf einen anderen Organismus. Die gesetzlichen Rahmenbedingungen der Transplantationsmedizin sind in Deutschland im Transplantationsgesetz geregelt, woraus sich die Bildung interdisziplinärer Einrichtungen zur Übertragung von Spenderorganen ableitet. Solche Transplantationszentren übernehmen in Ergänzung zu den jeweiligen spezialisierten klinischen Fachgebieten (z.B. Viszeralchirurgie, Herzchirurgie, Nephrologie) insbesondere Aufgaben im Bereich der Indikationsstellung, Vorbereitung, Dokumentation und Nachsorge bei Organtransplantationen und Lebend-Organspenden, sowie beim Wartelistenmanagement und bei erforderlicher psychischer Betreuung der Patienten im Krankenhaus vor und nach der Organübertragung. Sofern Dokumente in solchen oder vergleichbaren Transplantationsmedizinischen Einrichtungen erstellt werden und nicht einer spezifischeren, an Transplantationen beteiligten Fachrichtung zuzuordnen sind, können sie mit diesem Konzept codiert werden. Dokumente aus der Transplantationsimmunologie sollen mit dem Konzept TRAN (Transfusionsmedizin) codiert werden."
    },
    {
      "code": "SELT",
      "display": "seltene Erkrankungen",
      "definition": "Die Fachrichtung \"seltene Erkrankungen\" ist die Disziplin, die sich mit der Diagnostik und Behandlung von seltenen Erkrankungen (z.B. laut EU Prävalenz 1:2000 Erkrankungen) beschäftigt."
    },
    {
      "code": "KIJU",
      "display": "Kinder- und Jugendmedizin",
      "definition": "Das Fachgebiet der Kinder- und Jugendmedizin beschäftigt sich mit Prävention, Diagnose und Therapie von Erkrankungen des kindlichen und des jugendlichen Organismus sowie den Entwicklungsstörungen und Fehlbildungen bei einem Kind.Nutzungshinweis:  Falls die Pädiatrische Genetik organisatorisch als Teil der Pädiatrie (und nicht als Teil der Humangenetik) geführt wird, deckt dieses Konzept auch die Pädiatrische Genetik ab."
    },
    {
      "code": "KONK",
      "display": "Kinder-Hämatologie und -Onkologie",
      "definition": "Die Kinder-Hämatologie und -Onkologie ist eine Spezialisierung des Fachgebietes der Kinder- und Jugendmedizin. Das Gebiet beschäftigt mit der Diagnose und Therapie von Blut- und Tumorerkrankungen bei Kindern und Jugendlichen."
    },
    {
      "code": "KKAR",
      "display": "Kinder-Kardiologie",
      "definition": "Die Kinderkardiologie ist eine Spezialisierung des Fachgebietes der Kinder- und Jugendmedizin. Das Gebiet beschäftigt sich mit dem frühestmöglichen Erkennen und Behandeln von kindlichen angeborenen Herzfehlern."
    },
    {
      "code": "NNAT",
      "display": "Neonatologie",
      "definition": "Die Neonatologie ist eine Spezialisierung des Fachgebietes der Kinder- und Jugendmedizin. Das Gebiet beschäftigt sich mit Diagnose und Therapie der Erkrankungen von Neugeborenen."
    },
    {
      "code": "NPAE",
      "display": "Neuropädiatrie",
      "definition": "Die Neuropädiatrie ist eine Spezialisierung des Fachgebietes der Kinder- und Jugendmedizin. Das Gebiet beschäftigt sich mit der Prävention, Diagnose und Therapie von Nervenkrankheiten von Kindern."
    },
    {
      "code": "KPSY",
      "display": "Kinder- und Jugendpsychiatrie und -psychotherapie",
      "definition": "Das Fachgebiet der Kinder- und Jugendpsychiatrie und -psychotherapie beinhaltet Diagnostik, die nichtoperative Therapie sowie Prävention und Rehabilitation von psychischen, psychosomatischen, entwicklungsbedingten und neurologischen Erkrankungen oder Störungen im Kindes- und Jugendalter, ebenso psychische und soziale Verhaltensauffälligkeiten bei Kindern und Jugendlichen."
    },
    {
      "code": "LABO",
      "display": "Laboratoriumsmedizin",
      "definition": "Das Fachgebiet der Laboratoriumsmedizin beschäftigt sich mit der Untersuchung von Körperflüssigkeiten und -ausscheidungen zum Zwecke der Diagnostik bzw. Verlaufs- und Therapiekontrolle. Durch dieses Konzept werden auch die Konzepte \"Immunologisches Labor\" und \"Zellmarkerlabor\" abgedeckt."
    },
    {
      "code": "MIKR",
      "display": "Mikrobiologie, Virologie und Infektionsepidemiologie",
      "definition": "Die Mikrobiologie beschäftigt sich mit der Erforschung von Mikroorganismen, ihrem Stoffwechsel und ihrer Wirkung auf andere Organismen. Die Virologie ist die Lehre von den Viren. Die Infektionsepidemiologie beschäftigt sich  mit der Epidemiologie von übertragbaren Erkrankungen.In diesen drei Fachgebieten wird mittels der Labordiagnostik die Ursache von durch Mikroorganismen, Viren und anderen übertragbaren Stoffen ausgelöste Erkrankungen gesucht."
    },
    {
      "code": "MKGC",
      "display": "Mund-Kiefer-Gesichtschirurgie",
      "definition": "Das Fachgebiet der Mund-, Kiefer- und Gesichtschirurgie umfasst die Prävention, Diagnostik, Therapie und Nachsorge von Erkrankungen, Verletzungen oder Fehlbildungen im Bereich des Kiefers, des Gesichtes, der Zähne und des Mund- und Rachenraumes bis hin zum Halsbereich."
    },
    {
      "code": "NATU",
      "display": "Naturheilverfahren und alternative Heilmethoden",
      "definition": "Naturheilverfahren umfassen Maßnahmen, die sich keiner technologischen Hilfsmittel bedienen und die Selbstheilungskräfte des Körpers stärken wollen."
    },
    {
      "code": "NOTF",
      "display": "Notfallmedizin",
      "definition": "Das Fachgebiet der Notfallmedizin befasst sich mit der Diagnostik und Therapie von akut eingetretenen, unter Umständen lebensbedrohlichen Gesundheitsstörungen. Das Gebiet hat die zwei Spezialisierungen \"präklinische Rettungsmedizin\" und \"Katastrophenmedizin\"."
    },
    {
      "code": "NRCH",
      "display": "Neurochirurgie",
      "definition": "Das Fachgebiet der Neurochirurgie befasst sich mit der operativen Behandlung von Fehlbildungen, Erkrankungen oder Verletzungen des peripheren oder zentralen Nervensystems.Nutzungshinweis: Falls die Wirbelsäulenchirurgie organisatorisch als Teil der Neurochirurgie (und nicht als Teil der Orthopädie) geführt wird, deckt dieses Konzept auch die Wirbelsäulenchirurgie ab."
    },
    {
      "code": "NEUR",
      "display": "Neurologie",
      "definition": "Das Fachgebiet der Neurologie umfasst die Prophylaxe, Diagnose und (nicht-operative) Therapie von Erkrankungen des zentralen, peripheren und vegetativen Nervensystems."
    },
    {
      "code": "NUKL",
      "display": "Nuklearmedizin",
      "definition": "Das Fachgebiet der Nuklearmedizin beschäftigt sich mit der Anwendung radioaktiver Substanzen in Diagnostik und Therapie."
    },
    {
      "code": "GESU",
      "display": "Öffentliches Gesundheitswesen",
      "definition": "Das Fachgebiet des Öffentlichen Gesundheitswesens befasst sich mit der Aufrechterhaltung der Gesundheit der Bevölkerung sowie der Prophylaxe, Diagnose und Therapie von Erkrankungen."
    },
    {
      "code": "PALL",
      "display": "Palliativmedizin",
      "definition": "Das Fachgebiet der Palliativmedizin beschäftigt sich mit der Sicherstellung der bestmöglichen Lebensqualität von Patienten, die unter einer unheilbaren Krankheit im fortgeschrittenen Stadium leiden und nur noch eine begrenzte Lebenszeit haben."
    },
    {
      "code": "PATH",
      "display": "Pathologie",
      "definition": "Das Fachgebiet der Pathologie beschäftigt sich mit der Erforschung von abnormen und/oder krankhaften Vorgängen und Zuständen von Lebewesen sowie der diesen Zuständen zugrundeliegenden Ursachen. Das Konzept deckt auch die Histologie und die Zytologie ab. Die Histologie (Gewebelehre) befasst sich mit dem Aufbau von biologischen Geweben. Im diagnostischen Kontext bezeichnet sie die morphologische Untersuchung von Zellen und Geweben. Unter Zytologie versteht man im Allgemeinen die Lehre vom Aufbau der Zelle und ihren Funktionen, im medizinischen Umfeld wird mit diesem Begriff die Zytodiagnostik an einzelnen Zellen bezeichnet. Auch folgende diagnostische Disziplinen und Labore sind mit diesem Konzept abzubilden: Molekularpathologisches Labor, Immunhistologisches Labor, Pathologielabor, Histologie-Labor, Zytologie-Labor."
    },
    {
      "code": "NPAT",
      "display": "Neuropathologie",
      "definition": "Das Fachgebiet der Neuropathologie beschäftigt sich mit den Krankheitserscheinungen und/oder den Veränderungen des neuronalen Gewebes."
    },
    {
      "code": "PHAR",
      "display": "Pharmakologie",
      "definition": "Das Gebiet der Pharmakologie beschäftigt sich mit den Wechselwirkungen zwischen (Wirk-) Stoffen und Lebewesen"
    },
    {
      "code": "TOXI",
      "display": "Toxikologie",
      "definition": "Das Gebiet der Toxikologie umfasst die Lehre der Giftstoffe. Dies beinhaltet insbesondere auch die Diagnose und Therapie von Vergiftungen. Dabei ist die Toxikologie ein interdisziplinäres Fachgebiet, in dem neben Ärzten auch Chemiker und Biochemiker als Toxikologen arbeiten.Nutzungshinweis: Falls die forensische Toxikologie organisatorisch als Teil der Toxikologie (und nicht als Teil der Rechtsmedizin) geführt wird, deckt dieses Konzept auch die forensische Toxikologie ab."
    },
    {
      "code": "REHA",
      "display": "Physikalische und Rehabilitative Medizin",
      "definition": "Das Gebiet der Physikalischen und Rehabilitativen Medizin beschäftigt sich mit \"der sekundären Prävention, der interdisziplinären Diagnostik, Behandlung und Rehabilitation von körperlichen Beeinträchtigungen mittels konservativen, physikalischen, manuellen und naturheilkundlichen Verfahren\". (Facharzt Weiterbildungsordnung)"
    },
    {
      "code": "PSYC",
      "display": "Psychiatrie und Psychotherapie",
      "definition": "Das Fachgebiet der Psychiatrie beschäftigt sich mit Prävention, Diagnostik und Therapie psychischer Erkrankungen.Mit Psychotherapie bezeichnet man die Tätigkeit, welche zur Erkennung und Therapie von geistig-seelisch bedingten, dysfunktionalen Zuständen eines Patienten durchgeführt wird."
    },
    {
      "code": "FPSY",
      "display": "Forensische Psychiatrie",
      "definition": "Das Fachgebiet der Forensischen Psychiatrie stellt eine Spezialisierung innerhalb der Psychiatrie dar. Das Gebiet befasst sich mit der Begutachtung und der Therapie (ggfs. inkl. Unterbringung) von psychisch kranken Straftätern sowie mit Patienten, welche unter Drogeneinfluss ein strafrechtlich relevantes Delikt begingen."
    },
    {
      "code": "PSYM",
      "display": "Psychosomatische Medizin und Psychotherapie",
      "definition": "Das Fachgebiet der Psychosomatischen Medizin und Psychotherapie beschäftigt sich mit der Prävention, der Erkennung, der psychotherapeutischen Behandlung sowie der Rehabilitation von Erkrankungen, deren Ursachen psychosozialer und psychosomatischer Natur sind."
    },
    {
      "code": "RADI",
      "display": "Radiologie",
      "definition": "Das Fachgebiet der Radiologie umfasst alle Bereiche der Bildgebung zu diagnostischen und therapeutischen Zwecken."
    },
    {
      "code": "KRAD",
      "display": "Kinderradiologie",
      "definition": "Das Fachgebiet der Kinderradiologie stellt eine Spezialisierung der Radiologie dar. Das Gebiet beschäftigt mit der radiologischen Bildgebung beim Kind und beim Jugendlichen."
    },
    {
      "code": "NRAD",
      "display": "Neuroradiologie",
      "definition": "Das Fachgebiet der Neuroradiologie stellt eine Spezialisierung der Radiologie dar. Das Gebiet beschäftigt sich mit der Sichtbarmachung von neurologischen Strukturen durch bildgebende Verfahren."
    },
    {
      "code": "RECH",
      "display": "Rechtsmedizin",
      "definition": "Das Fachgebiet der Rechtsmedizin beschäftigt sich mit  juristischen Aspekten der Medizin, insbesondere mit der Anwendung medizinischer Kenntnisse zur Beurteilung und Klärung von Rechtsfragen sowie der Vermittlung rechtlicher und ethischer Kenntnisse an die Ärzteschaft.Nutzungshinweis: Falls die forensische Toxikologie organisatorisch als Teil der Rechtsmedizin (und nicht als Teil der Toxikologie) geführt wird, deckt dieses Konzept auch die forensische Toxikologie ab."
    },
    {
      "code": "SCHL",
      "display": "Schlafmedizin",
      "definition": "Das Fachgebiet der Schlafmedizin beschäftigt sich mit Diagnostik und Therapie von Schlafstörungen."
    },
    {
      "code": "SPOR",
      "display": "Sport- und Bewegungsmedizin",
      "definition": "Das Fachgebiet der Sportmedizin beschäftigt sich mit der Prävention, Diagnostik, Therapie und Rehabilitation mit sportlicher Betätigung assoziierten Erkrankungen."
    },
    {
      "code": "STRA",
      "display": "Strahlentherapie",
      "definition": "Das Fachgebiet der Strahlentherapie beschäftigt sich mit  der Anwendung von ionisierender Strahlung bei Menschen und Tieren, um Krankheiten zu heilen oder deren Fortschreiten zu verzögern."
    },
    {
      "code": "TRAN",
      "display": "Transfusionsmedizin",
      "definition": "Das Fachgebiet der Transfusionsmedizin beschäftigt sich mit allen Fragen zu Bluttransfusionen im weitesten Sinne. Insbesondere gehören dazu die Auswahl und medizinische Betreuung von Blutspendern sowie die Unterhaltung von Blutbanken und die damit verbundene Bereitstellung von Blutkonserven für die medizinischen Fachgebiete. Das Konzept umfasst auch die Transplantationsimmunologie."
    },
    {
      "code": "TROP",
      "display": "Tropen-/Reisemedizin",
      "definition": "Das Fachgebiet der Tropenmedizin beschäftigt sich mit der Epidemiologie, Prävention, Diagnostik und Therapie/Bekämpfung von Tropenerkrankungen.Das Fachgebiet der Reisemedizin beschäftigt sich mit allen Fragen, welche bei der Erforschung und Bekämpfung von Erkrankungen, die im Rahmen von Reisen entstehen können, auftreten. Insbesondere die Prävention vor diesen Erkrankungen gehört zu der Reisemedizin."
    },
    {
      "code": "UROL",
      "display": "Urologie",
      "definition": "Das Fachgebiet der Urologie beschäftigt sich mit der Prävention, Diagnose und Therapie von Erkrankungen der Niere, der ableitenden Harnwege und der männlichen Geschlechtsorgane."
    },
    {
      "code": "MZKH",
      "display": "Zahnmedizin",
      "definition": "Zahnmedizin ist die Kurzform für das Fachgebiet der Zahn-, Mund- und Kieferheilkunde. Das Fachgebiet beinhaltet die Prävention, Diagnostik und Therapie von Erkrankungen im Zahn-, Mund- und Kieferbereich."
    },
    {
      "code": "ORAL",
      "display": "Oralchirurgie",
      "definition": "Das Fachgebiet der Oralchirurgie stellt eine Spezialisierung innerhalb der Zahnmedizin dar. Das Gebiet beinhaltet die operative Versorgung sämtlicher Erkrankungen, Verletzungen oder Fehlstellungen im Bereich der Mundhöhle, des Zahnapparates, des Zahnhalteapparates und des Zahnfleischs."
    },
    {
      "code": "KIEF",
      "display": "Kieferorthopädie",
      "definition": "Das Fachgebiet der Kieferorthopädie stellt eine Spezialisierung innerhalb der Zahnmedizin dar. Das Gebiet beinhaltet die Prophylaxe, Diagnostik und Therapie von Fehlstellungen der Kiefer und der Zähne."
    },
    {
      "code": "PARO",
      "display": "Parodontologie",
      "definition": "Das Fachgebiet Parodontologie  stellt eine Weiterbildung innerhalb der Zahnmedizin im Kammergebiet Westfalen-Lippe dar. Das Fachgebiet beinhaltet die Prävention, die Diagnostik, die Therapie und Nachsorge von Erkrankungen parodontaler und periimplantärer Gewebe und Strukturen."
    }
  ],
  "count": 77,
  "meta": {
    "tag": [
      {
        "system": "https://mii-termserv.de/fhir/su-termserv/CodeSystem/mii-cs-suts-resource-tags-project",
        "code": "ihe",
        "display": "Integrating the Healthcare Enterprise"
      },
      {
        "system": "https://mii-termserv.de/fhir/su-termserv/CodeSystem/mii-cs-suts-resource-tags-dataset",
        "code": "ihe-d",
        "display": "Integrating the Healthcare Enterprise Germany"
      },
      {
        "system": "https://mii-termserv.de/fhir/su-termserv/CodeSystem/mii-cs-suts-resource-tags-license",
        "code": "https://mii-termserv.de/licenses#ihe",
        "display": "Integrating the Healthcare Enterprise (IHE) license"
      }
    ]
  },
  "extension": [
    {
      "url": "http://hl7.org/fhir/StructureDefinition/cqf-scope",
      "valueString": "@mii-termserv/de.ihe-d.terminology"
    }
  ],
  "text": {
    "status": "generated",
    "div": "<div xmlns=\"http://www.w3.org/1999/xhtml\"><h2>Aerztliche Fachrichtungen</h2><tt>http://ihe-d.de/CodeSystems/AerztlicheFachrichtungen</tt><div><p><b>SU-TermServ Metadata</b></p><table><tbody><tr><td><b>Project</b></td><td>Integrating the Healthcare Enterprise</td></tr><tr><td><b>Dataset</b></td><td>Integrating the Healthcare Enterprise Germany</td></tr><tr><td><b>License</b></td><td><a href=\"https://mii-termserv.de/licenses#ihe\">Integrating the Healthcare Enterprise (IHE) license</a></td></tr><tr><td><b>Package Scope</b></td><td><a href=\"https://gitlab.com/groups/mii-termserv/fhir-resources/-/packages/?ForderBy%3Dversion%26sort%3Ddesc%26search%5B%5D%3D@mii-termserv/de.ihe-d.terminology\"><code>@mii-termserv/de.ihe-d.terminology</code></a></td></tr></tbody></table></div></div>"
  }
}