{
  "resourceType": "ValueSet",
  "id": "de.basis-ValueSet-OPS-SNOMED-Source-Codes-1.5.1",
  "url": "http://fhir.de/ValueSet/ValueSet-OPS-SNOMED-Source-Codes",
  "version": "1.5.1",
  "name": "ValueSet_OPS_SNOMED_Source_Codes",
  "title": "ValueSet of OPS Source Codes for the OPS-SNOMED ConceptMap",
  "status": "active",
  "experimental": false,
  "date": "2023-11-30",
  "publisher": "HL7 Deutschland e.V. (Technisches Komitee FHIR)",
  "contact": [
    {
      "telecom": [
        {
          "system": "url",
          "value": "http://hl7.de/technische-komitees/fhir/"
        }
      ]
    }
  ],
  "description": "ValueSet containing all source concepts from the ConceptMap OPS-SNOMED Category Mapping",
  "compose": {
    "include": [
      {
        "system": "http://fhir.de/CodeSystem/bfarm/ops",
        "concept": [
          {
            "code": "1",
            "display": "Diagnostische Maßnahmen"
          },
          {
            "code": "3",
            "display": "Bildgebende Diagnostik"
          },
          {
            "code": "5",
            "display": "Operationen"
          },
          {
            "code": "6",
            "display": "Medikamente"
          },
          {
            "code": "8",
            "display": "Nichtoperative therapeutische Maßnahmen"
          },
          {
            "code": "9",
            "display": "Ergänzende Maßnahmen"
          }
        ]
      }
    ]
  },
  "extension": [
    {
      "url": "http://hl7.org/fhir/StructureDefinition/cqf-scope",
      "valueString": "@mii-termserv/de.hl7.basisprofile.terminology"
    }
  ],
  "meta": {
    "tag": [
      {
        "system": "https://mii-termserv.de/fhir/su-termserv/CodeSystem/mii-cs-suts-resource-tags-project",
        "code": "hl7-de",
        "display": "HL7 Deutschland"
      },
      {
        "system": "https://mii-termserv.de/fhir/su-termserv/CodeSystem/mii-cs-suts-resource-tags-dataset",
        "code": "hl7-de-basisprofile",
        "display": "HL7 Deutschland Basisprofile"
      },
      {
        "system": "https://mii-termserv.de/fhir/su-termserv/CodeSystem/mii-cs-suts-resource-tags-license",
        "code": "https://mii-termserv.de/licenses#hl7-de",
        "display": "HL7 Germany license"
      }
    ]
  },
  "text": {
    "status": "generated",
    "div": "<div xmlns=\"http://www.w3.org/1999/xhtml\"><h2>ValueSet of OPS Source Codes for the OPS-SNOMED ConceptMap</h2><tt>http://fhir.de/ValueSet/ValueSet-OPS-SNOMED-Source-Codes</tt><p>ValueSet containing all source concepts from the ConceptMap OPS-SNOMED Category Mapping</p><div><p><b>SU-TermServ Metadata</b></p><table><tbody><tr><td><b>Project</b></td><td>HL7 Deutschland</td></tr><tr><td><b>Dataset</b></td><td>HL7 Deutschland Basisprofile</td></tr><tr><td><b>License</b></td><td><a href=\"https://mii-termserv.de/licenses#hl7-de\">HL7 Germany license</a></td></tr><tr><td><b>Package Scope</b></td><td><a href=\"https://gitlab.com/groups/mii-termserv/fhir-resources/-/packages/?ForderBy%3Dversion%26sort%3Ddesc%26search%5B%5D%3D@mii-termserv/de.hl7.basisprofile.terminology\"><code>@mii-termserv/de.hl7.basisprofile.terminology</code></a></td></tr></tbody></table></div></div>"
  }
}