{
  "resourceType": "CodeSystem",
  "id": "de.basis-anlage-6-vorsatzworte-1.5.1",
  "meta": {
    "profile": [
      "http://hl7.org/fhir/StructureDefinition/shareablecodesystem"
    ],
    "tag": [
      {
        "system": "https://mii-termserv.de/fhir/su-termserv/CodeSystem/mii-cs-suts-resource-tags-project",
        "code": "hl7-de",
        "display": "HL7 Deutschland"
      },
      {
        "system": "https://mii-termserv.de/fhir/su-termserv/CodeSystem/mii-cs-suts-resource-tags-dataset",
        "code": "hl7-de-basisprofile",
        "display": "HL7 Deutschland Basisprofile"
      },
      {
        "system": "https://mii-termserv.de/fhir/su-termserv/CodeSystem/mii-cs-suts-resource-tags-license",
        "code": "https://mii-termserv.de/licenses#hl7-de",
        "display": "HL7 Germany license"
      }
    ]
  },
  "url": "http://fhir.de/CodeSystem/deuev/anlage-6-vorsatzworte",
  "version": "2.30",
  "name": "DeuevAnlage6Vorsatzworte",
  "title": "Tabelle der gültigen Vorsatzworte",
  "status": "active",
  "experimental": false,
  "date": "2023-11-30",
  "publisher": "HL7 Deutschland e.V. (Technisches Komitee FHIR)",
  "contact": [
    {
      "telecom": [
        {
          "system": "url",
          "value": "http://hl7.de/technische-komitees/fhir/"
        }
      ]
    }
  ],
  "description": "Vorsatzworte im Nachnamen nach DEÜV Anlage 6",
  "copyright": "GKV-Spitzenverband",
  "caseSensitive": true,
  "valueSet": "http://fhir.de/ValueSet/dkgev/anlage-6-vorsatzworte",
  "content": "complete",
  "count": 187,
  "concept": [
    {
      "code": "a",
      "display": "a"
    },
    {
      "code": "aan de",
      "display": "aan de"
    },
    {
      "code": "aan den",
      "display": "aan den"
    },
    {
      "code": "al",
      "display": "al"
    },
    {
      "code": "am",
      "display": "am"
    },
    {
      "code": "an",
      "display": "an"
    },
    {
      "code": "an der",
      "display": "an der"
    },
    {
      "code": "auf",
      "display": "auf"
    },
    {
      "code": "auf dem",
      "display": "auf dem"
    },
    {
      "code": "auf der",
      "display": "auf der"
    },
    {
      "code": "auf m",
      "display": "auf m"
    },
    {
      "code": "aufm",
      "display": "aufm"
    },
    {
      "code": "auff m",
      "display": "auff m"
    },
    {
      "code": "aus",
      "display": "aus"
    },
    {
      "code": "aus dem",
      "display": "aus dem"
    },
    {
      "code": "aus den",
      "display": "aus den"
    },
    {
      "code": "aus der",
      "display": "aus der"
    },
    {
      "code": "b",
      "display": "b"
    },
    {
      "code": "be",
      "display": "be"
    },
    {
      "code": "bei",
      "display": "bei"
    },
    {
      "code": "bei der",
      "display": "bei der"
    },
    {
      "code": "beim",
      "display": "beim"
    },
    {
      "code": "ben",
      "display": "ben"
    },
    {
      "code": "bey",
      "display": "bey"
    },
    {
      "code": "bey der",
      "display": "bey der"
    },
    {
      "code": "che",
      "display": "che"
    },
    {
      "code": "cid",
      "display": "cid"
    },
    {
      "code": "d",
      "display": "d"
    },
    {
      "code": "d.",
      "display": "d."
    },
    {
      "code": "d'",
      "display": "d'"
    },
    {
      "code": "da",
      "display": "da"
    },
    {
      "code": "da costa",
      "display": "da costa"
    },
    {
      "code": "da las",
      "display": "da las"
    },
    {
      "code": "da silva",
      "display": "da silva"
    },
    {
      "code": "dal",
      "display": "dal"
    },
    {
      "code": "dall",
      "display": "dall"
    },
    {
      "code": "dall'",
      "display": "dall'"
    },
    {
      "code": "dalla",
      "display": "dalla"
    },
    {
      "code": "dalle",
      "display": "dalle"
    },
    {
      "code": "dallo",
      "display": "dallo"
    },
    {
      "code": "das",
      "display": "das"
    },
    {
      "code": "de",
      "display": "de"
    },
    {
      "code": "degli",
      "display": "degli"
    },
    {
      "code": "dei",
      "display": "dei"
    },
    {
      "code": "den",
      "display": "den"
    },
    {
      "code": "de l '",
      "display": "de l '"
    },
    {
      "code": "de la",
      "display": "de la"
    },
    {
      "code": "de las",
      "display": "de las"
    },
    {
      "code": "de le",
      "display": "de le"
    },
    {
      "code": "de los",
      "display": "de los"
    },
    {
      "code": "del",
      "display": "del"
    },
    {
      "code": "del coz",
      "display": "del coz"
    },
    {
      "code": "deli",
      "display": "deli"
    },
    {
      "code": "dell",
      "display": "dell"
    },
    {
      "code": "dell'",
      "display": "dell'"
    },
    {
      "code": "della",
      "display": "della"
    },
    {
      "code": "delle",
      "display": "delle"
    },
    {
      "code": "delli",
      "display": "delli"
    },
    {
      "code": "dello",
      "display": "dello"
    },
    {
      "code": "der",
      "display": "der"
    },
    {
      "code": "des",
      "display": "des"
    },
    {
      "code": "di",
      "display": "di"
    },
    {
      "code": "dit",
      "display": "dit"
    },
    {
      "code": "do",
      "display": "do"
    },
    {
      "code": "do ceu",
      "display": "do ceu"
    },
    {
      "code": "don",
      "display": "don"
    },
    {
      "code": "don le",
      "display": "don le"
    },
    {
      "code": "dos",
      "display": "dos"
    },
    {
      "code": "dos santos",
      "display": "dos santos"
    },
    {
      "code": "du",
      "display": "du"
    },
    {
      "code": "dy",
      "display": "dy"
    },
    {
      "code": "m",
      "display": "m"
    },
    {
      "code": "mc",
      "display": "mc"
    },
    {
      "code": "mac",
      "display": "mac"
    },
    {
      "code": "n",
      "display": "n"
    },
    {
      "code": "o",
      "display": "o"
    },
    {
      "code": "o'",
      "display": "o'"
    },
    {
      "code": "op",
      "display": "op"
    },
    {
      "code": "op de",
      "display": "op de"
    },
    {
      "code": "op den",
      "display": "op den"
    },
    {
      "code": "op gen",
      "display": "op gen"
    },
    {
      "code": "op het",
      "display": "op het"
    },
    {
      "code": "op te",
      "display": "op te"
    },
    {
      "code": "op ten",
      "display": "op ten"
    },
    {
      "code": "oude",
      "display": "oude"
    },
    {
      "code": "pla",
      "display": "pla"
    },
    {
      "code": "pro",
      "display": "pro"
    },
    {
      "code": "s",
      "display": "s"
    },
    {
      "code": "st.",
      "display": "st."
    },
    {
      "code": "el",
      "display": "el"
    },
    {
      "code": "g",
      "display": "g"
    },
    {
      "code": "gen",
      "display": "gen"
    },
    {
      "code": "gil",
      "display": "gil"
    },
    {
      "code": "gli",
      "display": "gli"
    },
    {
      "code": "grosse",
      "display": "grosse"
    },
    {
      "code": "große",
      "display": "große"
    },
    {
      "code": "i",
      "display": "i"
    },
    {
      "code": "im",
      "display": "im"
    },
    {
      "code": "in",
      "display": "in"
    },
    {
      "code": "in de",
      "display": "in de"
    },
    {
      "code": "in den",
      "display": "in den"
    },
    {
      "code": "in der",
      "display": "in der"
    },
    {
      "code": "in het",
      "display": "in het"
    },
    {
      "code": "in't",
      "display": "in't"
    },
    {
      "code": "kl",
      "display": "kl"
    },
    {
      "code": "kleine",
      "display": "kleine"
    },
    {
      "code": "l",
      "display": "l"
    },
    {
      "code": "l.",
      "display": "l."
    },
    {
      "code": "l'",
      "display": "l'"
    },
    {
      "code": "la",
      "display": "la"
    },
    {
      "code": "le",
      "display": "le"
    },
    {
      "code": "lee",
      "display": "lee"
    },
    {
      "code": "li",
      "display": "li"
    },
    {
      "code": "lo",
      "display": "lo"
    },
    {
      "code": "t",
      "display": "t"
    },
    {
      "code": "te",
      "display": "te"
    },
    {
      "code": "ten",
      "display": "ten"
    },
    {
      "code": "ter",
      "display": "ter"
    },
    {
      "code": "thi",
      "display": "thi"
    },
    {
      "code": "tho",
      "display": "tho"
    },
    {
      "code": "thom",
      "display": "thom"
    },
    {
      "code": "thor",
      "display": "thor"
    },
    {
      "code": "thum",
      "display": "thum"
    },
    {
      "code": "to",
      "display": "to"
    },
    {
      "code": "tom",
      "display": "tom"
    },
    {
      "code": "tor",
      "display": "tor"
    },
    {
      "code": "tu",
      "display": "tu"
    },
    {
      "code": "tum",
      "display": "tum"
    },
    {
      "code": "unten",
      "display": "unten"
    },
    {
      "code": "unter",
      "display": "unter"
    },
    {
      "code": "unterm",
      "display": "unterm"
    },
    {
      "code": "v.",
      "display": "v."
    },
    {
      "code": "v. d.",
      "display": "v. d."
    },
    {
      "code": "v. dem",
      "display": "v. dem"
    },
    {
      "code": "v. den",
      "display": "v. den"
    },
    {
      "code": "v. der",
      "display": "v. der"
    },
    {
      "code": "v.d.",
      "display": "v.d."
    },
    {
      "code": "v.dem",
      "display": "v.dem"
    },
    {
      "code": "v.den",
      "display": "v.den"
    },
    {
      "code": "v.der",
      "display": "v.der"
    },
    {
      "code": "van",
      "display": "van"
    },
    {
      "code": "van de",
      "display": "van de"
    },
    {
      "code": "van dem",
      "display": "van dem"
    },
    {
      "code": "van den",
      "display": "van den"
    },
    {
      "code": "van der",
      "display": "van der"
    },
    {
      "code": "vande",
      "display": "vande"
    },
    {
      "code": "vandem",
      "display": "vandem"
    },
    {
      "code": "vanden",
      "display": "vanden"
    },
    {
      "code": "vander",
      "display": "vander"
    },
    {
      "code": "van gen",
      "display": "van gen"
    },
    {
      "code": "van het",
      "display": "van het"
    },
    {
      "code": "van t",
      "display": "van t"
    },
    {
      "code": "ven",
      "display": "ven"
    },
    {
      "code": "ven der",
      "display": "ven der"
    },
    {
      "code": "ver",
      "display": "ver"
    },
    {
      "code": "vo",
      "display": "vo"
    },
    {
      "code": "vom",
      "display": "vom"
    },
    {
      "code": "vom und zu",
      "display": "vom und zu"
    },
    {
      "code": "von",
      "display": "von"
    },
    {
      "code": "von und zu",
      "display": "von und zu"
    },
    {
      "code": "von und zu der",
      "display": "von und zu der"
    },
    {
      "code": "von und zur",
      "display": "von und zur"
    },
    {
      "code": "von de",
      "display": "von de"
    },
    {
      "code": "von dem",
      "display": "von dem"
    },
    {
      "code": "von den",
      "display": "von den"
    },
    {
      "code": "von der",
      "display": "von der"
    },
    {
      "code": "von la",
      "display": "von la"
    },
    {
      "code": "von zu",
      "display": "von zu"
    },
    {
      "code": "von zum",
      "display": "von zum"
    },
    {
      "code": "von zur",
      "display": "von zur"
    },
    {
      "code": "vonde",
      "display": "vonde"
    },
    {
      "code": "vonden",
      "display": "vonden"
    },
    {
      "code": "vondem",
      "display": "vondem"
    },
    {
      "code": "vonder",
      "display": "vonder"
    },
    {
      "code": "von einem",
      "display": "von einem"
    },
    {
      "code": "von mast",
      "display": "von mast"
    },
    {
      "code": "vor",
      "display": "vor"
    },
    {
      "code": "vor dem",
      "display": "vor dem"
    },
    {
      "code": "vor den",
      "display": "vor den"
    },
    {
      "code": "vor der",
      "display": "vor der"
    },
    {
      "code": "vorm",
      "display": "vorm"
    },
    {
      "code": "vorn",
      "display": "vorn"
    },
    {
      "code": "y",
      "display": "y"
    },
    {
      "code": "y del",
      "display": "y del"
    },
    {
      "code": "zu",
      "display": "zu"
    },
    {
      "code": "zum",
      "display": "zum"
    },
    {
      "code": "zur",
      "display": "zur"
    }
  ],
  "extension": [
    {
      "url": "http://hl7.org/fhir/StructureDefinition/cqf-scope",
      "valueString": "@mii-termserv/de.hl7.basisprofile.terminology"
    }
  ],
  "text": {
    "status": "generated",
    "div": "<div xmlns=\"http://www.w3.org/1999/xhtml\"><h2>Tabelle der gültigen Vorsatzworte</h2><tt>http://fhir.de/CodeSystem/deuev/anlage-6-vorsatzworte</tt><p>Vorsatzworte im Nachnamen nach DEÜV Anlage 6</p><div><p><b>SU-TermServ Metadata</b></p><table><tbody><tr><td><b>Project</b></td><td>HL7 Deutschland</td></tr><tr><td><b>Dataset</b></td><td>HL7 Deutschland Basisprofile</td></tr><tr><td><b>License</b></td><td><a href=\"https://mii-termserv.de/licenses#hl7-de\">HL7 Germany license</a></td></tr><tr><td><b>Package Scope</b></td><td><a href=\"https://gitlab.com/groups/mii-termserv/fhir-resources/-/packages/?ForderBy%3Dversion%26sort%3Ddesc%26search%5B%5D%3D@mii-termserv/de.hl7.basisprofile.terminology\"><code>@mii-termserv/de.hl7.basisprofile.terminology</code></a></td></tr></tbody></table></div></div>"
  }
}