{
  "resourceType": "CodeSystem",
  "id": "de.basis-Aufnahmeanlass-1.5.1",
  "meta": {
    "profile": [
      "http://hl7.org/fhir/StructureDefinition/shareablecodesystem"
    ],
    "tag": [
      {
        "system": "https://mii-termserv.de/fhir/su-termserv/CodeSystem/mii-cs-suts-resource-tags-project",
        "code": "hl7-de",
        "display": "HL7 Deutschland"
      },
      {
        "system": "https://mii-termserv.de/fhir/su-termserv/CodeSystem/mii-cs-suts-resource-tags-dataset",
        "code": "hl7-de-basisprofile",
        "display": "HL7 Deutschland Basisprofile"
      },
      {
        "system": "https://mii-termserv.de/fhir/su-termserv/CodeSystem/mii-cs-suts-resource-tags-license",
        "code": "https://mii-termserv.de/licenses#hl7-de",
        "display": "HL7 Germany license"
      }
    ]
  },
  "url": "http://fhir.de/CodeSystem/dgkev/Aufnahmeanlass",
  "version": "1.5.1",
  "name": "CodeSystemAufnahmeanlass",
  "title": "CodeSystemAufnahmeanlass",
  "status": "active",
  "experimental": false,
  "date": "2023-11-30",
  "publisher": "HL7 Deutschland e.V. (Technisches Komitee FHIR)",
  "contact": [
    {
      "telecom": [
        {
          "system": "url",
          "value": "http://hl7.de/technische-komitees/fhir/"
        }
      ]
    }
  ],
  "description": "Aufnahmeanlass, Datenübermittlung nach § 301 Abs. 3 SGB V",
  "copyright": "HL7 Deutschland e.V.",
  "caseSensitive": true,
  "valueSet": "http://fhir.de/ValueSet/dgkev/Aufnahmeanlass",
  "compositional": false,
  "content": "complete",
  "count": 8,
  "concept": [
    {
      "code": "E",
      "display": "Einweisung durch einen Arzt"
    },
    {
      "code": "Z",
      "display": "Einweisung durch einen Zahnarzt"
    },
    {
      "code": "N",
      "display": "Notfall"
    },
    {
      "code": "R",
      "display": "Aufnahme nach vorausgehender Behandlung in einer Rehabilitationseinrichtung"
    },
    {
      "code": "V",
      "display": "Verlegung mit Behandlungsdauer im verlegenden Krankenhaus länger als 24 Stunden"
    },
    {
      "code": "A",
      "display": "Verlegung mit Behandlungsdauer im verlegenden Krankenhaus bis zu 24 Stunden"
    },
    {
      "code": "G",
      "display": "Geburt"
    },
    {
      "code": "B",
      "display": "Begleitperson oder mitaufgenommene Pflegekraft"
    }
  ],
  "extension": [
    {
      "url": "http://hl7.org/fhir/StructureDefinition/cqf-scope",
      "valueString": "@mii-termserv/de.hl7.basisprofile.terminology"
    }
  ],
  "text": {
    "status": "generated",
    "div": "<div xmlns=\"http://www.w3.org/1999/xhtml\"><h2>CodeSystemAufnahmeanlass</h2><tt>http://fhir.de/CodeSystem/dgkev/Aufnahmeanlass</tt><p>Aufnahmeanlass, Datenübermittlung nach § 301 Abs. 3 SGB V</p><div><p><b>SU-TermServ Metadata</b></p><table><tbody><tr><td><b>Project</b></td><td>HL7 Deutschland</td></tr><tr><td><b>Dataset</b></td><td>HL7 Deutschland Basisprofile</td></tr><tr><td><b>License</b></td><td><a href=\"https://mii-termserv.de/licenses#hl7-de\">HL7 Germany license</a></td></tr><tr><td><b>Package Scope</b></td><td><a href=\"https://gitlab.com/groups/mii-termserv/fhir-resources/-/packages/?ForderBy%3Dversion%26sort%3Ddesc%26search%5B%5D%3D@mii-termserv/de.hl7.basisprofile.terminology\"><code>@mii-termserv/de.hl7.basisprofile.terminology</code></a></td></tr></tbody></table></div></div>"
  }
}