{
  "resourceType": "ValueSet",
  "id": "de.basis-VitalSignDE-Koerpergroesse-SNOMED-CT-1.5.1",
  "meta": {
    "profile": [
      "http://hl7.org/fhir/StructureDefinition/shareablevalueset"
    ],
    "tag": [
      {
        "system": "https://mii-termserv.de/fhir/su-termserv/CodeSystem/mii-cs-suts-resource-tags-project",
        "code": "hl7-de",
        "display": "HL7 Deutschland"
      },
      {
        "system": "https://mii-termserv.de/fhir/su-termserv/CodeSystem/mii-cs-suts-resource-tags-dataset",
        "code": "hl7-de-basisprofile",
        "display": "HL7 Deutschland Basisprofile"
      },
      {
        "system": "https://mii-termserv.de/fhir/su-termserv/CodeSystem/mii-cs-suts-resource-tags-license",
        "code": "https://mii-termserv.de/licenses#hl7-de",
        "display": "HL7 Germany license"
      }
    ]
  },
  "url": "http://fhir.de/ValueSet/VitalSignDE-Koerpergroesse-SNOMED-CT",
  "version": "1.5.1",
  "name": "VitalSignDE_Koerpergroesse_SNOMED_CT",
  "title": "VitalSignDE_Koerpergroesse_SNOMED_CT",
  "status": "active",
  "experimental": false,
  "date": "2023-11-30",
  "publisher": "HL7 Deutschland e.V. (Technisches Komitee FHIR)",
  "contact": [
    {
      "telecom": [
        {
          "system": "url",
          "value": "http://hl7.de/technische-komitees/fhir/"
        }
      ]
    }
  ],
  "description": "VitalSignDE_Koerpergroesse_SNOMED_CT enthält die erwarteten $sct Codes für Koerpergroesse",
  "copyright": "This value set includes content from SNOMED CT, which is copyright © 2002 International Health Terminology Standards Development Organisation (IHTSDO), and distributed by agreement between IHTSDO and HL7. Implementer use of SNOMED CT is not covered by this agreement.",
  "compose": {
    "include": [
      {
        "system": "http://snomed.info/sct",
        "concept": [
          {
            "code": "248333004",
            "display": "Standing height (observable entity)"
          },
          {
            "code": "1149101003",
            "display": "Recumbent body height (observable entity)"
          },
          {
            "code": "1153637007",
            "display": "Body height (observable entity)"
          },
          {
            "code": "169886007",
            "display": "Birth length (observable entity)"
          }
        ]
      }
    ]
  },
  "extension": [
    {
      "url": "http://hl7.org/fhir/StructureDefinition/cqf-scope",
      "valueString": "@mii-termserv/de.hl7.basisprofile.terminology"
    }
  ],
  "text": {
    "status": "generated",
    "div": "<div xmlns=\"http://www.w3.org/1999/xhtml\"><h2>VitalSignDE_Koerpergroesse_SNOMED_CT</h2><tt>http://fhir.de/ValueSet/VitalSignDE-Koerpergroesse-SNOMED-CT</tt><p>VitalSignDE_Koerpergroesse_SNOMED_CT enthält die erwarteten $sct Codes für Koerpergroesse</p><div><p><b>SU-TermServ Metadata</b></p><table><tbody><tr><td><b>Project</b></td><td>HL7 Deutschland</td></tr><tr><td><b>Dataset</b></td><td>HL7 Deutschland Basisprofile</td></tr><tr><td><b>License</b></td><td><a href=\"https://mii-termserv.de/licenses#hl7-de\">HL7 Germany license</a></td></tr><tr><td><b>Package Scope</b></td><td><a href=\"https://gitlab.com/groups/mii-termserv/fhir-resources/-/packages/?ForderBy%3Dversion%26sort%3Ddesc%26search%5B%5D%3D@mii-termserv/de.hl7.basisprofile.terminology\"><code>@mii-termserv/de.hl7.basisprofile.terminology</code></a></td></tr></tbody></table></div></div>"
  }
}