{
  "resourceType": "CodeSystem",
  "id": "de.basis-identifier-type-de-basis-1.5.1",
  "meta": {
    "profile": [
      "http://hl7.org/fhir/StructureDefinition/shareablecodesystem"
    ],
    "tag": [
      {
        "system": "https://mii-termserv.de/fhir/su-termserv/CodeSystem/mii-cs-suts-resource-tags-project",
        "code": "hl7-de",
        "display": "HL7 Deutschland"
      },
      {
        "system": "https://mii-termserv.de/fhir/su-termserv/CodeSystem/mii-cs-suts-resource-tags-dataset",
        "code": "hl7-de-basisprofile",
        "display": "HL7 Deutschland Basisprofile"
      },
      {
        "system": "https://mii-termserv.de/fhir/su-termserv/CodeSystem/mii-cs-suts-resource-tags-license",
        "code": "https://mii-termserv.de/licenses#hl7-de",
        "display": "HL7 Germany license"
      }
    ]
  },
  "url": "http://fhir.de/CodeSystem/identifier-type-de-basis",
  "version": "1.5.1",
  "name": "IdentifierTypeDeBasis",
  "title": "Identifier Type De Basis",
  "status": "active",
  "experimental": false,
  "date": "2023-11-30",
  "publisher": "HL7 Deutschland e.V. (Technisches Komitee FHIR)",
  "contact": [
    {
      "telecom": [
        {
          "system": "url",
          "value": "http://hl7.de/technische-komitees/fhir/"
        }
      ]
    }
  ],
  "description": "Liste der Identfikatorentypen des deutschen Basisprofils welche die Standardtypen ergänzen.",
  "copyright": "HL7 Deutschland e.V.",
  "caseSensitive": true,
  "valueSet": "http://fhir.de/ValueSet/identifier-type-de-basis-de",
  "content": "complete",
  "count": 5,
  "property": [
    {
      "code": "status",
      "uri": "http://hl7.org/fhir/concept-properties#status",
      "description": "A property that indicates the status of the concept. One of active, experimental, deprecated, or retired.",
      "type": "code"
    }
  ],
  "concept": [
    {
      "code": "GKV",
      "display": "Gesetzliche Krankenversicherung",
      "property": [
        {
          "code": "status",
          "valueCode": "retired"
        }
      ]
    },
    {
      "code": "PKV",
      "display": "Private Krankenversicherung",
      "property": [
        {
          "code": "status",
          "valueCode": "retired"
        }
      ]
    },
    {
      "code": "ZANR",
      "display": "Zahnarztnummer",
      "property": [
        {
          "code": "status",
          "valueCode": "active"
        }
      ]
    },
    {
      "code": "KZVA",
      "display": "KZVAbrechnungsnummer",
      "property": [
        {
          "code": "status",
          "valueCode": "active"
        }
      ]
    },
    {
      "code": "KVZ10",
      "display": "Krankenversichertennummer",
      "property": [
        {
          "code": "status",
          "valueCode": "active"
        }
      ]
    }
  ],
  "extension": [
    {
      "url": "http://hl7.org/fhir/StructureDefinition/cqf-scope",
      "valueString": "@mii-termserv/de.hl7.basisprofile.terminology"
    }
  ],
  "text": {
    "status": "generated",
    "div": "<div xmlns=\"http://www.w3.org/1999/xhtml\"><h2>Identifier Type De Basis</h2><tt>http://fhir.de/CodeSystem/identifier-type-de-basis</tt><p>Liste der Identfikatorentypen des deutschen Basisprofils welche die Standardtypen ergänzen.</p><div><p><b>SU-TermServ Metadata</b></p><table><tbody><tr><td><b>Project</b></td><td>HL7 Deutschland</td></tr><tr><td><b>Dataset</b></td><td>HL7 Deutschland Basisprofile</td></tr><tr><td><b>License</b></td><td><a href=\"https://mii-termserv.de/licenses#hl7-de\">HL7 Germany license</a></td></tr><tr><td><b>Package Scope</b></td><td><a href=\"https://gitlab.com/groups/mii-termserv/fhir-resources/-/packages/?ForderBy%3Dversion%26sort%3Ddesc%26search%5B%5D%3D@mii-termserv/de.hl7.basisprofile.terminology\"><code>@mii-termserv/de.hl7.basisprofile.terminology</code></a></td></tr></tbody></table></div></div>"
  }
}