{
  "resourceType": "CodeSystem",
  "id": "highmed-uconco-Strahlenart-2.0.0",
  "meta": {
    "versionId": "1",
    "lastUpdated": "2022-02-16T13:34:27.104+00:00",
    "tag": [
      {
        "system": "https://mii-termserv.de/fhir/su-termserv/CodeSystem/mii-cs-suts-resource-tags-project",
        "code": "highmed",
        "display": "HiGHmed"
      },
      {
        "system": "https://mii-termserv.de/fhir/su-termserv/CodeSystem/mii-cs-suts-resource-tags-dataset",
        "code": "highmed-onco",
        "display": "HiGHmed Use Case Oncology"
      },
      {
        "system": "https://mii-termserv.de/fhir/su-termserv/CodeSystem/mii-cs-suts-resource-tags-license",
        "code": "https://mii-termserv.de/licenses#unclear-open",
        "display": "Open unclear license"
      }
    ]
  },
  "text": {
    "status": "generated",
    "div": "<div xmlns=\"http://www.w3.org/1999/xhtml\"><h2>HiGHmed Strahlenart</h2><tt>http://highmed.org/fhir/CodeSystem/onko/strahlenart</tt><p>Codesystem für die Strahlenart der Templates Nuklearmedizinische Therapie und Strahlentherapie.</p><div><p><b>SU-TermServ Metadata</b></p><table><tbody><tr><td><b>Project</b></td><td>HiGHmed</td></tr><tr><td><b>Dataset</b></td><td>HiGHmed Use Case Oncology</td></tr><tr><td><b>License</b></td><td><a href=\"https://mii-termserv.de/licenses#unclear-open\">Open unclear license</a></td></tr><tr><td><b>Package Scope</b></td><td><a href=\"https://gitlab.com/groups/mii-termserv/fhir-resources/-/packages/?ForderBy%3Dversion%26sort%3Ddesc%26search%5B%5D%3D@mii-termserv/de.highmed.usecases.oncology.terminology\"><code>@mii-termserv/de.highmed.usecases.oncology.terminology</code></a></td></tr></tbody></table></div></div>"
  },
  "url": "http://highmed.org/fhir/CodeSystem/onko/strahlenart",
  "version": "1.0",
  "name": "HighmedStrahlenart",
  "title": "HiGHmed Strahlenart",
  "status": "active",
  "date": "2022-01-14T00:00:00.000Z",
  "publisher": "http://highmed.org",
  "description": "Codesystem für die Strahlenart der Templates Nuklearmedizinische Therapie und Strahlentherapie.",
  "valueSet": "http://highmed.org/fhir/ValueSet/onko/strahlenart",
  "compositional": false,
  "content": "complete",
  "count": 9,
  "concept": [
    {
      "code": "01",
      "display": "Photonen (γ)"
    },
    {
      "code": "02",
      "display": "Elektronen (e-)"
    },
    {
      "code": "03",
      "display": "Neutronen (n)"
    },
    {
      "code": "04",
      "display": "Protonen (p+)"
    },
    {
      "code": "05",
      "display": "Heliumionen"
    },
    {
      "code": "06",
      "display": "Kohlenstoffionen"
    },
    {
      "code": "07",
      "display": "Alpha-Strahlen (α)"
    },
    {
      "code": "08",
      "display": "Beta-Strahlen (ß)"
    },
    {
      "code": "09",
      "display": "Gamma-Strahlen (γ)"
    }
  ],
  "extension": [
    {
      "url": "http://hl7.org/fhir/StructureDefinition/cqf-scope",
      "valueString": "@mii-termserv/de.highmed.usecases.oncology.terminology"
    }
  ]
}