{
  "resourceType": "CodeSystem",
  "id": "highmed-uconco-IntentionderTherapie-2.0.0",
  "meta": {
    "versionId": "2",
    "lastUpdated": "2022-02-16T13:24:13.724+00:00",
    "tag": [
      {
        "system": "https://mii-termserv.de/fhir/su-termserv/CodeSystem/mii-cs-suts-resource-tags-project",
        "code": "highmed",
        "display": "HiGHmed"
      },
      {
        "system": "https://mii-termserv.de/fhir/su-termserv/CodeSystem/mii-cs-suts-resource-tags-dataset",
        "code": "highmed-onco",
        "display": "HiGHmed Use Case Oncology"
      },
      {
        "system": "https://mii-termserv.de/fhir/su-termserv/CodeSystem/mii-cs-suts-resource-tags-license",
        "code": "https://mii-termserv.de/licenses#unclear-open",
        "display": "Open unclear license"
      }
    ]
  },
  "text": {
    "status": "generated",
    "div": "<div xmlns=\"http://www.w3.org/1999/xhtml\"><h2>HiGH Intention der Therapie [lokal]</h2><tt>http://highmed.org/fhir/CodeSystem/onko/intention-der-therapie</tt><p>CodeSystem für die Intention der Therapie bei sonstigen onkologischen Therapie (Nukelarmedizinische Therapie, Strahlentherapie etc.)</p><div><p><b>SU-TermServ Metadata</b></p><table><tbody><tr><td><b>Project</b></td><td>HiGHmed</td></tr><tr><td><b>Dataset</b></td><td>HiGHmed Use Case Oncology</td></tr><tr><td><b>License</b></td><td><a href=\"https://mii-termserv.de/licenses#unclear-open\">Open unclear license</a></td></tr><tr><td><b>Package Scope</b></td><td><a href=\"https://gitlab.com/groups/mii-termserv/fhir-resources/-/packages/?ForderBy%3Dversion%26sort%3Ddesc%26search%5B%5D%3D@mii-termserv/de.highmed.usecases.oncology.terminology\"><code>@mii-termserv/de.highmed.usecases.oncology.terminology</code></a></td></tr></tbody></table></div></div>"
  },
  "url": "http://highmed.org/fhir/CodeSystem/onko/intention-der-therapie",
  "version": "1.0",
  "name": "HighmedIntentionDerTherapie",
  "title": "HiGH Intention der Therapie [lokal]",
  "status": "active",
  "date": "2022-01-11T23:00:00.000Z",
  "publisher": "http://highmed.org",
  "contact": [
    {
      "telecom": [
        {
          "system": "email"
        }
      ]
    }
  ],
  "description": "CodeSystem für die Intention der Therapie bei sonstigen onkologischen Therapie (Nukelarmedizinische Therapie, Strahlentherapie etc.)",
  "valueSet": "http://highmed.org/fhir/ValueSet/onko/intention-der-therapie",
  "compositional": false,
  "content": "complete",
  "count": 3,
  "concept": [
    {
      "code": "K",
      "display": "Kurativ"
    },
    {
      "code": "P",
      "display": "Palliativ"
    },
    {
      "code": "S",
      "display": "Sonstiges"
    }
  ],
  "extension": [
    {
      "url": "http://hl7.org/fhir/StructureDefinition/cqf-scope",
      "valueString": "@mii-termserv/de.highmed.usecases.oncology.terminology"
    }
  ]
}