{
  "resourceType": "CodeSystem",
  "id": "highmed-uconco-FamiliaereLinie-2.0.0",
  "meta": {
    "versionId": "1",
    "lastUpdated": "2021-08-17T08:57:14.767+00:00",
    "tag": [
      {
        "system": "https://mii-termserv.de/fhir/su-termserv/CodeSystem/mii-cs-suts-resource-tags-project",
        "code": "highmed",
        "display": "HiGHmed"
      },
      {
        "system": "https://mii-termserv.de/fhir/su-termserv/CodeSystem/mii-cs-suts-resource-tags-dataset",
        "code": "highmed-onco",
        "display": "HiGHmed Use Case Oncology"
      },
      {
        "system": "https://mii-termserv.de/fhir/su-termserv/CodeSystem/mii-cs-suts-resource-tags-license",
        "code": "https://mii-termserv.de/licenses#unclear-open",
        "display": "Open unclear license"
      }
    ]
  },
  "text": {
    "status": "generated",
    "div": "<div xmlns=\"http://www.w3.org/1999/xhtml\"><h2>HIGHmed Familiaere Linie</h2><tt>http://highmed.org/fhir/Codesystem/onko/Familiaere-Linie</tt><p>Codesystem für die Familiaere Linie</p><div><p><b>SU-TermServ Metadata</b></p><table><tbody><tr><td><b>Project</b></td><td>HiGHmed</td></tr><tr><td><b>Dataset</b></td><td>HiGHmed Use Case Oncology</td></tr><tr><td><b>License</b></td><td><a href=\"https://mii-termserv.de/licenses#unclear-open\">Open unclear license</a></td></tr><tr><td><b>Package Scope</b></td><td><a href=\"https://gitlab.com/groups/mii-termserv/fhir-resources/-/packages/?ForderBy%3Dversion%26sort%3Ddesc%26search%5B%5D%3D@mii-termserv/de.highmed.usecases.oncology.terminology\"><code>@mii-termserv/de.highmed.usecases.oncology.terminology</code></a></td></tr></tbody></table></div></div>"
  },
  "url": "http://highmed.org/fhir/Codesystem/onko/Familiaere-Linie",
  "version": "1.0",
  "name": "HighmedFamiliaereLinie",
  "title": "HIGHmed Familiaere Linie",
  "status": "active",
  "date": "2021-06-21T00:00:00.000Z",
  "publisher": "http://highmed.org",
  "description": "Codesystem für die Familiaere Linie",
  "valueSet": "http://highmed.org/fhir/ValueSet/onko/Familiaere-Linie",
  "compositional": false,
  "content": "complete",
  "count": 2,
  "concept": [
    {
      "code": "01",
      "display": "Mutterlinie",
      "definition": "Verwandschaft über die Mutter"
    },
    {
      "code": "02",
      "display": "Vaterlinie",
      "definition": "Verwandschaft über den Vater"
    }
  ],
  "extension": [
    {
      "url": "http://hl7.org/fhir/StructureDefinition/cqf-scope",
      "valueString": "@mii-termserv/de.highmed.usecases.oncology.terminology"
    }
  ]
}