{
  "resourceType": "ValueSet",
  "id": "highmed-ucic-probenart-virologischer-befund-snomedct-1.1.0",
  "meta": {
    "versionId": "2",
    "lastUpdated": "2021-09-24T12:15:03.919+00:00",
    "tag": [
      {
        "system": "https://mii-termserv.de/fhir/su-termserv/CodeSystem/mii-cs-suts-resource-tags-project",
        "code": "highmed",
        "display": "HiGHmed"
      },
      {
        "system": "https://mii-termserv.de/fhir/su-termserv/CodeSystem/mii-cs-suts-resource-tags-dataset",
        "code": "highmed-ic",
        "display": "HiGHmed Use Case Infection Control"
      },
      {
        "system": "https://mii-termserv.de/fhir/su-termserv/CodeSystem/mii-cs-suts-resource-tags-license",
        "code": "https://mii-termserv.de/licenses#unclear-open",
        "display": "Open unclear license"
      }
    ]
  },
  "text": {
    "status": "generated",
    "div": "<div xmlns=\"http://www.w3.org/1999/xhtml\"><h2>HiGHmed Probenart im Virologischen Befund [SNOMED CT]</h2><tt>http://highmed.org/fhir/ValueSet/ic/probenart-virologischer-befund-snomedct</tt><div><p><b>SU-TermServ Metadata</b></p><table><tbody><tr><td><b>Project</b></td><td>HiGHmed</td></tr><tr><td><b>Dataset</b></td><td>HiGHmed Use Case Infection Control</td></tr><tr><td><b>License</b></td><td><a href=\"https://mii-termserv.de/licenses#unclear-open\">Open unclear license</a></td></tr><tr><td><b>Package Scope</b></td><td><a href=\"https://gitlab.com/groups/mii-termserv/fhir-resources/-/packages/?ForderBy%3Dversion%26sort%3Ddesc%26search%5B%5D%3D@mii-termserv/de.highmed.usecases.infectioncontrol.terminology\"><code>@mii-termserv/de.highmed.usecases.infectioncontrol.terminology</code></a></td></tr></tbody></table></div></div>"
  },
  "url": "http://highmed.org/fhir/ValueSet/ic/probenart-virologischer-befund-snomedct",
  "version": "1.0",
  "name": "HighmedProbenartVirologischerBefundSnomedct",
  "title": "HiGHmed Probenart im Virologischen Befund [SNOMED CT]",
  "status": "active",
  "date": "2021-09-23T00:00:00+00:00",
  "compose": {
    "include": [
      {
        "system": "http://snomed.info/sct",
        "version": "http://snomed.info/sct/900000000000207008/version/20210731",
        "concept": [
          {
            "code": "257261003",
            "display": "Swab"
          },
          {
            "code": "119334006",
            "display": "Sputum specimen"
          },
          {
            "code": "119342007",
            "display": "Saliva specimen"
          },
          {
            "code": "410580001",
            "display": "Respiratory fluid specimen"
          },
          {
            "code": "258607008",
            "display": "Bronchoalveolar lavage fluid sample"
          }
        ]
      }
    ]
  },
  "extension": [
    {
      "url": "http://hl7.org/fhir/StructureDefinition/cqf-scope",
      "valueString": "@mii-termserv/de.highmed.usecases.infectioncontrol.terminology"
    }
  ]
}