{
  "resourceType": "CodeSystem",
  "id": "highmed-ucc-arzneimittel-standarddatensatz-1.0.0",
  "meta": {
    "versionId": "1",
    "lastUpdated": "2022-07-26T12:33:59.466+00:00",
    "tag": [
      {
        "system": "https://mii-termserv.de/fhir/su-termserv/CodeSystem/mii-cs-suts-resource-tags-project",
        "code": "highmed",
        "display": "HiGHmed"
      },
      {
        "system": "https://mii-termserv.de/fhir/su-termserv/CodeSystem/mii-cs-suts-resource-tags-dataset",
        "code": "highmed-cardio",
        "display": "HiGHmed Use Case Cardiology"
      },
      {
        "system": "https://mii-termserv.de/fhir/su-termserv/CodeSystem/mii-cs-suts-resource-tags-license",
        "code": "https://mii-termserv.de/licenses#unclear-open",
        "display": "Open unclear license"
      }
    ]
  },
  "text": {
    "status": "generated",
    "div": "<div xmlns=\"http://www.w3.org/1999/xhtml\"><h2>HiGHmed Kardio Arzneimittel Standarddatensatz</h2><tt>http://highmed.org/fhir/CodeSystem/kardio/arzneimittel-standarddatensatz</tt><p>Custom codes of the HiGHmed Use Case Cardio Medications based on the DZHK Data Catalogue.\nSource: \nhttps://sharepoint.uni-goettingen.de/medizin/UKEI/HGOEHD/_layouts/15/WopiFrame2.aspx?sourcedoc=%7B05E88C36-5AAD-44A7-8B92-07392C900633%7D&amp;file=MappingArzneimittelKardioATC.xlsx&amp;action=default&amp;DefaultItemOpen=1</p><div><p><b>SU-TermServ Metadata</b></p><table><tbody><tr><td><b>Project</b></td><td>HiGHmed</td></tr><tr><td><b>Dataset</b></td><td>HiGHmed Use Case Cardiology</td></tr><tr><td><b>License</b></td><td><a href=\"https://mii-termserv.de/licenses#unclear-open\">Open unclear license</a></td></tr><tr><td><b>Package Scope</b></td><td><a href=\"https://gitlab.com/groups/mii-termserv/fhir-resources/-/packages/?ForderBy%3Dversion%26sort%3Ddesc%26search%5B%5D%3D@mii-termserv/de.highmed.usecases.cardiology.terminology\"><code>@mii-termserv/de.highmed.usecases.cardiology.terminology</code></a></td></tr></tbody></table></div></div>"
  },
  "url": "http://highmed.org/fhir/CodeSystem/kardio/arzneimittel-standarddatensatz",
  "version": "1.0.0",
  "name": "HighmedKardioArzneimittelStandarddatensatz",
  "title": "HiGHmed Kardio Arzneimittel Standarddatensatz",
  "status": "active",
  "date": "2022-07-26T12:00:00.000Z",
  "publisher": "http://highmed.org",
  "description": "Custom codes of the HiGHmed Use Case Cardio Medications based on the DZHK Data Catalogue.\nSource: \nhttps://sharepoint.uni-goettingen.de/medizin/UKEI/HGOEHD/_layouts/15/WopiFrame2.aspx?sourcedoc=%7B05E88C36-5AAD-44A7-8B92-07392C900633%7D&file=MappingArzneimittelKardioATC.xlsx&action=default&DefaultItemOpen=1",
  "caseSensitive": false,
  "valueSet": "http://highmed.org/fhir/ValueSet/kardio/arzneimittel-standarddatensatz",
  "compositional": false,
  "versionNeeded": false,
  "content": "complete",
  "count": 26,
  "concept": [
    {
      "code": "ACEHem",
      "display": "ACE-Hemmer"
    },
    {
      "code": "AT1RANT",
      "display": "AT1-Rezeptorantagonist"
    },
    {
      "code": "BETABL",
      "display": "Betablocker"
    },
    {
      "code": "VALS+SACU",
      "display": "Sacubitril/Valsartan (Entresto)"
    },
    {
      "code": "ANDAARH",
      "display": "Anderes Antiarrhythmikum"
    },
    {
      "code": "THIDIU",
      "display": "Thiazid"
    },
    {
      "code": "SCHDIU",
      "display": "Schleifendiuretikum"
    },
    {
      "code": "ALDANT",
      "display": "Aldosteron-Antagonist"
    },
    {
      "code": "ANDDIU",
      "display": "Anderes Diuretikum"
    },
    {
      "code": "HG",
      "display": "Herzglykosid"
    },
    {
      "code": "NITR",
      "display": "Nitrat"
    },
    {
      "code": "CAANT",
      "display": "Ca-Antagonist"
    },
    {
      "code": "AMIOD",
      "display": "Amiodaron"
    },
    {
      "code": "IVAB",
      "display": "Ivabradin"
    },
    {
      "code": "STAT",
      "display": "Statin"
    },
    {
      "code": "ANDLIP",
      "display": "Anderer Lipidsenker"
    },
    {
      "code": "ASS",
      "display": "ASS"
    },
    {
      "code": "ANDTHROHEM",
      "display": "Thienopyridin (Prasugrel,Ticagrelor, Thienopyridine (z.B. Clopidogrel))"
    },
    {
      "code": "VITKANT",
      "display": "Vitamin K-Antagonist"
    },
    {
      "code": "NOACs",
      "display": "Neues Orales Antikoagulans (NOACs)"
    },
    {
      "code": "INS",
      "display": "Insulin"
    },
    {
      "code": "ANDADIA",
      "display": "Orales Antidiabetikum"
    },
    {
      "code": "NSAIDS",
      "display": "NSAIDs"
    },
    {
      "code": "PULM",
      "display": "Antiobstruktives pulmonales Medikament"
    },
    {
      "code": "ANTIDEPR",
      "display": "Antidepressivum"
    },
    {
      "code": "SOMEDI",
      "display": "Sonstige Medikation"
    }
  ],
  "extension": [
    {
      "url": "http://hl7.org/fhir/StructureDefinition/cqf-scope",
      "valueString": "@mii-termserv/de.highmed.usecases.cardiology.terminology"
    }
  ]
}