{
  "resourceType": "ValueSet",
  "id": "ops-zusatzk-2023",
  "meta": {
    "profile": [
      "http://hl7.org/fhir/StructureDefinition/shareablevalueset"
    ],
    "tag": [
      {
        "system": "https://mii-termserv.de/fhir/su-termserv/CodeSystem/mii-cs-suts-resource-tags-project",
        "code": "bfarm",
        "display": "Bundesinstitut für Arzneimittel und Medizinprodukte"
      },
      {
        "system": "https://mii-termserv.de/fhir/su-termserv/CodeSystem/mii-cs-suts-resource-tags-dataset",
        "code": "bfarm",
        "display": "Bundesinstitut für Arzneimittel und Medizinprodukte"
      },
      {
        "system": "https://mii-termserv.de/fhir/su-termserv/CodeSystem/mii-cs-suts-resource-tags-license",
        "code": "https://mii-termserv.de/licenses#bfarm",
        "display": "BfArM license terms"
      }
    ]
  },
  "language": "de",
  "url": "https://terminologien.bfarm.de/fhir/ValueSet/ops-zusatzk",
  "version": "2023",
  "name": "OPS_ZusatzK",
  "title": "Metadatendefinition: Zusatzkode",
  "status": "active",
  "experimental": false,
  "date": "2022-10-21",
  "publisher": "BfArM",
  "contact": [
    {
      "telecom": [
        {
          "system": "email",
          "value": "klassi@bfarm.de"
        },
        {
          "system": "url",
          "value": "https://www.bfarm.de"
        }
      ]
    }
  ],
  "description": "Zusatzkodes sind Kodes, die gemäß den Klassentiteln und Hinweisen im OPS nur zusätzlich zu einem Primärkode angegeben werden dürfen. Nur endständige Kodes können negativ mit 'N' oder positiv mit 'J' gekennzeichnet sein.",
  "copyright": "BfArM 1994-2023 - Die Erstellung erfolgt unter Verwendung der maschinenlesbaren Fassung des Bundesinstituts für Arzneimittel und Medizinprodukte (BfArM).",
  "compose": {
    "include": [
      {
        "system": "https://terminologien.bfarm.de/fhir/CodeSystem/ops-zusatzk",
        "version": "2023"
      }
    ]
  },
  "expansion": {
    "identifier": "urn:uuid:2b2921b6-0987-4a3c-b010-0e2758b74367",
    "timestamp": "2024-12-02",
    "total": 2,
    "offset": 0,
    "contains": [
      {
        "system": "https://terminologien.bfarm.de/fhir/CodeSystem/ops-zusatzk",
        "version": "2023",
        "code": "J",
        "display": "Ja"
      },
      {
        "system": "https://terminologien.bfarm.de/fhir/CodeSystem/ops-zusatzk",
        "version": "2023",
        "code": "N",
        "display": "Nein"
      }
    ]
  },
  "extension": [
    {
      "url": "http://hl7.org/fhir/StructureDefinition/cqf-scope",
      "valueString": "@mii-termserv/de.bfarm.ops"
    }
  ],
  "text": {
    "status": "generated",
    "div": "<div xmlns=\"http://www.w3.org/1999/xhtml\"><h2>Metadatendefinition: Zusatzkode</h2><tt>https://terminologien.bfarm.de/fhir/ValueSet/ops-zusatzk</tt><p>Zusatzkodes sind Kodes, die gemäß den Klassentiteln und Hinweisen im OPS nur zusätzlich zu einem Primärkode angegeben werden dürfen. Nur endständige Kodes können negativ mit &#x27;N&#x27; oder positiv mit &#x27;J&#x27; gekennzeichnet sein.</p><div><p><b>SU-TermServ Metadata</b></p><table><tbody><tr><td><b>Project</b></td><td>Bundesinstitut für Arzneimittel und Medizinprodukte</td></tr><tr><td><b>Dataset</b></td><td>Bundesinstitut für Arzneimittel und Medizinprodukte</td></tr><tr><td><b>License</b></td><td><a href=\"https://mii-termserv.de/licenses#bfarm\">BfArM license terms</a></td></tr><tr><td><b>Package Scope</b></td><td><a href=\"https://gitlab.com/groups/mii-termserv/fhir-resources/-/packages/?ForderBy%3Dversion%26sort%3Ddesc%26search%5B%5D%3D@mii-termserv/de.bfarm.ops\"><code>@mii-termserv/de.bfarm.ops</code></a></td></tr></tbody></table></div></div>"
  }
}