{
  "resourceType": "CodeSystem",
  "id": "ops-p17b-d-2022",
  "meta": {
    "profile": [
      "http://hl7.org/fhir/StructureDefinition/shareablecodesystem"
    ],
    "tag": [
      {
        "system": "https://mii-termserv.de/fhir/su-termserv/CodeSystem/mii-cs-suts-resource-tags-project",
        "code": "bfarm",
        "display": "Bundesinstitut für Arzneimittel und Medizinprodukte"
      },
      {
        "system": "https://mii-termserv.de/fhir/su-termserv/CodeSystem/mii-cs-suts-resource-tags-dataset",
        "code": "bfarm",
        "display": "Bundesinstitut für Arzneimittel und Medizinprodukte"
      },
      {
        "system": "https://mii-termserv.de/fhir/su-termserv/CodeSystem/mii-cs-suts-resource-tags-license",
        "code": "https://mii-termserv.de/licenses#bfarm",
        "display": "BfArM license terms"
      }
    ]
  },
  "language": "de",
  "url": "https://terminologien.bfarm.de/fhir/CodeSystem/ops-p17b-d",
  "version": "2022",
  "name": "OPS_P17b_d",
  "title": "Metadatendefinition: § 17b und/oder § 17d KHG",
  "status": "active",
  "experimental": false,
  "date": "2021-10-22",
  "publisher": "BfArM",
  "contact": [
    {
      "telecom": [
        {
          "system": "email",
          "value": "klassi@bfarm.de"
        },
        {
          "system": "url",
          "value": "https://www.bfarm.de"
        }
      ]
    }
  ],
  "description": "Gültigkeit nach § 17b und/oder § 17d KHG. Im § 17b KHG ist die Einführung eines pauschalierenden Entgeltsystems für DRG-Krankenhäuser und in § 17d KHG die Einführung eines pauschalierenden Entgeltsystems für psychiatrische und psychosomatische Einrichtungen gesetzlich geregelt.",
  "copyright": "BfArM 1994-2022 - Die Erstellung erfolgt unter Verwendung der maschinenlesbaren Fassung des Bundesinstituts für Arzneimittel und Medizinprodukte (BfArM).",
  "caseSensitive": true,
  "valueSet": "https://terminologien.bfarm.de/fhir/ValueSet/ops-p17b-d",
  "versionNeeded": true,
  "content": "complete",
  "count": 4,
  "concept": [
    {
      "code": "0",
      "display": "gültig nach § 17b KHG"
    },
    {
      "code": "1",
      "display": "gültig nach § 17d KHG"
    },
    {
      "code": "2",
      "display": "gültig nach § 17b und § 17d KHG"
    },
    {
      "code": "3",
      "display": "nicht gültig nach § 17b und § 17d KHG",
      "definition": "Mit '3' sind die Kodes gekennzeichnet, für die folgender Hinweis gilt: 'Diese Kodes sind im Geltungsbereich des G-DRG-Systems (§ 17b KHG) nicht zu verwenden.' Da bisher alle Kodes, die mit 3 gekennzeichnet sind, somatische Kodes sind, sodass der § 17d nicht betroffen ist, wird er in diesem Hinweis nicht genannt."
    }
  ],
  "extension": [
    {
      "url": "http://hl7.org/fhir/StructureDefinition/cqf-scope",
      "valueString": "@mii-termserv/de.bfarm.ops"
    }
  ],
  "text": {
    "status": "generated",
    "div": "<div xmlns=\"http://www.w3.org/1999/xhtml\"><h2>Metadatendefinition: § 17b und/oder § 17d KHG</h2><tt>https://terminologien.bfarm.de/fhir/CodeSystem/ops-p17b-d</tt><p>Gültigkeit nach § 17b und/oder § 17d KHG. Im § 17b KHG ist die Einführung eines pauschalierenden Entgeltsystems für DRG-Krankenhäuser und in § 17d KHG die Einführung eines pauschalierenden Entgeltsystems für psychiatrische und psychosomatische Einrichtungen gesetzlich geregelt.</p><div><p><b>SU-TermServ Metadata</b></p><table><tbody><tr><td><b>Project</b></td><td>Bundesinstitut für Arzneimittel und Medizinprodukte</td></tr><tr><td><b>Dataset</b></td><td>Bundesinstitut für Arzneimittel und Medizinprodukte</td></tr><tr><td><b>License</b></td><td><a href=\"https://mii-termserv.de/licenses#bfarm\">BfArM license terms</a></td></tr><tr><td><b>Package Scope</b></td><td><a href=\"https://gitlab.com/groups/mii-termserv/fhir-resources/-/packages/?ForderBy%3Dversion%26sort%3Ddesc%26search%5B%5D%3D@mii-termserv/de.bfarm.ops\"><code>@mii-termserv/de.bfarm.ops</code></a></td></tr></tbody></table></div></div>"
  }
}