{
  "resourceType": "CodeSystem",
  "id": "icd10gm-para301-2024",
  "meta": {
    "profile": [
      "http://hl7.org/fhir/StructureDefinition/shareablecodesystem"
    ],
    "tag": [
      {
        "system": "https://mii-termserv.de/fhir/su-termserv/CodeSystem/mii-cs-suts-resource-tags-project",
        "code": "bfarm",
        "display": "Bundesinstitut für Arzneimittel und Medizinprodukte"
      },
      {
        "system": "https://mii-termserv.de/fhir/su-termserv/CodeSystem/mii-cs-suts-resource-tags-dataset",
        "code": "bfarm",
        "display": "Bundesinstitut für Arzneimittel und Medizinprodukte"
      },
      {
        "system": "https://mii-termserv.de/fhir/su-termserv/CodeSystem/mii-cs-suts-resource-tags-license",
        "code": "https://mii-termserv.de/licenses#bfarm",
        "display": "BfArM license terms"
      }
    ]
  },
  "language": "de",
  "url": "https://terminologien.bfarm.de/fhir/CodeSystem/icd10gm-para301",
  "version": "2024",
  "name": "ICD10GM_Para301",
  "title": "Metadatendefinition: Paragraph 301",
  "status": "active",
  "experimental": false,
  "date": "2023-09-15",
  "publisher": "BfArM",
  "contact": [
    {
      "telecom": [
        {
          "system": "email",
          "value": "klassi@bfarm.de"
        },
        {
          "system": "url",
          "value": "https://www.bfarm.de"
        }
      ]
    }
  ],
  "description": "Verwendung der Schlüsselnummer nach Paragraph 301",
  "copyright": "WHO, BfArM 1994 - 2024 - Die Erstellung erfolgt unter Verwendung der maschinenlesbaren Fassung des Bundesinstituts für Arzneimittel und Medizinprodukte (BfArM).",
  "caseSensitive": true,
  "valueSet": "https://terminologien.bfarm.de/fhir/ValueSet/icd10gm-para301",
  "versionNeeded": true,
  "content": "complete",
  "count": 4,
  "concept": [
    {
      "code": "P",
      "display": "zur Primärverschlüsselung zugelassen"
    },
    {
      "code": "O",
      "display": "nur als Sternschlüsselnummer zugelassen"
    },
    {
      "code": "Z",
      "display": "nur als Ausrufezeichenschlüsselnummer zugelassen"
    },
    {
      "code": "V",
      "display": "nicht zur Verschlüsselung zugelassen"
    }
  ],
  "extension": [
    {
      "url": "http://hl7.org/fhir/StructureDefinition/cqf-scope",
      "valueString": "@mii-termserv/de.bfarm.icd-10-gm"
    }
  ],
  "text": {
    "status": "generated",
    "div": "<div xmlns=\"http://www.w3.org/1999/xhtml\"><h2>Metadatendefinition: Paragraph 301</h2><tt>https://terminologien.bfarm.de/fhir/CodeSystem/icd10gm-para301</tt><p>Verwendung der Schlüsselnummer nach Paragraph 301</p><div><p><b>SU-TermServ Metadata</b></p><table><tbody><tr><td><b>Project</b></td><td>Bundesinstitut für Arzneimittel und Medizinprodukte</td></tr><tr><td><b>Dataset</b></td><td>Bundesinstitut für Arzneimittel und Medizinprodukte</td></tr><tr><td><b>License</b></td><td><a href=\"https://mii-termserv.de/licenses#bfarm\">BfArM license terms</a></td></tr><tr><td><b>Package Scope</b></td><td><a href=\"https://gitlab.com/groups/mii-termserv/fhir-resources/-/packages/?ForderBy%3Dversion%26sort%3Ddesc%26search%5B%5D%3D@mii-termserv/de.bfarm.icd-10-gm\"><code>@mii-termserv/de.bfarm.icd-10-gm</code></a></td></tr></tbody></table></div></div>"
  }
}