{
  "resourceType": "ValueSet",
  "id": "icd10gm-ebmlabor-2024",
  "meta": {
    "profile": [
      "http://hl7.org/fhir/StructureDefinition/shareablevalueset"
    ],
    "tag": [
      {
        "system": "https://mii-termserv.de/fhir/su-termserv/CodeSystem/mii-cs-suts-resource-tags-project",
        "code": "bfarm",
        "display": "Bundesinstitut für Arzneimittel und Medizinprodukte"
      },
      {
        "system": "https://mii-termserv.de/fhir/su-termserv/CodeSystem/mii-cs-suts-resource-tags-dataset",
        "code": "bfarm",
        "display": "Bundesinstitut für Arzneimittel und Medizinprodukte"
      },
      {
        "system": "https://mii-termserv.de/fhir/su-termserv/CodeSystem/mii-cs-suts-resource-tags-license",
        "code": "https://mii-termserv.de/licenses#bfarm",
        "display": "BfArM license terms"
      }
    ]
  },
  "language": "de",
  "url": "https://terminologien.bfarm.de/fhir/ValueSet/icd10gm-ebmlabor",
  "version": "2024",
  "name": "ICD10GM_EBMLabor",
  "title": "Metadatendefinition: IfSG-Labor",
  "status": "active",
  "experimental": false,
  "date": "2023-09-15",
  "publisher": "BfArM",
  "contact": [
    {
      "telecom": [
        {
          "system": "email",
          "value": "klassi@bfarm.de"
        },
        {
          "system": "url",
          "value": "https://www.bfarm.de"
        }
      ]
    }
  ],
  "description": "IfSG-Labor kennzeichnet, dass bei Laboruntersuchungen zu diesen Diagnosen die Laborausschlussziffer des EBM (32006) gewählt werden kann",
  "copyright": "WHO, BfArM 1994 - 2024 - Die Erstellung erfolgt unter Verwendung der maschinenlesbaren Fassung des Bundesinstituts für Arzneimittel und Medizinprodukte (BfArM).",
  "compose": {
    "include": [
      {
        "system": "https://terminologien.bfarm.de/fhir/CodeSystem/icd10gm-ebmlabor",
        "version": "2024"
      }
    ]
  },
  "expansion": {
    "identifier": "urn:uuid:a570ef44-3841-4604-b729-5df832d90119",
    "timestamp": "2024-12-02",
    "total": 2,
    "offset": 0,
    "contains": [
      {
        "system": "https://terminologien.bfarm.de/fhir/CodeSystem/icd10gm-ebmlabor",
        "version": "2024",
        "code": "J",
        "display": "Ja"
      },
      {
        "system": "https://terminologien.bfarm.de/fhir/CodeSystem/icd10gm-ebmlabor",
        "version": "2024",
        "code": "N",
        "display": "Nein"
      }
    ]
  },
  "extension": [
    {
      "url": "http://hl7.org/fhir/StructureDefinition/cqf-scope",
      "valueString": "@mii-termserv/de.bfarm.icd-10-gm"
    }
  ],
  "text": {
    "status": "generated",
    "div": "<div xmlns=\"http://www.w3.org/1999/xhtml\"><h2>Metadatendefinition: IfSG-Labor</h2><tt>https://terminologien.bfarm.de/fhir/ValueSet/icd10gm-ebmlabor</tt><p>IfSG-Labor kennzeichnet, dass bei Laboruntersuchungen zu diesen Diagnosen die Laborausschlussziffer des EBM (32006) gewählt werden kann</p><div><p><b>SU-TermServ Metadata</b></p><table><tbody><tr><td><b>Project</b></td><td>Bundesinstitut für Arzneimittel und Medizinprodukte</td></tr><tr><td><b>Dataset</b></td><td>Bundesinstitut für Arzneimittel und Medizinprodukte</td></tr><tr><td><b>License</b></td><td><a href=\"https://mii-termserv.de/licenses#bfarm\">BfArM license terms</a></td></tr><tr><td><b>Package Scope</b></td><td><a href=\"https://gitlab.com/groups/mii-termserv/fhir-resources/-/packages/?ForderBy%3Dversion%26sort%3Ddesc%26search%5B%5D%3D@mii-termserv/de.bfarm.icd-10-gm\"><code>@mii-termserv/de.bfarm.icd-10-gm</code></a></td></tr></tbody></table></div></div>"
  }
}