{
    "prepare_queue": {
        "installed": [],
        "uninstalled": []
    },
    "config_munge": {
        "files": {}
    },
    "installed_plugins": {
        "onesignal-cordova-plugin": {
            "PACKAGE_NAME": "io.ionic.starter"
        },
        "cordova-plugin-console": {
            "PACKAGE_NAME": "io.ionic.starter"
        },
        "cordova-plugin-device": {
            "PACKAGE_NAME": "io.ionic.starter"
        },
        "cordova-plugin-splashscreen": {
            "PACKAGE_NAME": "io.ionic.starter"
        },
        "cordova-plugin-statusbar": {
            "PACKAGE_NAME": "io.ionic.starter"
        },
        "cordova-plugin-whitelist": {
            "PACKAGE_NAME": "io.ionic.starter"
        },
        "ionic-plugin-keyboard": {
            "PACKAGE_NAME": "io.ionic.starter"
        },
        "cordova-plugin-inappbrowser": {
            "PACKAGE_NAME": "io.ionic.starter"
        },
        "card.io.cordova.mobilesdk": {
            "PACKAGE_NAME": "io.ionic.starter"
        },
        "com.paypal.cordova.mobilesdk": {
            "PACKAGE_NAME": "io.ionic.starter"
        },
        "cordova-plugin-x-toast": {
            "PACKAGE_NAME": "io.ionic.starter"
        }
    },
    "dependent_plugins": {}
}