<?xml version="1.0" encoding="utf-8"?>
<!-- Generator: Adobe Illustrator 21.0.2, SVG Export Plug-In . SVG Version: 6.00 Build 0)  -->
<svg version="1.1" id="Layer_1" xmlns="http://www.w3.org/2000/svg" xmlns:xlink="http://www.w3.org/1999/xlink" x="0px" y="0px"
	 viewBox="0 0 900 900" style="enable-background:new 0 0 900 900;" xml:space="preserve">
<style type="text/css">
	.st0{fill:#4A90E2;}
	.st1{font-family:'OpenSans-Bold';}
	.st2{font-size:127.7344px;}
	.st3{fill:#231F20;}
</style>
<text transform="matrix(1 0 0 1 11.46 516.6123)"><tspan x="0" y="0" class="st0 st1 st2">meeting</tspan><tspan x="526.9" y="0" class="st3 st1 st2">app</tspan></text>
<g>
	<polygon class="st0" points="843.6,346.1 835.1,350.9 880.7,367.5 	"/>
	<polygon class="st0" points="843.6,360.7 850.1,364.4 886.5,370.9 880.7,367.5 835.1,350.9 820.7,359.3 840.1,362.7 	"/>
	<polygon class="st0" points="813.4,378.1 823.9,372 798.6,372 795.7,373.7 795.7,389.2 824,384.2 	"/>
	<polygon class="st0" points="870.2,376 889.6,372.6 888.5,372 863.2,372 	"/>
	<polygon class="st0" points="840.1,362.7 820.7,359.3 798.6,372 823.9,372 	"/>
	<polygon class="st0" points="888.5,372 886.5,370.9 850.1,364.4 863.2,372 	"/>
	<polygon class="st0" points="873.7,378.1 869.2,380.7 890.3,373 889.6,372.6 870.2,376 	"/>
	<polygon class="st0" points="808.3,389.8 822.2,397.8 837.8,392.2 824,384.2 795.7,389.2 795.7,407.5 808.3,402.9 	"/>
	<polygon class="st0" points="808.3,402.9 795.7,407.5 795.7,428.3 808.3,421 	"/>
	<polygon class="st0" points="890.8,373.3 890.3,373 869.2,380.7 843.6,395.5 837.8,392.2 822.2,397.8 835.3,405.4 	"/>
	<polygon class="st0" points="823.2,430.3 815.6,426 808.3,421.7 808.3,421 795.7,428.3 795.7,429 803,433.3 813.3,439 823.5,430.4 
			"/>
	<polygon class="st0" points="835.3,405.4 837.2,406.5 837.2,418.9 849.9,408.3 849.9,406.5 856.7,402.5 891.2,373.6 890.8,373.3 	
		"/>
	<polygon class="st0" points="857.1,434.2 844.5,456.2 867.2,443 874,424.5 	"/>
	<polygon class="st0" points="878.8,411.2 891.5,376.4 891.5,374.8 878.8,396.7 	"/>
	<polygon class="st0" points="849.9,438.4 849.9,423.5 829.1,448.3 843.5,456.7 844.5,456.2 857.1,434.2 	"/>
	<polygon class="st0" points="878.8,389.8 878.8,396.7 891.5,374.8 891.5,373.9 877.6,390.5 	"/>
	<polygon class="st0" points="849.9,408.3 837.2,418.9 837.2,438.4 823.5,430.4 813.2,439 822.8,444.6 829.1,448.3 849.9,423.5 	"/>
	<polygon class="st0" points="877.6,390.5 891.5,373.9 891.5,373.7 891.2,373.6 856.7,402.5 	"/>
	<polygon class="st0" points="891.5,429 891.5,381.1 882.1,434.5 	"/>
	<polygon class="st0" points="878.8,411.2 878.8,421.7 874,424.5 867.2,443 882.1,434.5 891.5,381.1 891.5,376.4 	"/>
</g>
</svg>
