<?xml version="1.0" encoding="utf-8"?>
<!-- Generator: Adobe Illustrator 21.0.2, SVG Export Plug-In . SVG Version: 6.00 Build 0)  -->
<svg version="1.1" id="Layer_1" xmlns="http://www.w3.org/2000/svg" xmlns:xlink="http://www.w3.org/1999/xlink" x="0px" y="0px"
	 viewBox="0 0 900 900" style="enable-background:new 0 0 900 900;" xml:space="preserve">
<style type="text/css">
	.st0{fill:#4A90E2;}
</style>
<g>
	<polygon class="st0" points="450,29.4 386,66.4 732.5,192.5 	"/>
	<polygon class="st0" points="450,140.5 499.4,169.1 776.4,217.9 732.5,192.5 386,66.4 276.3,129.7 423.7,155.7 	"/>
	<polygon class="st0" points="220.7,272.9 300.7,226.7 108.3,226.7 85.8,239.7 85.8,357.3 301.1,319.3 	"/>
	<polygon class="st0" points="652.5,257.4 799.8,231.4 791.7,226.7 599.3,226.7 	"/>
	<polygon class="st0" points="423.7,155.7 276.3,129.7 108.3,226.7 300.7,226.7 	"/>
	<polygon class="st0" points="791.7,226.7 776.4,217.9 499.4,169.1 599.3,226.7 	"/>
	<polygon class="st0" points="679.3,272.9 644.9,292.8 805.1,234.5 799.8,231.4 652.5,257.4 	"/>
	<polygon class="st0" points="182,361.7 287.8,422.7 405.8,379.8 301.1,319.3 85.8,357.3 85.8,496.3 182,461.3 	"/>
	<polygon class="st0" points="182,461.3 85.8,496.3 85.8,654.3 182,598.8 	"/>
	<polygon class="st0" points="809.1,236.7 805.1,234.5 644.9,292.8 450,405.3 405.8,379.8 287.8,422.7 387.3,480.2 	"/>
	<polygon class="st0" points="295.5,669.8 237.7,636.9 182,604.7 182,598.8 85.8,654.3 85.8,660.3 141.5,692.5 219.8,736.1 
		297.2,670.8 	"/>
	<polygon class="st0" points="387.3,480.2 401.9,488.6 401.9,582.9 498.1,502.2 498.1,488.6 550.1,458.6 812.3,238.6 809.1,236.7 	
		"/>
	<polygon class="st0" points="553.3,699.8 457.1,866.5 629.9,766.7 681.1,626 	"/>
	<polygon class="st0" points="718,524.6 814.2,260.3 814.2,247.9 718,414.5 	"/>
	<polygon class="st0" points="498.1,731.7 498.1,618 339.8,806.7 449.9,870.6 457.1,866.5 553.3,699.8 	"/>
	<polygon class="st0" points="718,361.7 718,414.5 814.2,247.9 814.2,241.3 708.7,367 	"/>
	<polygon class="st0" points="498.1,502.2 401.9,582.9 401.9,731.5 297.2,670.8 219.3,736.1 291.9,778.9 339.8,806.7 498.1,618 	"/>
	<polygon class="st0" points="708.7,367 814.2,241.3 814.2,239.7 812.3,238.6 550.1,458.6 	"/>
	<polygon class="st0" points="814.2,660.3 814.2,296.1 742.7,701.5 	"/>
	<polygon class="st0" points="718,524.6 718,604.7 681.1,626 629.9,766.7 742.7,701.5 814.2,296.1 814.2,260.3 	"/>
</g>
</svg>
