{
    "Days": {
        "module": "page"
    },
    "Rooms": {
        "module": "listItem"
    },
    "Schedule": [{
        "sessionTitle": "Session 1",
        "sessionStartTime": "12:30",
        "sessionEndTime": "14:30",
        "speakers": []
    }, {
        "sessionTitle": "Session 2",
        "sessionStartTime": "12:30",
        "sessionEndTime": "14:30",
        "speakers": []
    }],
    "Speakers": [

    ],
    "Sponsors": [

    ]
}