{
    "MenuItems": [{
            "title": "Home",
            "component": "home",
            "item_icon": "home_icon"
        },
        {
            "title": "List Page 1",
            "component": "listPage-1",
            "item_icon": "list_icon"

        },
        {
            "title": "List Page 2",
            "component": "listPage-2",
            "item_icon": "list_icon"
        },
        {
            "title": "List Page 3",
            "component": "listPage-3",
            "item_icon": "list_icon"
        },
        {
            "title": "List Page 4",
            "component": "listPage-4",
            "item_icon": "list_icon"
        }
    ]

}