<?xml version="1.0" encoding="utf-8"?>
<!-- Generator: Adobe Illustrator 21.0.0, SVG Export Plug-In . SVG Version: 6.00 Build 0)  -->
<svg version="1.1" id="Layer_1" xmlns="http://www.w3.org/2000/svg" xmlns:xlink="http://www.w3.org/1999/xlink" x="0px" y="0px"
	 viewBox="0 0 220 50" enable-background="new 0 0 220 50" xml:space="preserve">
<g>
	<g>
		<g>
			<g>
				<defs>
					<rect id="SVGID_1_" x="14.098" y="14.026" width="22.211" height="22.203"/>
				</defs>
				<clipPath id="SVGID_2_">
					<use xlink:href="#SVGID_1_"  overflow="visible"/>
				</clipPath>
				
					<radialGradient id="SVGID_3_" cx="-163.5053" cy="423.6741" r="0.9029" gradientTransform="matrix(8.3488 0 0 -8.3488 1390.2786 3562.3022)" gradientUnits="userSpaceOnUse">
					<stop  offset="0" style="stop-color:#FFFFFF"/>
					<stop  offset="0.24" style="stop-color:#FFFFFF"/>
					<stop  offset="0.3059" style="stop-color:#FFFCF4"/>
					<stop  offset="0.4229" style="stop-color:#FFF5D5"/>
					<stop  offset="0.5774" style="stop-color:#FFE9A4"/>
					<stop  offset="0.7634" style="stop-color:#FFD860"/>
					<stop  offset="0.9743" style="stop-color:#FFC40B"/>
					<stop  offset="1" style="stop-color:#FFC100"/>
				</radialGradient>
				<rect x="14.098" y="14.026" clip-path="url(#SVGID_2_)" fill="url(#SVGID_3_)" width="22.211" height="22.203"/>
			</g>
			<path fill="#DB8B00" d="M31.173,2.849c2.08-0.605,4.391-0.393,6.412,0.772c2.017,1.169,3.358,3.063,3.872,5.159
				c2.097,0.518,3.995,1.857,5.159,3.877c1.169,2.02,1.379,4.33,0.778,6.407c1.559,1.496,2.529,3.6,2.529,5.935
				c0,2.331-0.969,4.439-2.529,5.935c0.601,2.077,0.387,4.384-0.778,6.406c-1.164,2.021-3.062,3.361-5.159,3.875
				c-0.517,2.102-1.856,3.994-3.876,5.163c-2.017,1.168-4.328,1.381-6.408,0.777c-1.496,1.558-3.603,2.531-5.933,2.531
				c-2.332,0-4.441-0.973-5.936-2.531c-2.08,0.604-4.386,0.391-6.408-0.777c-2.021-1.169-3.358-3.061-3.874-5.159
				c-2.102-0.517-3.995-1.857-5.163-3.879c-1.168-2.022-1.376-4.329-0.774-6.406c-1.558-1.496-2.53-3.605-2.53-5.935
				c0-2.335,0.972-4.44,2.53-5.937c-0.602-2.076-0.394-4.386,0.774-6.406c1.168-2.02,3.064-3.359,5.163-3.877
				c0.516-2.097,1.853-3.991,3.874-5.159c2.022-1.165,4.328-1.377,6.408-0.772c1.495-1.563,3.604-2.535,5.936-2.535
				C27.57,0.314,29.677,1.286,31.173,2.849 M31.498,18.739c-0.735-0.18-1.457-0.468-2.143-0.863c-0.69-0.4-1.299-0.881-1.823-1.426
				c-0.731,0.209-1.497,0.322-2.292,0.322c-0.794,0-1.565-0.114-2.291-0.322c-0.528,0.545-1.136,1.026-1.82,1.426
				c-0.694,0.395-1.414,0.683-2.15,0.863c-0.18,0.737-0.469,1.458-0.863,2.147c-0.401,0.686-0.882,1.302-1.427,1.822
				c0.21,0.731,0.324,1.496,0.324,2.292c0,0.793-0.114,1.563-0.324,2.291c0.546,0.525,1.027,1.133,1.427,1.825
				c0.394,0.685,0.683,1.41,0.863,2.145c0.736,0.18,1.457,0.466,2.15,0.866c0.685,0.398,1.292,0.877,1.82,1.427
				c0.726-0.21,1.496-0.323,2.291-0.323c0.794,0,1.56,0.113,2.292,0.323c0.524-0.549,1.133-1.028,1.823-1.427
				c0.686-0.4,1.408-0.685,2.143-0.866c0.182-0.735,0.47-1.46,0.866-2.145c0.398-0.691,0.881-1.3,1.426-1.825
				c-0.21-0.728-0.322-1.498-0.322-2.291c0-0.797,0.111-1.562,0.322-2.292c-0.545-0.52-1.028-1.136-1.426-1.822
				C31.968,20.197,31.68,19.475,31.498,18.739"/>
			<path fill="#B11318" d="M13.015,32.057c1.797-0.998,3.928-1.299,5.962-0.798c0.504,2.034,0.198,4.166-0.794,5.958
				c1.057-1.756,2.752-3.084,4.766-3.664c1.451,1.509,2.251,3.506,2.29,5.554c0.036-2.048,0.841-4.045,2.294-5.554
				c2.009,0.579,3.698,1.906,4.755,3.657c-0.99-1.79-1.289-3.917-0.79-5.951c2.033-0.501,4.161-0.2,5.954,0.792
				c-1.754-1.06-3.078-2.75-3.661-4.76c1.507-1.447,3.503-2.251,5.552-2.293c-2.048-0.036-4.044-0.838-5.552-2.289
				c0.583-2.01,1.907-3.704,3.661-4.76c-1.793,0.988-3.922,1.293-5.953,0.793c-0.501-2.035-0.2-4.169,0.798-5.964
				c-1.062,1.757-2.754,3.088-4.767,3.67c-1.451-1.509-2.255-3.511-2.292-5.558c-0.038,2.047-0.839,4.05-2.29,5.558
				c-2.015-0.582-3.709-1.912-4.768-3.67c0.995,1.794,1.301,3.928,0.797,5.962c-2.034,0.502-4.168,0.197-5.962-0.798
				c1.759,1.057,3.087,2.752,3.672,4.767c-1.51,1.453-3.512,2.255-5.562,2.289c2.051,0.037,4.05,0.841,5.562,2.293
				C16.104,29.304,14.773,31,13.015,32.057 M9.021,41.216c-0.491-1.986-0.246-4.163,0.861-6.08c0.722-1.247,1.725-2.235,2.879-2.935
				c-1.18,0.655-2.539,1.025-3.981,1.025c-2.21,0-4.221-0.869-5.698-2.291c0.572-1.968,1.874-3.729,3.789-4.835
				c1.25-0.719,2.614-1.077,3.961-1.103c-1.349-0.025-2.711-0.378-3.961-1.1c-1.915-1.105-3.217-2.867-3.789-4.832
				c1.479-1.421,3.488-2.295,5.698-2.295c1.442,0,2.801,0.373,3.981,1.027c-1.154-0.697-2.155-1.686-2.878-2.937
				c-1.109-1.912-1.354-4.088-0.863-6.077c1.988-0.492,4.162-0.244,6.08,0.865c1.249,0.721,2.24,1.722,2.938,2.878
				c-0.658-1.183-1.028-2.539-1.028-3.982c0-2.212,0.87-4.22,2.292-5.7c1.968,0.573,3.727,1.878,4.833,3.791
				c0.721,1.25,1.079,2.61,1.103,3.96c0.023-1.35,0.383-2.71,1.103-3.959c1.104-1.914,2.863-3.219,4.831-3.792
				c1.423,1.48,2.295,3.488,2.295,5.7c0,1.443-0.373,2.8-1.024,3.979c0.695-1.157,1.683-2.153,2.935-2.875
				c1.912-1.109,4.09-1.357,6.079-0.865c0.491,1.989,0.243,4.165-0.863,6.079c-0.721,1.248-1.719,2.236-2.87,2.93
				c1.179-0.649,2.533-1.021,3.969-1.021c2.216,0,4.223,0.875,5.702,2.295c-0.572,1.965-1.876,3.727-3.788,4.832
				c-1.248,0.722-2.606,1.075-3.948,1.1c1.342,0.025,2.701,0.387,3.948,1.103c1.912,1.106,3.216,2.866,3.788,4.835
				c-1.479,1.421-3.486,2.291-5.702,2.291c-1.437,0-2.79-0.366-3.969-1.018c1.151,0.695,2.149,1.682,2.866,2.928
				c1.109,1.916,1.358,4.094,0.866,6.08c-1.988,0.491-4.167,0.245-6.079-0.861c-1.247-0.719-2.236-1.719-2.929-2.867
				c0.647,1.175,1.018,2.531,1.018,3.968c0,2.212-0.872,4.219-2.295,5.7c-1.968-0.571-3.727-1.876-4.831-3.79
				c-0.72-1.249-1.078-2.608-1.103-3.958c-0.025,1.35-0.382,2.709-1.103,3.958c-1.106,1.915-2.864,3.219-4.832,3.79
				c-1.423-1.481-2.293-3.488-2.293-5.7c0-1.441,0.368-2.797,1.023-3.975c-0.696,1.15-1.685,2.156-2.933,2.875
				C13.183,41.46,11.01,41.707,9.021,41.216"/>
		</g>
		<g>
			<path fill="#B11318" d="M79.026,20.87l-3.94-0.009c-0.123-0.002-0.243,0.002-0.354,0.015c-0.939,0.077-1.683,0.479-2.243,1.198
				c-0.618,0.813-0.929,1.912-0.929,3.305v7.875h-5.083V16.771h5.083v3.063h0.063c0.782-2.168,2.163-3.283,4.148-3.353h0.197
				l0.692,0.005L79.026,20.87z"/>
			<path fill="#B11318" d="M94.509,18.679c-1.558-1.539-3.704-2.307-6.441-2.307c-2.78,0-4.983,0.768-6.612,2.307
				c-1.634,1.539-2.446,3.676-2.446,6.402c0,2.635,0.785,4.727,2.358,6.268c1.569,1.536,3.729,2.31,6.475,2.31
				c2.79,0,4.988-0.795,6.595-2.381c1.602-1.589,2.405-3.755,2.405-6.49C96.842,22.255,96.064,20.218,94.509,18.679 M88.008,29.759
				c-2.556,0-3.835-1.581-3.835-4.75c0-1.506,0.332-2.674,1.001-3.507c0.662-0.826,1.598-1.236,2.8-1.236
				c2.457,0,3.689,1.539,3.689,4.622C91.664,28.133,90.441,29.759,88.008,29.759"/>
			<path fill="#B11318" d="M125.679,33.253h-5.072v-9.402c0-2.386-0.878-3.585-2.637-3.585c-0.835,0-1.516,0.359-2.044,1.079
				c-0.526,0.716-0.788,1.613-0.788,2.687v9.221h-5.083v-9.498c0-2.321-0.866-3.489-2.593-3.489c-0.866,0-1.564,0.338-2.084,1.027
				c-0.52,0.686-0.78,1.623-0.78,2.802v9.158H99.51V16.77h5.087v2.579h0.062c0.526-0.879,1.264-1.597,2.213-2.145
				c0.951-0.557,1.988-0.832,3.117-0.832c2.325,0,3.925,1.024,4.78,3.071c1.26-2.047,3.1-3.071,5.536-3.071
				c3.584,0,5.375,2.208,5.375,6.632V33.253z"/>
			<path fill="#B11318" d="M143.743,18.567c-1.163-1.466-2.811-2.196-4.953-2.196c-2.268,0-4.034,0.961-5.292,2.882h-0.066v-2.482
				h-5.082v25.57l5.09-0.007l-0.008-11h0.066c1.047,1.549,2.556,2.323,4.539,2.323c2.252,0,4.059-0.833,5.416-2.496
				c1.359-1.666,2.036-3.869,2.036-6.616C145.489,22.025,144.911,20.031,143.743,18.567 M139.315,28.419
				c-0.635,0.896-1.534,1.342-2.686,1.342c-0.981,0-1.773-0.358-2.369-1.08c-0.606-0.718-0.902-1.645-0.902-2.784v-1.318
				c0-1.295,0.328-2.341,0.991-3.131c0.658-0.786,1.51-1.184,2.546-1.184c2.252,0,3.384,1.449,3.384,4.352
				C140.278,26.255,139.955,27.522,139.315,28.419"/>
			<path fill="#B11318" d="M163.96,24.323c0-2.447-0.661-4.388-1.974-5.816c-1.309-1.421-3.174-2.137-5.573-2.137
				c-2.316,0-4.267,0.797-5.859,2.395c-1.592,1.596-2.385,3.77-2.385,6.504c0,2.636,0.736,4.699,2.204,6.171
				c1.471,1.476,3.539,2.217,6.196,2.217c2.441,0,4.42-0.41,5.938-1.225v-3.668c-1.374,0.856-2.965,1.288-4.778,1.288
				c-2.843,0-4.352-1.201-4.524-3.592h10.754V24.323z M153.175,23.338c0.131-1.002,0.489-1.851,1.087-2.526
				c0.59-0.678,1.302-1.013,2.114-1.013c1.912,0,2.871,1.181,2.871,3.539H153.175z"/>
			<path fill="#B11318" d="M191.837,20.897l-3.942-0.011c-0.124-0.001-0.24,0.005-0.36,0.019c-0.933,0.074-1.677,0.476-2.235,1.195
				c-0.621,0.815-0.938,1.912-0.938,3.305v7.874h-5.076V16.8h5.076v3.06h0.069c0.78-2.166,2.164-3.282,4.151-3.349
				c0.065-0.004,0.128-0.004,0.196-0.004l0.686,0.008L191.837,20.897z"/>
			<path fill="#B11318" d="M176.619,33.088c-0.753,0.395-1.883,0.592-3.394,0.592c-3.579,0-5.377-1.861-5.377-5.58v-7.549h-2.673
				V16.8h2.673v-3.554l5.069-1.451V16.8h3.703v3.752h-3.703v6.654c0,1.724,0.682,2.581,2.044,2.581c0.537,0,1.094-0.157,1.659-0.465
				V33.088z"/>
			<path fill="#B11318" d="M207.347,18.705c-1.553-1.539-3.705-2.308-6.436-2.308c-2.782,0-4.984,0.769-6.614,2.308
				c-1.634,1.539-2.447,3.674-2.447,6.401c0,2.638,0.786,4.73,2.357,6.269c1.573,1.536,3.727,2.305,6.474,2.305
				c2.793,0,4.994-0.791,6.596-2.378c1.603-1.587,2.404-3.752,2.404-6.489C209.68,22.285,208.899,20.244,207.347,18.705
				 M200.848,29.785c-2.555,0-3.836-1.581-3.836-4.747c0-1.508,0.335-2.677,1.004-3.508c0.661-0.826,1.595-1.238,2.8-1.238
				c2.458,0,3.682,1.54,3.682,4.623C204.498,28.159,203.28,29.785,200.848,29.785"/>
			<rect x="212.364" y="7.864" fill="#B11318" width="5.083" height="25.389"/>
		</g>
	</g>
</g>
</svg>
