[
    {
        "_id": "5ae8a4ca3774174afbdee821",
        "created": 1544220000000,
        "updated": 1544220000000,
        "authorId": "5c20ae4212ac5d56d130d2d0",
        "name": "Regex",
        "pathName": "regular-expressions",
        "isProject": false,
        "thumbnail": "/thumbnails/open-book.png",
        "description": "Regular expressions",
        "blocksOrder": [
            {
                "type": "Text",
                "blockId": "5d84e6d7ed6f41cfa67ba93b",
                "order": 0
            }
        ]
    },
    {
        "_id": "5aef3d81ff5a38d99e43088b",
        "created": 1544220000000,
        "updated": 1544220000000,
        "authorId": "5c20ae4212ac5d56d130d2d0",
        "name": "Prototype",
        "pathName": "prototype-inheritance",
        "isProject": false,
        "thumbnail": "/thumbnails/open-book.png",
        "description": "Prototype inheritance",
        "blocksOrder": [
            {
                "type": "Text",
                "blockId": "5d84e6d7ed6f41cfa67ba93b",
                "order": 0
            }
        ]
    },
    {
        "_id": "5aef3e64aee4ad43725933b0",
        "created": 1544220000000,
        "updated": 1544220000000,
        "authorId": "5c20ae4212ac5d56d130d2d0",
        "name": "DOM",
        "pathName": "document-object-model",
        "isProject": false,
        "thumbnail": "/thumbnails/open-book.png",
        "description": "Document Object Model",
        "blocksOrder": [
            {
                "type": "Text",
                "blockId": "5d84e6d7ed6f41cfa67ba93b",
                "order": 0
            }
        ]
    },
    {
        "_id": "5aef3e7526c003a47d63d49c",
        "created": 1544220000000,
        "updated": 1544220000000,
        "authorId": "5c20ae4212ac5d56d130d2d0",
        "name": "Variables",
        "pathName": "storing-values-using-variables",
        "isProject": false,
        "thumbnail": "/thumbnails/open-book.png",
        "description": "Storing values using variables",
        "blocksOrder": [
            {
                "type": "Text",
                "blockId": "5d84e6d7ed6f41cfa67ba93b",
                "order": 0
            }
        ]
    },
    {
        "_id": "5aef3e7c24f2637379c37082",
        "created": 1544220000000,
        "updated": 1544220000000,
        "authorId": "5c20ae4212ac5d56d130d2d0",
        "name": "Scope",
        "pathName": "the-scope-of-the-variables",
        "isProject": false,
        "thumbnail": "/thumbnails/open-book.png",
        "description": "The scope of the variables",
        "blocksOrder": [
            {
                "type": "Text",
                "blockId": "5d84e6d7ed6f41cfa67ba93b",
                "order": 0
            }
        ]
    },
    {
        "_id": "5aef3e8601fc502a693a3c9b",
        "created": 1544220000000,
        "updated": 1544220000000,
        "authorId": "5c20ae4212ac5d56d130d2d0",
        "name": "Libraries",
        "pathName": "javascript-libraries-commonly-used-to-enhance-workflow",
        "isProject": false,
        "thumbnail": "/thumbnails/open-book.png",
        "description": "Javascript libraries commonly used to enhance workflow",
        "blocksOrder": [
            {
                "type": "Text",
                "blockId": "5d84e6d7ed6f41cfa67ba93b",
                "order": 0
            }
        ]
    },
    {
        "_id": "5aef3e8e7597acad1718ad82",
        "created": 1544220000000,
        "updated": 1544220000000,
        "authorId": "5c20ae4212ac5d56d130d2d0",
        "name": "Loops",
        "pathName": "iterating-over-arrays-or-properties-of-objects-using-loops",
        "isProject": false,
        "thumbnail": "/thumbnails/open-book.png",
        "description": "Iterating over arrays or properties of objects using loops",
        "blocksOrder": [
            {
                "type": "Text",
                "blockId": "5d84e6d7ed6f41cfa67ba93b",
                "order": 0
            }
        ]
    },
    {
        "_id": "5aef3eb0cec10595ae423a33",
        "created": 1544220000000,
        "updated": 1544220000000,
        "authorId": "5c20ae4212ac5d56d130d2d0",
        "name": "Async",
        "pathName": "asynchronous-operations-and-logic",
        "isProject": false,
        "thumbnail": "/thumbnails/open-book.png",
        "description": "Asynchronous operations and logic",
        "blocksOrder": [
            {
                "type": "Text",
                "blockId": "5d84e6d7ed6f41cfa67ba93b",
                "order": 0
            }
        ]
    },
    {
        "_id": "5aef3eb97d6b740b92af69c5",
        "created": 1544220000000,
        "updated": 1544220000000,
        "authorId": "5c20ae4212ac5d56d130d2d0",
        "name": "Events",
        "pathName": "delegating-tasks-to-other-parts-of-the-codebase-using-events",
        "isProject": false,
        "thumbnail": "/thumbnails/open-book.png",
        "description": "Delegating tasks to other parts of the codebase using events",
        "blocksOrder": [
            {
                "type": "Text",
                "blockId": "5d84e6d7ed6f41cfa67ba93b",
                "order": 0
            }
        ]
    },
    {
        "_id": "5aef3ec2c56fe44cf30d589d",
        "created": 1544220000000,
        "updated": 1544220000000,
        "authorId": "5c20ae4212ac5d56d130d2d0",
        "name": "Methods",
        "pathName": "executing-blocks-of-code-by-invoking-methods",
        "isProject": false,
        "thumbnail": "/thumbnails/open-book.png",
        "description": "Executing blocks of code by invoking methods",
        "blocksOrder": [
            {
                "type": "Text",
                "blockId": "5d84e6d7ed6f41cfa67ba93b",
                "order": 0
            }
        ]
    },
    {
        "_id": "5aef3ecaf58438a3439392de",
        "created": 1544220000000,
        "updated": 1544220000000,
        "authorId": "5c20ae4212ac5d56d130d2d0",
        "name": "Objects",
        "pathName": "storing-values-and-code-metods-together-in-objects",
        "isProject": false,
        "thumbnail": "/thumbnails/open-book.png",
        "description": "Storing values and code metods together in objects",
        "blocksOrder": [
            {
                "type": "Text",
                "blockId": "5d84e6d7ed6f41cfa67ba93b",
                "order": 0
            }
        ]
    },
    {
        "_id": "5aef3ed17a9a71edde6afc1d",
        "created": 1544220000000,
        "updated": 1544220000000,
        "authorId": "5c20ae4212ac5d56d130d2d0",
        "name": "Json",
        "pathName": "javascript-object-notation",
        "isProject": false,
        "thumbnail": "/thumbnails/open-book.png",
        "description": "Javascript Object Notation",
        "blocksOrder": [
            {
                "type": "Text",
                "blockId": "5d84e6d7ed6f41cfa67ba93b",
                "order": 0
            }
        ]
    },
    {
        "_id": "5d4082337f406b56e57161b0",
        "created": 1544220000000,
        "updated": 1544220000000,
        "authorId": "5c20ae4212ac5d56d130d2d0",
        "name": "Clock",
        "pathName": "clock",
        "isProject": true,
        "thumbnail": "/thumbnails/clock.png",
        "description": "Clock project Sample topic description for developing with bigger length",
        "blocksOrder": [
            {
                "type": "Text",
                "blockId": "5d84e6d7ed6f41cfa67ba93b",
                "order": 0
            }
        ]
    },
    {
        "_id": "5d4082a85ad6f1b3d98fd7ad",
        "created": 1544220000000,
        "updated": 1544220000000,
        "authorId": "5c20ae4212ac5d56d130d2d0",
        "name": "Tip Calculator",
        "pathName": "tip-calculator",
        "isProject": true,
        "thumbnail": "/thumbnails/calculator.png",
        "description": "Tip Calculator project",
        "blocksOrder": [
            {
                "type": "Text",
                "blockId": "5d84e6d7ed6f41cfa67ba93b",
                "order": 0
            }
        ]
    },
    {
        "_id": "5d4083c30726b12b802ef968",
        "created": 1544220000000,
        "updated": 1544220000000,
        "authorId": "5c20ae4212ac5d56d130d2d0",
        "name": "Interactive Map",
        "pathName": "interactive-map",
        "isProject": true,
        "thumbnail": "/thumbnails/open-book.png",
        "description": "Interactive map",
        "blocksOrder": [
            {
                "type": "Text",
                "blockId": "5d84e6d7ed6f41cfa67ba93b",
                "order": 0
            }
        ]
    }
]