{
    "verbose": false,
    "ext": "ts js json yaml",
    "watch": [
        "server/server.js",
        "server/**/*.yaml"
    ],
    "ignore": [],
    "exec": "node --inspect --require ./ts-hook.js ./api/server/server.js"
}