<svg width="24" height="24" xmlns="http://www.w3.org/2000/svg">

 <g>
  <title>background</title>
  <rect fill="none" id="canvas_background" height="402" width="582" y="-1" x="-1"/>
 </g>
 <g>
  <title>Layer 1</title>
  <path fill="#2196f3" id="svg_1" d="m22,20l-2,2l-6,-6l0,-2l2,0l6,6z"/>
  <path id="svg_2" d="m9,3a6,6 0 1 0 0,12a6,6 0 1 0 0,-12z" stroke-width="2" stroke-miterlimit="10" stroke="#2196f3" fill="none"/>
  <path id="svg_3" d="m13,13l2.5,2.5" stroke-miterlimit="10" stroke="#2196f3" fill="none"/>
 </g>
</svg>