[
    {
        "_id": "5e4d271e87ecc10ed796fb6d",
        "created": 1544220000000,
        "updated": 1544220000000,
        "authorId": "5c20ae4212ac5d56d130d2d0",
        "codeSnippets": [
            "5c2392d5b9f8afa48a980b57",
            "5e4d285049f5ad774e4cfcf5"
        ]
    }
]