<svg width="22" height="19" viewBox="0 0 22 19" fill="none" xmlns="http://www.w3.org/2000/svg">
<path fill-rule="evenodd" clip-rule="evenodd" d="M0 0C1.07876 0 2.15752 0 3.23628 0C3.23628 1.00092 3.23628 2.00184 3.23628 3.00276C2.15752 3.00276 1.07876 3.00276 0 3.00276C0 2.00184 0 1.00092 0 0ZM5.82014 0C11.2124 0 16.607 0 22 0C22 1.00092 22 2.00184 22 3.00276C16.607 3.00276 11.2124 3.00276 5.82014 3.00276C5.82014 2.00184 5.82014 1.00092 5.82014 0ZM0 7.99596C1.07876 7.99596 2.15752 7.99596 3.23628 7.99596C3.23628 8.9984 3.23628 10.0016 3.23628 11.004C2.15752 11.004 1.07876 11.004 0 11.004C0 10.0016 0 8.9984 0 7.99596ZM5.82014 7.99596C11.2124 7.99596 16.607 7.99596 22 7.99596C22 8.9984 22 10.0016 22 11.004C16.607 11.004 11.2124 11.004 5.82014 11.004C5.82014 10.0016 5.82014 8.9984 5.82014 7.99596ZM0 15.9972C1.07876 15.9972 2.15752 15.9972 3.23628 15.9972C3.23628 16.9982 3.23628 17.9991 3.23628 19C2.15752 19 1.07876 19 0 19C0 17.9991 0 16.9982 0 15.9972ZM5.82014 15.9972C11.2124 15.9972 16.607 15.9972 22 15.9972C22 16.9982 22 17.9991 22 19C16.607 19 11.2124 19 5.82014 19C5.82014 17.9991 5.82014 16.9982 5.82014 15.9972Z" fill="#CB1616"/>
</svg>
