[
    {
        "_id": "5ea715d392a335c5db28d1ba",
        "created": 1588008522091,
        "updated": 1588008522091,
        "authorId": "5c20ae4212ac5d56d130d2d0",
        "pathName": "the-ultimate-guide-to-tagging-prices",
        "name": "The ultimate guide to tagging prices. Now updated for 2020",
        "description": "Inspired by Jessie J, we've added a price tagging tutorial.",
        "image": "",
        "awards": 21,
        "reactions": 231,
        "milestone": "EDITOR'S CHOICE",
        "comments": 33,
        "newComments": 6,
        "codeLines": 542,
        "technologyStack": [
            {
                "name": "Angular",
                "icon": "angular.png"
            }
        ],
        "deprecated": true
    },
    {
        "_id": "5ea71ee172d634ee43e8b628",
        "created": 1588008522091,
        "updated": 1588008522091,
        "authorId": "5c20ae4212ac5d56d130d2d0",
        "pathName": "the-ethical-hacking-guide-with-kali-linux",
        "name": "The ethical hacking guide with Kali Linux",
        "description": "This is our guide for penetration testing, network security and ethical hacking.",
        "image": "",
        "awards": 34,
        "reactions": 512,
        "milestone": "HIGHEST RATED",
        "comments": 22,
        "newComments": 4,
        "codeLines": 412,
        "technologyStack": [
            {
                "name": "react",
                "icon": "react.png"
            }
        ],
        "deprecated": false
    },
    {
        "_id": "5ea71fff23c54ecb43aac431",
        "created": 1588008522091,
        "updated": 1588008522091,
        "authorId": "5c20ae4212ac5d56d130d2d0",
        "pathName": "backdoor-into-android-systems-by-deploying-payloads",
        "name": "Backdoor into Android systems by deploying payloads",
        "description": "Learn to bypass any security system and access any data on any Android device.",
        "image": "",
        "awards": 1,
        "reactions": 12,
        "milestone": "PACKAGE",
        "comments": 10,
        "newComments": 1,
        "codeLines": 386,
        "technologyStack": [
            {
                "name": "react",
                "icon": "react.png"
            }
        ],
        "deprecated": false
    }
]