[
    {
        "_id": "5d39459e5dd88fcc04586ebf",
        "created": 1544220000000,
        "updated": 1544220000000,
        "authorId": "5c20ae4212ac5d56d130d2d0",
        "name": "Classes",
        "pathName": "implementing-classes",
        "isProject": false,
        "thumbnail": "/thumbnails/open-book.png",
        "description": "Class theory using Javascript",
        "blocksOrder": [
            {
                "type": "Text",
                "blockId": "5d84e6d7ed6f41cfa67ba93b",
                "order": 0
            }
        ]
    },
    {
        "_id": "5d3956982b2e686896208d3d",
        "created": 1544220000000,
        "updated": 1544220000000,
        "authorId": "5c20ae4212ac5d56d130d2d0",
        "name": "Prototype",
        "pathName": "implementing-prototype",
        "isProject": false,
        "thumbnail": "/thumbnails/open-book.png",
        "description": "Prototype theory using Javascript",
        "blocksOrder": [
            {
                "type": "Text",
                "blockId": "5d84e6d7ed6f41cfa67ba93b",
                "order": 0
            }
        ]
    },
    {
        "_id": "5d3956f971d7483e42d2da0b",
        "created": 1544220000000,
        "updated": 1544220000000,
        "authorId": "5c20ae4212ac5d56d130d2d0",
        "name": "Encapsulation",
        "pathName": "implementing-encapsulation",
        "isProject": false,
        "thumbnail": "/thumbnails/open-book.png",
        "description": "Encapsulation theory using Javascript",
        "blocksOrder": [
            {
                "type": "Text",
                "blockId": "5d84e6d7ed6f41cfa67ba93b",
                "order": 0
            }
        ]
    },
    {
        "_id": "5d395768c04ee83bf038b4be",
        "created": 1544220000000,
        "updated": 1544220000000,
        "authorId": "5c20ae4212ac5d56d130d2d0",
        "name": "Composition",
        "pathName": "implementing-composition",
        "isProject": false,
        "thumbnail": "/thumbnails/open-book.png",
        "description": "Composition theory using Javascript",
        "blocksOrder": [
            {
                "type": "Text",
                "blockId": "5d84e6d7ed6f41cfa67ba93b",
                "order": 0
            }
        ]
    },
    {
        "_id": "5d3957c09be91d0ea9fe4579",
        "created": 1544220000000,
        "updated": 1544220000000,
        "authorId": "5c20ae4212ac5d56d130d2d0",
        "name": "Inheritance",
        "pathName": "implementing-inheritance",
        "isProject": false,
        "thumbnail": "/thumbnails/open-book.png",
        "description": "Inheritance theory using Javascript",
        "blocksOrder": [
            {
                "type": "Text",
                "blockId": "5d84e6d7ed6f41cfa67ba93b",
                "order": 0
            }
        ]
    },
    {
        "_id": "5d395816d78251f4403380e2",
        "created": 1544220000000,
        "updated": 1544220000000,
        "authorId": "5c20ae4212ac5d56d130d2d0",
        "name": "Delegation",
        "pathName": "implementing-delegation",
        "isProject": false,
        "thumbnail": "/thumbnails/open-book.png",
        "description": "Delegation theory using Javascript",
        "blocksOrder": [
            {
                "type": "Text",
                "blockId": "5d84e6d7ed6f41cfa67ba93b",
                "order": 0
            }
        ]
    },
    {
        "_id": "5d395867bad2b16edcee22d2",
        "created": 1544220000000,
        "updated": 1544220000000,
        "authorId": "5c20ae4212ac5d56d130d2d0",
        "name": "Polymorphism",
        "pathName": "implementing-polymorphism",
        "isProject": false,
        "thumbnail": "/thumbnails/open-book.png",
        "description": "Polymorphism theory using Javascript",
        "blocksOrder": [
            {
                "type": "Text",
                "blockId": "5d84e6d7ed6f41cfa67ba93b",
                "order": 0
            }
        ]
    },
    {
        "_id": "5d39590a7b7945de1908982d",
        "created": 1544220000000,
        "updated": 1544220000000,
        "authorId": "5c20ae4212ac5d56d130d2d0",
        "name": "Open Recursion",
        "pathName": "implementing-open-recursion",
        "isProject": false,
        "thumbnail": "/thumbnails/open-book.png",
        "description": "Open Recursion theory using Javascript",
        "blocksOrder": [
            {
                "type": "Text",
                "blockId": "5d84e6d7ed6f41cfa67ba93b",
                "order": 0
            }
        ]
    },
    {
        "_id": "5d395966f3b200532104e1d3",
        "created": 1544220000000,
        "updated": 1544220000000,
        "authorId": "5c20ae4212ac5d56d130d2d0",
        "name": "Design Patterns",
        "pathName": "implementing-design-patterns",
        "isProject": false,
        "thumbnail": "/thumbnails/open-book.png",
        "description": "Design Patterns theory using Javascript",
        "blocksOrder": [
            {
                "type": "Text",
                "blockId": "5d84e6d7ed6f41cfa67ba93b",
                "order": 0
            }
        ]
    }
]