[
    {
        "_id": "5cbb205dca8da708b33e2410",
        "created": 1544220000000,
        "updated": 1544220000000,
        "authorId": "5c20ae4212ac5d56d130d2d0",
        "topicId": "5bf70ab679694f2d5b268312",
        "name": "Root",
        "pathName": "root",
        "isRoot": true,
        "childrenLevelsIds": [
            "5bf5d58a553ba0dc01ccd693",
            "5bf5d590d5a5eb2c52aedeb9",
            "5bf5d5a2f5ba44e11e776783",
            "5bf5d5a810c456c2b50980cd",
            "5bf5d5ad285a2d0934f544aa",
            "5bf5d57bc9fac78ca21e88f5"
        ]
    },
    {
        "_id": "5bf70cea351df02fd36c879c",
        "created": 1544220000000,
        "updated": 1544220000000,
        "authorId": "5c20ae4212ac5d56d130d2d0",
        "topicId": "5bf70ab679694f2d5b268312",
        "name": "Html",
        "pathName": "html",
        "isRoot": false,
        "childrenLevelsIds": [
            "5bf710c107a684b81bf8f242",
            "5bf710c9c5cec2d5524f2e00",
            "5bf710d04260b522ec7c6e52",
            "5bf710d7df968ad6e710b5b4",
            "5bf710e0ae748e94fb606901",
            "5bf710e9bab448c4ec11ba0e",
            "5bf710f3d4e5b041b550b77f",
            "5bf710fa572f7914788c2f22",
            "5bf711008ff17a77c2e3b44e",
            "5bf71106702a0ecfbada5848"
        ]
    },
    {
        "_id": "5bf70cf41ca3d8778a3d4459",
        "created": 1544220000000,
        "updated": 1544220000000,
        "authorId": "5c20ae4212ac5d56d130d2d0",
        "topicId": "5bf70b3a1424239feae220be",
        "name": "CSS",
        "pathName": "css",
        "isRoot": false,
        "childrenLevelsIds": [
            "5d395d100da774b0387b6f3d",
            "5d395d11ebed02e1752911cb",
            "5d395d12b4a5024673c6d83a",
            "5d395d12467fb5392617608e",
            "5d395d132a4134f9e7bbc431",
            "5d395d140256a929dbdaae24"
        ]
    },
    {
        "_id": "5bf70d0712854d12199a1d6e",
        "created": 1544220000000,
        "updated": 1544220000000,
        "authorId": "5c20ae4212ac5d56d130d2d0",
        "topicId": "5bf70b54b0f820dac96f41d4",
        "name": "Javascript",
        "pathName": "javascript",
        "isRoot": false
    },
    {
        "_id": "5bf70d0e85c55f0b5974fc6e",
        "created": 1544220000000,
        "updated": 1544220000000,
        "authorId": "5c20ae4212ac5d56d130d2d0",
        "topicId": "5bf70b5ccea865b3d17eabd1",
        "name": "Graphics",
        "pathName": "graphics",
        "isRoot": false
    },
    {
        "_id": "5bf70d15a0bc186d5eec8f84",
        "created": 1544220000000,
        "updated": 1544220000000,
        "authorId": "5c20ae4212ac5d56d130d2d0",
        "topicId": "5bf70b82ef810b3e475f9abe",
        "name": "Libraries",
        "pathName": "libraries",
        "isRoot": false
    },
    {
        "_id": "5bf70d2176876ad924e4d873",
        "created": 1544220000000,
        "updated": 1544220000000,
        "authorId": "5c20ae4212ac5d56d130d2d0",
        "topicId": "5bf70b99dc327398ffa3befc",
        "name": "Single Page Apps",
        "pathName": "single-page-apps",
        "isRoot": false
    },
    {
        "_id": "5bf70d28ebf5dfc99e811fac",
        "created": 1544220000000,
        "updated": 1544220000000,
        "authorId": "5c20ae4212ac5d56d130d2d0",
        "topicId": "5bf70bdd6947e9cdc23ca5f5",
        "name": "Tools",
        "pathName": "tools",
        "isRoot": false
    },
    {
        "_id": "5bf70d2f976ab83096c9f91e",
        "created": 1544220000000,
        "updated": 1544220000000,
        "authorId": "5c20ae4212ac5d56d130d2d0",
        "topicId": "5bf70bf6c5e24bedcf48834d",
        "name": "Testing",
        "pathName": "testing",
        "isRoot": false
    },
    {
        "_id": "5bf70d347e837f906d2da4ca",
        "created": 1544220000000,
        "updated": 1544220000000,
        "authorId": "5c20ae4212ac5d56d130d2d0",
        "topicId": "5bf70c2386525388c4161637",
        "name": "Performance",
        "pathName": "performance",
        "isRoot": false
    },
    {
        "_id": "5bf5d57bc9fac78ca21e88f5",
        "created": 1544220000000,
        "updated": 1544220000000,
        "authorId": "5c20ae4212ac5d56d130d2d0",
        "topicId": "5bf5d31538db5eead4562fcb",
        "name": "Backend",
        "pathName": "backend",
        "isRoot": false
    },
    {
        "_id": "5bf5d58a553ba0dc01ccd693",
        "created": 1544220000000,
        "updated": 1544220000000,
        "authorId": "5c20ae4212ac5d56d130d2d0",
        "topicId": "5bf5d38d1c89dac133b6c446",
        "name": "Frontend",
        "pathName": "frontend",
        "isRoot": false,
        "childrenLevelsIds": [
            "5bf70cea351df02fd36c879c",
            "5bf70cf41ca3d8778a3d4459",
            "5bf70d0712854d12199a1d6e",
            "5bf70d0e85c55f0b5974fc6e",
            "5bf70d15a0bc186d5eec8f84",
            "5bf70d2176876ad924e4d873",
            "5bf70d28ebf5dfc99e811fac",
            "5bf70d2f976ab83096c9f91e",
            "5bf70d347e837f906d2da4ca"
        ]
    },
    {
        "_id": "5bf5d590d5a5eb2c52aedeb9",
        "created": 1544220000000,
        "updated": 1544220000000,
        "authorId": "5c20ae4212ac5d56d130d2d0",
        "topicId": "5bf5d3c0480485b09f6cd419",
        "name": "Design",
        "pathName": "design",
        "isRoot": false
    },
    {
        "_id": "5bf5d5960082545a0cd6b80a",
        "created": 1544220000000,
        "updated": 1544220000000,
        "authorId": "5c20ae4212ac5d56d130d2d0",
        "topicId": "5bf5d3e6ed518a2408ce4ce0",
        "name": "Search Engine Optimization",
        "pathName": "search-engine-optimization",
        "isRoot": false
    },
    {
        "_id": "5bf5d59c835d3b269dc1b43e",
        "created": 1544220000000,
        "updated": 1544220000000,
        "authorId": "5c20ae4212ac5d56d130d2d0",
        "topicId": "5bf5d4183d622c24ca9262b9",
        "name": "Game Development",
        "pathName": "game-development",
        "isRoot": false
    },
    {
        "_id": "5bf5d5a2f5ba44e11e776783",
        "created": 1544220000000,
        "updated": 1544220000000,
        "authorId": "5c20ae4212ac5d56d130d2d0",
        "topicId": "5bf5d45bde0d926a154ad020",
        "name": "Security",
        "pathName": "security",
        "isRoot": false
    },
    {
        "_id": "5bf5d5a810c456c2b50980cd",
        "created": 1544220000000,
        "updated": 1544220000000,
        "authorId": "5c20ae4212ac5d56d130d2d0",
        "topicId": "5bf5d481c2c3783563e4cdb4",
        "name": "Devops",
        "pathName": "devops",
        "isRoot": false
    },
    {
        "_id": "5bf5d5ad285a2d0934f544aa",
        "created": 1544220000000,
        "updated": 1544220000000,
        "authorId": "5c20ae4212ac5d56d130d2d0",
        "topicId": "5bf5d4a81d00d4d6ad8c2fba",
        "name": "Marketing",
        "pathName": "marketing",
        "isRoot": false
    },
    {
        "_id": "5bf710c107a684b81bf8f242",
        "created": 1544220000000,
        "updated": 1544220000000,
        "authorId": "5c20ae4212ac5d56d130d2d0",
        "topicId": "5bf70e7b062bafbc1ae932ec",
        "name": "Basic Javascript",
        "pathName": "basic-javascript",
        "isRoot": false,
        "childrenLevelsIDs": [],
        "childrenTopicsIds": [
            "5ade44aaf2cc780d069bd847",
            "5ae8a4ca3774174afbdee821",
            "5aef3d81ff5a38d99e43088b",
            "5aef3e64aee4ad43725933b0",
            "5aef3e7526c003a47d63d49c",
            "5aef3e7c24f2637379c37082",
            "5aef3e8601fc502a693a3c9b",
            "5aef3e8e7597acad1718ad82",
            "5aef3eb0cec10595ae423a33",
            "5aef3eb97d6b740b92af69c5",
            "5aef3ec2c56fe44cf30d589d",
            "5aef3ecaf58438a3439392de",
            "5aef3ed17a9a71edde6afc1d",
            "5d4082337f406b56e57161b0",
            "5d4082a85ad6f1b3d98fd7ad",
            "5d4083c30726b12b802ef968"
        ]
    },
    {
        "_id": "5bf710c9c5cec2d5524f2e00",
        "created": 1544220000000,
        "updated": 1544220000000,
        "authorId": "5c20ae4212ac5d56d130d2d0",
        "topicId": "5bf70e9a9c15fb1f6ec06d7b",
        "name": "Loops",
        "pathName": "loops",
        "isRoot": false
    },
    {
        "_id": "5bf710d04260b522ec7c6e52",
        "created": 1544220000000,
        "updated": 1544220000000,
        "authorId": "5c20ae4212ac5d56d130d2d0",
        "topicId": "5bf70eb6dfb3a2a7c0ba1443",
        "name": "Asynchronous",
        "pathName": "asynchronous",
        "isRoot": false
    },
    {
        "_id": "5bf710d7df968ad6e710b5b4",
        "created": 1544220000000,
        "updated": 1544220000000,
        "authorId": "5c20ae4212ac5d56d130d2d0",
        "topicId": "5bf70eda75d2716753d5c716",
        "name": "OOP",
        "pathName": "oop",
        "isRoot": false,
        "childrenTopicsIds": [
            "5d39459e5dd88fcc04586ebf",
            "5d3956982b2e686896208d3d",
            "5d3956f971d7483e42d2da0b",
            "5d395768c04ee83bf038b4be",
            "5d3957c09be91d0ea9fe4579",
            "5d395816d78251f4403380e2",
            "5d395867bad2b16edcee22d2",
            "5d39590a7b7945de1908982d",
            "5d395966f3b200532104e1d3"
        ]
    },
    {
        "_id": "5bf710e0ae748e94fb606901",
        "created": 1544220000000,
        "updated": 1544220000000,
        "authorId": "5c20ae4212ac5d56d130d2d0",
        "topicId": "5bf70ef6dbd92682b38af303",
        "name": "Functional",
        "pathName": "functional",
        "isRoot": false
    },
    {
        "_id": "5bf710e9bab448c4ec11ba0e",
        "created": 1544220000000,
        "updated": 1544220000000,
        "authorId": "5c20ae4212ac5d56d130d2d0",
        "topicId": "5bf70f7f11591d80a88c24c9",
        "name": "ES6",
        "pathName": "es6",
        "isRoot": false
    },
    {
        "_id": "5bf710f3d4e5b041b550b77f",
        "created": 1544220000000,
        "updated": 1544220000000,
        "authorId": "5c20ae4212ac5d56d130d2d0",
        "topicId": "5bf70fa0d67abea904d414e2",
        "name": "APIs",
        "pathName": "apis",
        "isRoot": false
    },
    {
        "_id": "5bf710fa572f7914788c2f22",
        "created": 1544220000000,
        "updated": 1544220000000,
        "authorId": "5c20ae4212ac5d56d130d2d0",
        "topicId": "5bf70fbc843aaea61a2c70a8",
        "name": "Web Components",
        "pathName": "web-components",
        "isRoot": false
    },
    {
        "_id": "5bf711008ff17a77c2e3b44e",
        "created": 1544220000000,
        "updated": 1544220000000,
        "authorId": "5c20ae4212ac5d56d130d2d0",
        "topicId": "5bf70fde11f3b120bdcb538b",
        "name": "Modules",
        "pathName": "modules",
        "isRoot": false
    },
    {
        "_id": "5bf71106702a0ecfbada5848",
        "created": 1544220000000,
        "updated": 1544220000000,
        "authorId": "5c20ae4212ac5d56d130d2d0",
        "topicId": "5bf70ffed89b66308515b89e",
        "name": "Debugging",
        "pathName": "debugging",
        "isRoot": false
    },
    {
        "_id": "5d395d100da774b0387b6f3d",
        "created": 1544220000000,
        "updated": 1544220000000,
        "authorId": "5c20ae4212ac5d56d130d2d0",
        "topicId": "5d395d8ced0430234c479522",
        "name": "Containers",
        "pathName": "containers",
        "isRoot": false,
        "childrenTopicsIds": [
            "5d3964a8f87ad94e49666a37",
            "5d3964a925682a6c8ea4bcb9",
            "5d3964aac1f53f1e75b7c32d",
            "5d3964aa58389ecec8ed957e",
            "5d3964ababd776292a32f496"
        ]
    },
    {
        "_id": "5d395d11ebed02e1752911cb",
        "created": 1544220000000,
        "updated": 1544220000000,
        "authorId": "5c20ae4212ac5d56d130d2d0",
        "topicId": "5d395d8d392c56b84c750767",
        "name": "Panels",
        "pathName": "panels",
        "isRoot": false,
        "childrenTopicsIds": [
            "5d4bfdcb70d893ce50ff6ebb",
            "5d4bfdcc0990e0b83952e669",
            "5d4bfdcdefed531523a2568f",
            "5d4bfdce108a9935cc35fe62",
            "5d4bfdcfe017237b35afe74e",
            "5d4bfdd052394f508448b8a0",
            "5d4bfdd1ea346a61ce7c989e",
            "5d4bfdd2a595e0b99705ebc5",
            "5d4c032e0a2601abd54bc3be",
            "5d4c032f7d1a2e20562aa519",
            "5d4c0330ef9d9c4d4508986d",
            "5d4c0330f05e793ab0ea478b",
            "5d4c03310a5b9ef40025e89b"
        ]
    },
    {
        "_id": "5d395d12b4a5024673c6d83a",
        "created": 1544220000000,
        "updated": 1544220000000,
        "authorId": "5c20ae4212ac5d56d130d2d0",
        "topicId": "5d395d8dfceb97a9cea7ac40",
        "name": "Cards",
        "pathName": "cards",
        "isRoot": false
    },
    {
        "_id": "5d395d12467fb5392617608e",
        "created": 1544220000000,
        "updated": 1544220000000,
        "authorId": "5c20ae4212ac5d56d130d2d0",
        "topicId": "5d395d8e1869a7bfc8875ac8",
        "name": "Paddings",
        "pathName": "paddings",
        "isRoot": false
    },
    {
        "_id": "5d395d132a4134f9e7bbc431",
        "created": 1544220000000,
        "updated": 1544220000000,
        "authorId": "5c20ae4212ac5d56d130d2d0",
        "topicId": "5d395d8ee012eb12f2e5c89f",
        "name": "Margins",
        "pathName": "margins",
        "isRoot": false,
        "childrenTopicsIds": [
            "5d4d08c65933e9c23662797a",
            "5d4d08c706ad2be787dc605a"
        ]
    },
    {
        "_id": "5d395d140256a929dbdaae24",
        "created": 1544220000000,
        "updated": 1544220000000,
        "authorId": "5c20ae4212ac5d56d130d2d0",
        "topicId": "5d395d8fbff7ab054630401a",
        "name": "Buttons",
        "pathName": "buttons",
        "isRoot": false,
        "childrenTopicsIds": [
            "5d3967dad490ce60134749df",
            "5d3967da83c8ed62a4a9ce9e",
            "5d3967db24db3668ad1c345c",
            "5d3967dcc601fa33cf30fc76",
            "5d3967dc279094705597d014",
            "5d3967dd0b0ba902788453c2",
            "5d3967def9d92ee3d23b8b42",
            "5d3967dfb0aacdb187e44e84",
            "5d3967dfa546e8b2394a0bec",
            "5d3967e0fee0d703531feace",
            "5d407de693f2f64ccab37540",
            "5d407eb2689e2843c91b4b2f",
            "5d408019a5aa288b51af25f9",
            "5d408099a34dc799d999684d"
        ]
    }
]