[
    {
        "_id": "5d395d8ced0430234c479522",
        "created": 1544220000000,
        "updated": 1544220000000,
        "authorId": "5c20ae4212ac5d56d130d2d0",
        "name": "Containers",
        "pathName": "containers",
        "isProject": false,
        "thumbnail": "/thumbnails/open-book.png",
        "description": "Containers",
        "blocksOrder": [
            {
                "type": "Text",
                "blockId": "5d84e6d7ed6f41cfa67ba93b",
                "order": 0
            }
        ]
    },
    {
        "_id": "5d395d8d392c56b84c750767",
        "created": 1544220000000,
        "updated": 1544220000000,
        "authorId": "5c20ae4212ac5d56d130d2d0",
        "name": "Panels",
        "pathName": "panels",
        "isProject": false,
        "thumbnail": "/thumbnails/open-book.png",
        "description": "Panels",
        "blocksOrder": [
            {
                "type": "Text",
                "blockId": "5d84e6d7ed6f41cfa67ba93b",
                "order": 0
            }
        ]
    },
    {
        "_id": "5d395d8dfceb97a9cea7ac40",
        "created": 1544220000000,
        "updated": 1544220000000,
        "authorId": "5c20ae4212ac5d56d130d2d0",
        "name": "Cards",
        "pathName": "cards",
        "isProject": false,
        "thumbnail": "/thumbnails/open-book.png",
        "description": "Cards",
        "blocksOrder": [
            {
                "type": "Text",
                "blockId": "5d84e6d7ed6f41cfa67ba93b",
                "order": 0
            }
        ]
    },
    {
        "_id": "5d395d8e1869a7bfc8875ac8",
        "created": 1544220000000,
        "updated": 1544220000000,
        "authorId": "5c20ae4212ac5d56d130d2d0",
        "name": "Paddings",
        "pathName": "paddings",
        "isProject": false,
        "thumbnail": "/thumbnails/open-book.png",
        "description": "Paddings",
        "blocksOrder": [
            {
                "type": "Text",
                "blockId": "5d84e6d7ed6f41cfa67ba93b",
                "order": 0
            }
        ]
    },
    {
        "_id": "5d395d8ee012eb12f2e5c89f",
        "created": 1544220000000,
        "updated": 1544220000000,
        "authorId": "5c20ae4212ac5d56d130d2d0",
        "name": "Margins",
        "pathName": "margins",
        "isProject": false,
        "thumbnail": "/thumbnails/open-book.png",
        "description": "Margins",
        "blocksOrder": [
            {
                "type": "Text",
                "blockId": "5d84e6d7ed6f41cfa67ba93b",
                "order": 0
            }
        ]
    },
    {
        "_id": "5d395d8fbff7ab054630401a",
        "created": 1544220000000,
        "updated": 1544220000000,
        "authorId": "5c20ae4212ac5d56d130d2d0",
        "name": "Buttons",
        "pathName": "buttons",
        "isProject": false,
        "thumbnail": "/thumbnails/open-book.png",
        "description": "Buttons",
        "blocksOrder": [
            {
                "type": "Text",
                "blockId": "5d84e6d7ed6f41cfa67ba93b",
                "order": 0
            }
        ]
    }
]