[
    {
        "_id": "5d3967dad490ce60134749df",
        "created": 1544220000000,
        "updated": 1544220000000,
        "authorId": "5c20ae4212ac5d56d130d2d0",
        "name": "Button Classes",
        "pathName": "button-classes",
        "isProject": false,
        "thumbnail": "/thumbnails/open-book.png",
        "description": "Button Classes",
        "blocksOrder": [
            {
                "type": "Text",
                "blockId": "5d84e6d7ed6f41cfa67ba93b",
                "order": 0
            }
        ]
    },
    {
        "_id": "5d3967da83c8ed62a4a9ce9e",
        "created": 1544220000000,
        "updated": 1544220000000,
        "authorId": "5c20ae4212ac5d56d130d2d0",
        "name": "Colors",
        "pathName": "button-colors",
        "isProject": false,
        "thumbnail": "/thumbnails/open-book.png",
        "description": "Button Colors",
        "blocksOrder": [
            {
                "type": "Text",
                "blockId": "5d84e6d7ed6f41cfa67ba93b",
                "order": 0
            }
        ]
    },
    {
        "_id": "5d3967db24db3668ad1c345c",
        "created": 1544220000000,
        "updated": 1544220000000,
        "authorId": "5c20ae4212ac5d56d130d2d0",
        "name": "Hover",
        "pathName": "button-hover",
        "isProject": false,
        "thumbnail": "/thumbnails/open-book.png",
        "description": "Hover",
        "blocksOrder": [
            {
                "type": "Text",
                "blockId": "5d84e6d7ed6f41cfa67ba93b",
                "order": 0
            }
        ]
    },
    {
        "_id": "5d3967dcc601fa33cf30fc76",
        "created": 1544220000000,
        "updated": 1544220000000,
        "authorId": "5c20ae4212ac5d56d130d2d0",
        "name": "Shapes",
        "pathName": "button-shapes",
        "isProject": false,
        "thumbnail": "/thumbnails/open-book.png",
        "description": "Shapes",
        "blocksOrder": [
            {
                "type": "Text",
                "blockId": "5d84e6d7ed6f41cfa67ba93b",
                "order": 0
            }
        ]
    },
    {
        "_id": "5d3967dc279094705597d014",
        "created": 1544220000000,
        "updated": 1544220000000,
        "authorId": "5c20ae4212ac5d56d130d2d0",
        "name": "Sizes",
        "pathName": "button-sizes",
        "isProject": false,
        "thumbnail": "/thumbnails/open-book.png",
        "description": "Sizes",
        "blocksOrder": [
            {
                "type": "Text",
                "blockId": "5d84e6d7ed6f41cfa67ba93b",
                "order": 0
            }
        ]
    },
    {
        "_id": "5d3967dd0b0ba902788453c2",
        "created": 1544220000000,
        "updated": 1544220000000,
        "authorId": "5c20ae4212ac5d56d130d2d0",
        "name": "Borders",
        "pathName": "button-borders",
        "isProject": false,
        "thumbnail": "/thumbnails/open-book.png",
        "description": "Borders",
        "blocksOrder": [
            {
                "type": "Text",
                "blockId": "5d84e6d7ed6f41cfa67ba93b",
                "order": 0
            }
        ]
    },
    {
        "_id": "5d3967def9d92ee3d23b8b42",
        "created": 1544220000000,
        "updated": 1544220000000,
        "authorId": "5c20ae4212ac5d56d130d2d0",
        "name": "Disabled",
        "pathName": "button-disabled",
        "isProject": false,
        "thumbnail": "/thumbnails/open-book.png",
        "description": "Disabled",
        "blocksOrder": [
            {
                "type": "Text",
                "blockId": "5d84e6d7ed6f41cfa67ba93b",
                "order": 0
            }
        ]
    },
    {
        "_id": "5d3967dfb0aacdb187e44e84",
        "created": 1544220000000,
        "updated": 1544220000000,
        "authorId": "5c20ae4212ac5d56d130d2d0",
        "name": "Ripple effects",
        "pathName": "button-ripple-effects",
        "isProject": false,
        "thumbnail": "/thumbnails/open-book.png",
        "description": "Ripple effects",
        "blocksOrder": [
            {
                "type": "Text",
                "blockId": "5d84e6d7ed6f41cfa67ba93b",
                "order": 0
            }
        ]
    },
    {
        "_id": "5d3967dfa546e8b2394a0bec",
        "created": 1544220000000,
        "updated": 1544220000000,
        "authorId": "5c20ae4212ac5d56d130d2d0",
        "name": "Circular",
        "pathName": "button-circular",
        "isProject": false,
        "thumbnail": "/thumbnails/open-book.png",
        "description": "Circular",
        "blocksOrder": [
            {
                "type": "Text",
                "blockId": "5d84e6d7ed6f41cfa67ba93b",
                "order": 0
            }
        ]
    },
    {
        "_id": "5d3967e0fee0d703531feace",
        "created": 1544220000000,
        "updated": 1544220000000,
        "authorId": "5c20ae4212ac5d56d130d2d0",
        "name": "Any Element as Button",
        "pathName": "button-any-element",
        "isProject": false,
        "thumbnail": "/thumbnails/open-book.png",
        "description": "Any Element as Button",
        "blocksOrder": [
            {
                "type": "Text",
                "blockId": "5d84e6d7ed6f41cfa67ba93b",
                "order": 0
            }
        ]
    },
    {
        "_id": "5d407de693f2f64ccab37540",
        "created": 1544220000000,
        "updated": 1544220000000,
        "authorId": "5c20ae4212ac5d56d130d2d0",
        "name": "Fun Buttons",
        "pathName": "fun-buttons",
        "isProject": true,
        "thumbnail": "/thumbnails/arrow_button_grey.png",
        "description": "Fun buttons project",
        "blocksOrder": [
            {
                "type": "Text",
                "blockId": "5d84e6d7ed6f41cfa67ba93b",
                "order": 0
            }
        ]
    },
    {
        "_id": "5d407eb2689e2843c91b4b2f",
        "created": 1544220000000,
        "updated": 1544220000000,
        "authorId": "5c20ae4212ac5d56d130d2d0",
        "name": "Animated Buttons",
        "pathName": "animated-buttons",
        "isProject": true,
        "thumbnail": "/thumbnails/animated_grey.png",
        "description": "Animated buttons project",
        "blocksOrder": [
            {
                "type": "Text",
                "blockId": "5d84e6d7ed6f41cfa67ba93b",
                "order": 0
            }
        ]
    },
    {
        "_id": "5d408019a5aa288b51af25f9",
        "created": 1544220000000,
        "updated": 1544220000000,
        "authorId": "5c20ae4212ac5d56d130d2d0",
        "name": "Flash Cards",
        "pathName": "flash-cards",
        "isProject": true,
        "thumbnail": "/thumbnails/flash_cards_grey.png",
        "description": "Flash Cards project",
        "blocksOrder": [
            {
                "type": "Text",
                "blockId": "5d84e6d7ed6f41cfa67ba93b",
                "order": 0
            }
        ]
    },
    {
        "_id": "5d408099a34dc799d999684d",
        "created": 1544220000000,
        "updated": 1544220000000,
        "authorId": "5c20ae4212ac5d56d130d2d0",
        "name": "Minesweeper",
        "pathName": "minesweeper",
        "isProject": true,
        "thumbnail": "/thumbnails/minesweeper_grey.png",
        "description": "Minesweeper project",
        "blocksOrder": [
            {
                "type": "Text",
                "blockId": "5d84e6d7ed6f41cfa67ba93b",
                "order": 0
            }
        ]
    }
]