<svg xmlns="http://www.w3.org/2000/svg" width="16.258" height="25.341" viewBox="0 0 16.258 25.341">
  <path id="Path_2" data-name="Path 2" d="M1575.444,435.4,1564.5,446.383l10.944,10.812" transform="translate(-1560.957 -433.632)" fill="none" stroke="#101010" stroke-width="5" opacity="0.561"/>
</svg>
