<?xml version="1.0" encoding="UTF-8" standalone="no"?>
<!-- Created with Inkscape (http://www.inkscape.org/) -->

<svg
   xmlns:dc="http://purl.org/dc/elements/1.1/"
   xmlns:cc="http://creativecommons.org/ns#"
   xmlns:rdf="http://www.w3.org/1999/02/22-rdf-syntax-ns#"
   xmlns:svg="http://www.w3.org/2000/svg"
   xmlns="http://www.w3.org/2000/svg"
   xmlns:xlink="http://www.w3.org/1999/xlink"
   xmlns:sodipodi="http://sodipodi.sourceforge.net/DTD/sodipodi-0.dtd"
   xmlns:inkscape="http://www.inkscape.org/namespaces/inkscape"
   version="1.1"
   width="1280"
   height="720"
   id="svg3034"
   sodipodi:docname="GTK+_software_architecture_es.svg"
   inkscape:version="0.92.2 (5c3e80d, 2017-08-06)">
  <sodipodi:namedview
     pagecolor="#ffffff"
     bordercolor="#666666"
     borderopacity="1"
     objecttolerance="10"
     gridtolerance="10"
     guidetolerance="10"
     inkscape:pageopacity="0"
     inkscape:pageshadow="2"
     inkscape:window-width="1600"
     inkscape:window-height="841"
     id="namedview36"
     showgrid="false"
     inkscape:zoom="0.86178639"
     inkscape:cx="845.91728"
     inkscape:cy="362.72952"
     inkscape:window-x="0"
     inkscape:window-y="29"
     inkscape:window-maximized="1"
     inkscape:current-layer="layer1" />
  <defs
     id="defs3036">
    <linearGradient
       x1="62.962002"
       y1="433.59525"
       x2="62.962002"
       y2="159.63817"
       id="linearGradient4099"
       xlink:href="#linearGradient4093"
       gradientUnits="userSpaceOnUse" />
    <linearGradient
       id="linearGradient4093">
      <stop
         id="stop4095"
         style="stop-color:#6699cc;stop-opacity:1"
         offset="0" />
      <stop
         id="stop4097"
         style="stop-color:#b0d6ff;stop-opacity:1"
         offset="1" />
    </linearGradient>
    <linearGradient
       x1="62.962002"
       y1="433.59525"
       x2="62.962002"
       y2="159.63817"
       id="linearGradient3057"
       xlink:href="#linearGradient4093"
       gradientUnits="userSpaceOnUse"
       gradientTransform="translate(-1.0194757e-5,-2.6000976e-8)" />
  </defs>
  <metadata
     id="metadata3039">
    <rdf:RDF>
      <cc:Work
         rdf:about="">
        <dc:format>image/svg+xml</dc:format>
        <dc:type
           rdf:resource="http://purl.org/dc/dcmitype/StillImage" />
        <dc:title></dc:title>
        <dc:source>https://git.gnome.org/browse/gtk-web/plain/images/architecture.svg</dc:source>
      </cc:Work>
    </rdf:RDF>
  </metadata>
  <g
     id="layer1">
    <rect
       width="1275"
       height="555"
       x="2.5"
       y="2.5"
       id="rect3211"
       style="fill:url(#linearGradient3057);fill-opacity:1;stroke:#ffffff;stroke-width:5;stroke-miterlimit:4;stroke-opacity:1;stroke-dasharray:none" />
    <rect
       width="575"
       height="155"
       x="2.5"
       y="562.5"
       id="rect4081"
       style="fill:#aaaaaa;fill-opacity:1;stroke:#ffffff;stroke-width:5;stroke-miterlimit:4;stroke-opacity:1;stroke-dasharray:none" />
    <rect
       width="695"
       height="155"
       x="582.5"
       y="562.5"
       id="rect4083"
       style="fill:#aaaaaa;fill-opacity:1;stroke:#ffffff;stroke-width:5;stroke-miterlimit:4;stroke-opacity:1;stroke-dasharray:none" />
    <rect
       width="815"
       height="324.99997"
       x="232.5"
       y="232.50003"
       id="rect4023"
       style="fill:#e40000;fill-opacity:1;stroke:#ffffff;stroke-width:4.99999952;stroke-miterlimit:4;stroke-opacity:1;stroke-dasharray:none" />
    <rect
       width="230"
       height="155"
       x="462.50012"
       y="402.5"
       id="rect4035"
       style="fill:#7fe719;fill-opacity:1;stroke:#ffffff;stroke-width:5;stroke-miterlimit:4;stroke-opacity:1;stroke-dasharray:none" />
    <rect
       width="125"
       height="155"
       x="692.49988"
       y="402.5"
       id="rect4041"
       style="fill:#7fe719;fill-opacity:1;stroke:#ffffff;stroke-width:5;stroke-miterlimit:4;stroke-opacity:1;stroke-dasharray:none" />
    <text
       x="645.49023"
       y="130.32741"
       id="text4025"
       xml:space="preserve"
       style="font-style:normal;font-variant:normal;font-weight:bold;font-stretch:normal;font-size:56px;line-height:125%;font-family:Sans;-inkscape-font-specification:'Sans Bold';text-align:center;letter-spacing:0px;word-spacing:0px;writing-mode:lr-tb;text-anchor:middle;fill:#000000;fill-opacity:1;stroke:none"><tspan
         x="645.49023"
         y="130.32741"
         id="tspan4027">Aplicación GTK+</tspan><tspan
         x="645.49023"
         y="130.32741"
         id="tspan38" /></text>
    <text
       x="554.83789"
       y="321.5625"
       id="text4029"
       xml:space="preserve"
       style="font-size:56px;font-style:normal;font-variant:normal;font-weight:bold;font-stretch:normal;text-align:start;line-height:125%;letter-spacing:0px;word-spacing:0px;writing-mode:lr-tb;text-anchor:start;fill:#000000;fill-opacity:1;stroke:none;font-family:Sans;-inkscape-font-specification:Sans Bold"><tspan
         x="554.83789"
         y="321.5625"
         id="tspan4031">GTK+</tspan></text>
    <text
       x="507.34973"
       y="500.38477"
       id="text4051"
       xml:space="preserve"
       style="font-size:56px;font-style:normal;font-variant:normal;font-weight:bold;font-stretch:normal;text-align:start;line-height:125%;letter-spacing:0px;word-spacing:0px;writing-mode:lr-tb;text-anchor:start;fill:#000000;fill-opacity:1;stroke:none;font-family:Sans;-inkscape-font-specification:Sans Bold"><tspan
         x="507.34973"
         y="500.38477"
         id="tspan4053">GDK</tspan></text>
    <text
       x="693.76355"
       y="500.41211"
       id="text4055"
       xml:space="preserve"
       style="font-size:56px;font-style:normal;font-variant:normal;font-weight:bold;font-stretch:normal;text-align:start;line-height:125%;letter-spacing:0px;word-spacing:0px;writing-mode:lr-tb;text-anchor:start;fill:#000000;fill-opacity:1;stroke:none;font-family:Sans;-inkscape-font-specification:Sans Bold"><tspan
         x="693.76355"
         y="500.41211"
         id="tspan4057">ATK</tspan></text>
    <text
       x="207.62695"
       y="660.87695"
       id="text4063"
       xml:space="preserve"
       style="font-size:56px;font-style:normal;font-variant:normal;font-weight:bold;font-stretch:normal;text-align:start;line-height:125%;letter-spacing:0px;word-spacing:0px;writing-mode:lr-tb;text-anchor:start;fill:#000000;fill-opacity:1;stroke:none;font-family:Sans;-inkscape-font-specification:Sans Bold"><tspan
         x="207.62695"
         y="660.87695"
         id="tspan4065">Cairo</tspan></text>
    <text
       x="859.39844"
       y="660.87695"
       id="text4067"
       xml:space="preserve"
       style="font-size:56px;font-style:normal;font-variant:normal;font-weight:bold;font-stretch:normal;text-align:start;line-height:125%;letter-spacing:0px;word-spacing:0px;writing-mode:lr-tb;text-anchor:start;fill:#000000;fill-opacity:1;stroke:none;font-family:Sans;-inkscape-font-specification:Sans Bold"><tspan
         x="859.39844"
         y="660.87695"
         id="tspan4069">GLib</tspan></text>
    <use
       transform="translate(-347.50012,0)"
       id="use3343"
       x="0"
       y="0"
       width="1280"
       height="720"
       xlink:href="#rect4035" />
    <use
       transform="translate(469.99988,0)"
       id="use3345"
       x="0"
       y="0"
       width="1280"
       height="720"
       xlink:href="#rect4035" />
    <text
       x="990.29688"
       y="500.38477"
       id="text4059"
       xml:space="preserve"
       style="font-size:56px;font-style:normal;font-variant:normal;font-weight:bold;font-stretch:normal;text-align:start;line-height:125%;letter-spacing:0px;word-spacing:0px;writing-mode:lr-tb;text-anchor:start;fill:#000000;fill-opacity:1;stroke:none;font-family:Sans;-inkscape-font-specification:Sans Bold"><tspan
         x="990.29688"
         y="500.38477"
         id="tspan4061">GIO</tspan></text>
    <text
       x="130.70117"
       y="494.36914"
       id="text4047"
       xml:space="preserve"
       style="font-size:56px;font-style:normal;font-variant:normal;font-weight:bold;font-stretch:normal;text-align:start;line-height:125%;letter-spacing:0px;word-spacing:0px;writing-mode:lr-tb;text-anchor:start;fill:#000000;fill-opacity:1;stroke:none;font-family:Sans;-inkscape-font-specification:Sans Bold"><tspan
         x="130.70117"
         y="494.36914"
         id="tspan4049">Pango</tspan></text>
  </g>
</svg>
