{
    "network": {
        "1": {
            "name": "Ethereum Mainnet",
            "ticker": "ETH"
        },
        "56": {
            "name": "Binance Smart Chain",
            "ticker": "BNB"
        },
        "1666600000": {
            "name": "Harmony Chain",
            "ticker": "ONE"
        }
    }
}