1. Summary
Meeting title	Python training
Attended participants	9
Start time	9/8/22, 8:29:56 AM
End time	9/8/22, 10:02:02 AM
Meeting duration	1h 32m 6s
Average attendance time	1h 27m 36s

2. Participants
Name	First join	Last leave	In-meeting duration	Email	Participant ID (UPN)	Role
Diego Jauregui Salvatierra	9/8/22, 8:30:03 AM	9/8/22, 10:02:02 AM	1h 31m 59s	Diego.Jauregui@jala.university	Diego.Jauregui@jala.university	Presenter
Maria Marquina Guevara	9/8/22, 8:30:14 AM	9/8/22, 10:01:55 AM	1h 31m 41s	Maria.Marquina@jala.university	Maria.Marquina@jala.university	Organizer
Adrian Clavijo Lopez	9/8/22, 8:30:33 AM	9/8/22, 10:01:57 AM	1h 31m 24s	Adrian.Clavijo@jala.university	Adrian.Clavijo@jala.university	Presenter
Camilo Villalba Sanz	9/8/22, 8:30:35 AM	9/8/22, 10:01:59 AM	1h 31m 24s	Camilo.Villalba@jala.university	Camilo.Villalba@jala.university	Presenter
Andres Galvis Bolivar	9/8/22, 8:30:57 AM	9/8/22, 10:01:56 AM	1h 30m 59s	Andres.Galvis@jala.university	Andres.Galvis@jala.university	Presenter
Sergio Mallea Morales	9/8/22, 8:31:11 AM	9/8/22, 10:02:00 AM	1h 30m 48s	Sergio.Mallea@jala.university	Sergio.Mallea@jala.university	Presenter
Martin Ferreyra	9/8/22, 8:32:05 AM	9/8/22, 10:01:57 AM	1h 29m 52s	Martin.Ferreyra@jala.university	Martin.Ferreyra@jala.university	Presenter
Jason Pineda Serna	9/8/22, 8:45:33 AM	9/8/22, 10:01:59 AM	1h 16m 25s	Jason.Pineda@jala.university	Jason.Pineda@jala.university	Presenter
Jesus Vallecilla Solano	9/8/22, 8:48:04 AM	9/8/22, 10:02:00 AM	1h 13m 56s	Jesus.Vallecilla@jala.university	Jesus.Vallecilla@jala.university	Presenter

3. In-Meeting activities
Name	Join time	Leave time	Duration	Email	Role
Diego Jauregui Salvatierra	9/8/22, 8:30:03 AM	9/8/22, 10:02:02 AM	1h 31m 59s	Diego.Jauregui@jala.university	Presenter
Maria Marquina Guevara	9/8/22, 8:30:14 AM	9/8/22, 10:01:55 AM	1h 31m 41s	Maria.Marquina@jala.university	Organizer
Adrian Clavijo Lopez	9/8/22, 8:30:33 AM	9/8/22, 10:01:57 AM	1h 31m 24s	Adrian.Clavijo@jala.university	Presenter
Camilo Villalba Sanz	9/8/22, 8:30:35 AM	9/8/22, 10:01:59 AM	1h 31m 24s	Camilo.Villalba@jala.university	Presenter
Andres Galvis Bolivar	9/8/22, 8:30:57 AM	9/8/22, 10:01:56 AM	1h 30m 59s	Andres.Galvis@jala.university	Presenter
Sergio Mallea Morales	9/8/22, 8:31:11 AM	9/8/22, 10:02:00 AM	1h 30m 48s	Sergio.Mallea@jala.university	Presenter
Martin Ferreyra	9/8/22, 8:32:05 AM	9/8/22, 10:01:57 AM	1h 29m 52s	Martin.Ferreyra@jala.university	Presenter
Jason Pineda Serna	9/8/22, 8:45:33 AM	9/8/22, 10:01:59 AM	1h 16m 25s	Jason.Pineda@jala.university	Presenter
Jesus Vallecilla Solano	9/8/22, 8:48:04 AM	9/8/22, 10:02:00 AM	1h 13m 56s	Jesus.Vallecilla@jala.university	Presenter
