1. Summary
Meeting title	Python training
Attended participants	9
Start time	9/13/22, 8:29:28 AM
End time	9/13/22, 10:14:54 AM
Meeting duration	1h 45m 25s
Average attendance time	1h 44m 5s

2. Participants
Name	First join	Last leave	In-meeting duration	Email	Participant ID (UPN)	Role
Adrian Clavijo Lopez	9/13/22, 8:29:33 AM	9/13/22, 10:14:53 AM	1h 45m 19s	Adrian.Clavijo@jala.university	Adrian.Clavijo@jala.university	Presenter
Maria Marquina Guevara	9/13/22, 8:29:45 AM	9/13/22, 10:14:48 AM	1h 45m 3s	Maria.Marquina@jala.university	Maria.Marquina@jala.university	Organizer
Martin Ferreyra	9/13/22, 8:29:46 AM	9/13/22, 10:14:50 AM	1h 45m 4s	Martin.Ferreyra@jala.university	Martin.Ferreyra@jala.university	Presenter
Jesus Vallecilla Solano	9/13/22, 8:29:48 AM	9/13/22, 10:14:54 AM	1h 45m 5s	Jesus.Vallecilla@jala.university	Jesus.Vallecilla@jala.university	Presenter
Diego Jauregui Salvatierra	9/13/22, 8:29:48 AM	9/13/22, 10:14:50 AM	1h 45m 1s	Diego.Jauregui@jala.university	Diego.Jauregui@jala.university	Presenter
Camilo Villalba Sanz	9/13/22, 8:30:10 AM	9/13/22, 10:14:52 AM	1h 44m 42s	Camilo.Villalba@jala.university	Camilo.Villalba@jala.university	Presenter
Sergio Mallea Morales	9/13/22, 8:30:42 AM	9/13/22, 10:14:54 AM	1h 44m 11s	Sergio.Mallea@jala.university	Sergio.Mallea@jala.university	Presenter
Andres Galvis Bolivar	9/13/22, 8:32:39 AM	9/13/22, 10:14:45 AM	1h 42m 5s	Andres.Galvis@jala.university	Andres.Galvis@jala.university	Presenter
Jason Pineda Serna	9/13/22, 8:34:38 AM	9/13/22, 10:14:51 AM	1h 40m 12s	Jason.Pineda@jala.university	Jason.Pineda@jala.university	Presenter

3. In-Meeting activities
Name	Join time	Leave time	Duration	Email	Role
Adrian Clavijo Lopez	9/13/22, 8:29:33 AM	9/13/22, 10:14:53 AM	1h 45m 19s	Adrian.Clavijo@jala.university	Presenter
Maria Marquina Guevara	9/13/22, 8:29:45 AM	9/13/22, 10:14:48 AM	1h 45m 3s	Maria.Marquina@jala.university	Organizer
Martin Ferreyra	9/13/22, 8:29:46 AM	9/13/22, 10:14:50 AM	1h 45m 4s	Martin.Ferreyra@jala.university	Presenter
Jesus Vallecilla Solano	9/13/22, 8:29:48 AM	9/13/22, 10:14:54 AM	1h 45m 5s	Jesus.Vallecilla@jala.university	Presenter
Diego Jauregui Salvatierra	9/13/22, 8:29:48 AM	9/13/22, 10:14:50 AM	1h 45m 1s	Diego.Jauregui@jala.university	Presenter
Camilo Villalba Sanz	9/13/22, 8:30:10 AM	9/13/22, 10:14:52 AM	1h 44m 42s	Camilo.Villalba@jala.university	Presenter
Sergio Mallea Morales	9/13/22, 8:30:42 AM	9/13/22, 10:14:54 AM	1h 44m 11s	Sergio.Mallea@jala.university	Presenter
Andres Galvis Bolivar	9/13/22, 8:32:39 AM	9/13/22, 10:14:45 AM	1h 42m 5s	Andres.Galvis@jala.university	Presenter
Jason Pineda Serna	9/13/22, 8:34:38 AM	9/13/22, 10:14:51 AM	1h 40m 12s	Jason.Pineda@jala.university	Presenter
