1. Summary
Meeting title	Python training
Attended participants	6
Start time	9/22/22, 2:59:45 PM
End time	9/22/22, 3:57:41 PM
Meeting duration	57m 56s
Average attendance time	52m 43s

2. Participants
Name	First join	Last leave	In-meeting duration	Email	Participant ID (UPN)	Role
Diego Jauregui Salvatierra	9/22/22, 2:59:50 PM	9/22/22, 3:56:35 PM	53m 41s	Diego.Jauregui@jala.university	Diego.Jauregui@jala.university	Presenter
Adrian Clavijo Lopez	9/22/22, 2:59:57 PM	9/22/22, 3:56:33 PM	56m 35s	Adrian.Clavijo@jala.university	Adrian.Clavijo@jala.university	Presenter
Camilo Villalba Sanz	9/22/22, 3:00:08 PM	9/22/22, 3:57:41 PM	57m 32s	Camilo.Villalba@jala.university	Camilo.Villalba@jala.university	Presenter
Sergio Mallea Morales	9/22/22, 3:00:16 PM	9/22/22, 3:56:53 PM	56m 36s	Sergio.Mallea@jala.university	Sergio.Mallea@jala.university	Presenter
Andres Galvis Bolivar	9/22/22, 3:00:39 PM	9/22/22, 3:53:07 PM	36m 58s	Andres.Galvis@jala.university	Andres.Galvis@jala.university	Presenter
Jesus Vallecilla Solano	9/22/22, 3:01:38 PM	9/22/22, 3:56:33 PM	54m 55s	Jesus.Vallecilla@jala.university	Jesus.Vallecilla@jala.university	Presenter

3. In-Meeting activities
Name	Join time	Leave time	Duration	Email	Role
Diego Jauregui Salvatierra	9/22/22, 2:59:50 PM	9/22/22, 3:30:05 PM	30m 14s	Diego.Jauregui@jala.university	Presenter
Diego Jauregui Salvatierra	9/22/22, 3:33:07 PM	9/22/22, 3:56:35 PM	23m 27s	Diego.Jauregui@jala.university	Presenter
Adrian Clavijo Lopez	9/22/22, 2:59:57 PM	9/22/22, 3:56:33 PM	56m 35s	Adrian.Clavijo@jala.university	Presenter
Camilo Villalba Sanz	9/22/22, 3:00:08 PM	9/22/22, 3:57:41 PM	57m 32s	Camilo.Villalba@jala.university	Presenter
Sergio Mallea Morales	9/22/22, 3:00:16 PM	9/22/22, 3:56:53 PM	56m 36s	Sergio.Mallea@jala.university	Presenter
Andres Galvis Bolivar	9/22/22, 3:00:39 PM	9/22/22, 3:37:34 PM	36m 55s	Andres.Galvis@jala.university	Presenter
Andres Galvis Bolivar	9/22/22, 3:53:03 PM	9/22/22, 3:53:07 PM	3s	Andres.Galvis@jala.university	Presenter
Jesus Vallecilla Solano	9/22/22, 3:01:38 PM	9/22/22, 3:56:33 PM	54m 55s	Jesus.Vallecilla@jala.university	Presenter
