1. Summary
Meeting title	Python Training [week 6] - [week 13]
Attended participants	19
Start time	11/22/22, 4:52:57 PM
End time	11/22/22, 5:50:49 PM
Meeting duration	57m 52s
Average attendance time	52m 39s

2. Participants
Name	First join	Last leave	In-meeting duration	Email	Participant ID (UPN)	Role
Kevin Butvilofsky	11/22/22, 4:53:01 PM	11/22/22, 5:50:27 PM	57m 25s	Kevin.Butvilofsky@jala.university	Kevin.Butvilofsky@jala.university	Presenter
Andre Arroyo Hinojosa	11/22/22, 4:53:12 PM	11/22/22, 5:50:34 PM	57m 21s	Andre.Arroyo@jala.university	Andre.Arroyo@jala.university	Presenter
Ivan Gonzalez de la Torre	11/22/22, 4:53:13 PM	11/22/22, 5:50:28 PM	57m 15s	Ivan.Gonzalez@jala.university	Ivan.Gonzalez@jala.university	Presenter
Miguel Pozo Morales	11/22/22, 4:53:13 PM	11/22/22, 5:50:27 PM	57m 14s	Miguel.Pozo@jala.university	Miguel.Pozo@jala.university	Presenter
Diego Alarcon Inturias	11/22/22, 4:54:11 PM	11/22/22, 5:50:26 PM	56m 14s	Diego.Alarcon@jala.university	Diego.Alarcon@jala.university	Presenter
Renan Boaventura	11/22/22, 4:54:33 PM	11/22/22, 5:50:30 PM	48m 23s	Renan.Boaventura@jala.university	Renan.Boaventura@jala.university	Presenter
Jose Mendoza Antonio	11/22/22, 4:55:21 PM	11/22/22, 5:50:30 PM	55m 9s	Jose.Mendoza@jala.university	Jose.Mendoza@jala.university	Presenter
Brayan Vasquez Rojas	11/22/22, 4:55:31 PM	11/22/22, 5:50:31 PM	54m 59s	Brayan.Vasquez@jala.university	Brayan.Vasquez@jala.university	Presenter
Diego Quisbert Gutierrez	11/22/22, 4:55:36 PM	11/22/22, 5:50:26 PM	54m 50s	Diego.Quisbert@jala.university	Diego.Quisbert@jala.university	Presenter
Rodrigo Morales Rivas	11/22/22, 4:57:20 PM	11/22/22, 5:50:32 PM	53m 11s	Rodrigo.Morales@jala.university	Rodrigo.Morales@jala.university	Presenter
Miguel Paricahua Lopez	11/22/22, 4:58:11 PM	11/22/22, 5:50:28 PM	52m 17s	Miguel.Paricahua@jala.university	Miguel.Paricahua@jala.university	Presenter
Nelson Delgado Colque	11/22/22, 4:58:57 PM	11/22/22, 5:50:49 PM	51m 51s	Nelson.Delgado@jala.university	Nelson.Delgado@jala.university	Presenter
Sebastian Arbelaez Meneses	11/22/22, 4:59:23 PM	11/22/22, 5:50:30 PM	51m 6s	Sebastian.Arbelaez@jala.university	Sebastian.Arbelaez@jala.university	Presenter
Maria Marquina Guevara	11/22/22, 4:59:33 PM	11/22/22, 5:50:26 PM	50m 53s	Maria.Marquina@jala.university	Maria.Marquina@jala.university	Organizer
Israel Zurita Sanchez	11/22/22, 5:00:05 PM	11/22/22, 5:50:24 PM	50m 18s	Israel.Zurita@jala.university	Israel.Zurita@jala.university	Presenter
Dayana Hernandez Aquize	11/22/22, 5:00:49 PM	11/22/22, 5:50:33 PM	49m 44s	Dayana.Hernandez@jala.university	Dayana.Hernandez@jala.university	Presenter
Alex Perez Castillo	11/22/22, 5:01:46 PM	11/22/22, 5:50:30 PM	48m 43s	Alex.Perez@jala.university	Alex.Perez@jala.university	Presenter
Miguel Gemio Quispe	11/22/22, 5:01:52 PM	11/22/22, 5:50:25 PM	48m 33s	Miguel.Gemio@jala.university	Miguel.Gemio@jala.university	Presenter
Alejandra Maldonado	11/22/22, 5:05:33 PM	11/22/22, 5:50:36 PM	45m 2s	Alejandra.Maldonado@jala.university	Alejandra.Maldonado@jala.university	Presenter

3. In-Meeting activities
Name	Join time	Leave time	Duration	Email	Role
Kevin Butvilofsky	11/22/22, 4:53:01 PM	11/22/22, 5:50:27 PM	57m 25s	Kevin.Butvilofsky@jala.university	Presenter
Andre Arroyo Hinojosa	11/22/22, 4:53:12 PM	11/22/22, 5:50:34 PM	57m 21s	Andre.Arroyo@jala.university	Presenter
Ivan Gonzalez de la Torre	11/22/22, 4:53:13 PM	11/22/22, 5:50:28 PM	57m 15s	Ivan.Gonzalez@jala.university	Presenter
Miguel Pozo Morales	11/22/22, 4:53:13 PM	11/22/22, 5:50:27 PM	57m 14s	Miguel.Pozo@jala.university	Presenter
Diego Alarcon Inturias	11/22/22, 4:54:11 PM	11/22/22, 5:50:26 PM	56m 14s	Diego.Alarcon@jala.university	Presenter
Renan Boaventura	11/22/22, 4:54:33 PM	11/22/22, 5:36:35 PM	42m 2s	Renan.Boaventura@jala.university	Presenter
Renan Boaventura	11/22/22, 5:44:08 PM	11/22/22, 5:50:30 PM	6m 21s	Renan.Boaventura@jala.university	Presenter
Jose Mendoza Antonio	11/22/22, 4:55:21 PM	11/22/22, 5:50:30 PM	55m 9s	Jose.Mendoza@jala.university	Presenter
Brayan Vasquez Rojas	11/22/22, 4:55:31 PM	11/22/22, 5:50:31 PM	54m 59s	Brayan.Vasquez@jala.university	Presenter
Diego Quisbert Gutierrez	11/22/22, 4:55:36 PM	11/22/22, 5:50:26 PM	54m 50s	Diego.Quisbert@jala.university	Presenter
Rodrigo Morales Rivas	11/22/22, 4:57:20 PM	11/22/22, 5:50:32 PM	53m 11s	Rodrigo.Morales@jala.university	Presenter
Miguel Paricahua Lopez	11/22/22, 4:58:11 PM	11/22/22, 5:50:28 PM	52m 17s	Miguel.Paricahua@jala.university	Presenter
Nelson Delgado Colque	11/22/22, 4:58:57 PM	11/22/22, 5:50:49 PM	51m 51s	Nelson.Delgado@jala.university	Presenter
Sebastian Arbelaez Meneses	11/22/22, 4:59:23 PM	11/22/22, 5:50:30 PM	51m 6s	Sebastian.Arbelaez@jala.university	Presenter
Maria Marquina Guevara	11/22/22, 4:59:33 PM	11/22/22, 5:50:26 PM	50m 53s	Maria.Marquina@jala.university	Organizer
Israel Zurita Sanchez	11/22/22, 5:00:05 PM	11/22/22, 5:50:24 PM	50m 18s	Israel.Zurita@jala.university	Presenter
Dayana Hernandez Aquize	11/22/22, 5:00:49 PM	11/22/22, 5:50:33 PM	49m 44s	Dayana.Hernandez@jala.university	Presenter
Alex Perez Castillo	11/22/22, 5:01:46 PM	11/22/22, 5:50:30 PM	48m 43s	Alex.Perez@jala.university	Presenter
Miguel Gemio Quispe	11/22/22, 5:01:52 PM	11/22/22, 5:50:25 PM	48m 33s	Miguel.Gemio@jala.university	Presenter
Alejandra Maldonado	11/22/22, 5:05:33 PM	11/22/22, 5:50:36 PM	45m 2s	Alejandra.Maldonado@jala.university	Presenter
