1. Summary
Meeting title	AWS Glue Catalog + Athena
Attended participants	7
Start time	6/24/22, 10:27:56 AM
End time	6/24/22, 12:11:47 PM
Meeting duration	1h 43m 51s
Average attendance time	1h 38m 49s

2. Participants
Name	First join	Last leave	In-meeting duration	Email	Participant ID (UPN)	Role
Kevin Cardenas Rodriguez	6/24/22, 10:27:59 AM	6/24/22, 12:11:43 PM	1h 43m 44s	Kevin.Cardenas@jala-foundation.org	Kevin.Cardenas@jala-foundation.org	Presenter
Luis Becerra Vazquez	6/24/22, 10:28:22 AM	6/24/22, 12:11:40 PM	1h 42m 12s	Luis.Becerra@jala-foundation.org	Luis.Becerra@jala-foundation.org	Presenter
Joaquin Aman Alvarez	6/24/22, 10:31:08 AM	6/24/22, 12:11:43 PM	1h 40m 35s	Joaquin.Aman@jala-foundation.org	Joaquin.Aman@jala-foundation.org	Presenter
Martin Gonzalez Torrilla	6/24/22, 10:31:11 AM	6/24/22, 11:59:55 AM	1h 28m 44s	Martin.Gonzalez@jala-foundation.org	Martin.Gonzalez@jala-foundation.org	Presenter
Martin Pavesio Sabini	6/24/22, 10:31:36 AM	6/24/22, 12:11:47 PM	1h 40m 10s	Martin.Pavesio@jala-foundation.org	Martin.Pavesio@jala-foundation.org	Presenter
Leonardo Villalba Ferrer	6/24/22, 10:32:47 AM	6/24/22, 12:10:32 PM	1h 37m 44s	Leonardo.Villalba@jala-foundation.org	Leonardo.Villalba@jala-foundation.org	Presenter
Maria Marquina Guevara	6/24/22, 10:33:06 AM	6/24/22, 12:11:43 PM	1h 38m 37s	Maria.Marquina@fundacion-jala.org	Maria.Marquina@fundacion-jala.org	Organizer

3. In-Meeting activities
Name	Join time	Leave time	Duration	Email	Role
Kevin Cardenas Rodriguez	6/24/22, 10:27:59 AM	6/24/22, 12:11:43 PM	1h 43m 44s	Kevin.Cardenas@jala-foundation.org	Presenter
Luis Becerra Vazquez	6/24/22, 10:28:22 AM	6/24/22, 10:29:49 AM	1m 26s	Luis.Becerra@jala-foundation.org	Presenter
Luis Becerra Vazquez	6/24/22, 10:30:54 AM	6/24/22, 12:11:40 PM	1h 40m 46s	Luis.Becerra@jala-foundation.org	Presenter
Joaquin Aman Alvarez	6/24/22, 10:31:08 AM	6/24/22, 12:11:43 PM	1h 40m 35s	Joaquin.Aman@jala-foundation.org	Presenter
Martin Gonzalez Torrilla	6/24/22, 10:31:11 AM	6/24/22, 11:59:55 AM	1h 28m 44s	Martin.Gonzalez@jala-foundation.org	Presenter
Martin Pavesio Sabini	6/24/22, 10:31:36 AM	6/24/22, 12:11:47 PM	1h 40m 10s	Martin.Pavesio@jala-foundation.org	Presenter
Leonardo Villalba Ferrer	6/24/22, 10:32:47 AM	6/24/22, 12:10:32 PM	1h 37m 44s	Leonardo.Villalba@jala-foundation.org	Presenter
Maria Marquina Guevara	6/24/22, 10:33:06 AM	6/24/22, 12:11:43 PM	1h 38m 37s	Maria.Marquina@fundacion-jala.org	Organizer
