1. Summary
Title	Practica: Modulo 1 - Grupo 6 BO 3/22 
Id	Practica: Modulo 1 - Grupo 6 BO 3/22 
Attended participants	1
Start Time	9/13/22, 7:36:30 PM
End Time	9/13/22, 7:36:37 PM
Duration	7s

2. Participants
Name	First join	Last leave	In-meeting duration	Email	Participant ID (UPN)	Role
Jose Merida Orellana	9/13/22, 7:36:34 PM	9/13/22, 7:36:37 PM	3s	Jose.Merida@fundacion-jala.org	Jose.Merida@fundacion-jala.org	Presenter

3. In-Meeting activities
Name	Join_time	Leave_time	Duration	Email	Role
Jose Merida Orellana	9/13/22, 7:36:34 PM	9/13/22, 7:36:37 PM	3s	Jose.Merida@fundacion-jala.org	Presenter

