1. Summary
Title	Python training
Id	Python training
Attended participants	9
Start Time	9/16/22, 8:26:48 AM
End Time	9/16/22, 9:35:55 AM
Duration	1h 9m 7s

2. Participants
Name	First join	Last leave	In-meeting duration	Email	Participant ID (UPN)	Role
Diego Jauregui Salvatierra	9/16/22, 8:26:53 AM	9/16/22, 9:35:34 AM	1h 8m 41s	Diego.Jauregui@jala.university	Diego.Jauregui@jala.university	Presenter
Adrian Clavijo Lopez	9/16/22, 8:28:35 AM	9/16/22, 9:35:32 AM	1h 6m 57s	Adrian.Clavijo@jala.university	Adrian.Clavijo@jala.university	Presenter
Camilo Villalba Sanz	9/16/22, 8:29:23 AM	9/16/22, 9:35:32 AM	1h 6m 9s	Camilo.Villalba@jala.university	Camilo.Villalba@jala.university	Presenter
Sergio Mallea Morales	9/16/22, 8:30:02 AM	9/16/22, 9:35:34 AM	1h 5m 32s	Sergio.Mallea@jala.university	Sergio.Mallea@jala.university	Presenter
Maria Marquina Guevara	9/16/22, 8:30:13 AM	9/16/22, 9:35:28 AM	1h 5m 15s	Maria.Marquina@jala.university	Maria.Marquina@jala.university	Organizer
Andres Galvis Bolivar	9/16/22, 8:32:43 AM	9/16/22, 9:35:35 AM	1h 2m 52s	Andres.Galvis@jala.university	Andres.Galvis@jala.university	Presenter
Jesus Vallecilla Solano	9/16/22, 8:32:43 AM	9/16/22, 9:35:55 AM	1h 3m 12s	Jesus.Vallecilla@jala.university	Jesus.Vallecilla@jala.university	Presenter
Martin Ferreyra	9/16/22, 8:35:47 AM	9/16/22, 9:35:37 AM	59m 50s	Martin.Ferreyra@jala.university	Martin.Ferreyra@jala.university	Presenter
Jason Pineda Serna	9/16/22, 8:36:21 AM	9/16/22, 9:35:32 AM	59m 11s	Jason.Pineda@jala.university	Jason.Pineda@jala.university	Presenter

3. In-Meeting activities
Name	Join_time	Leave_time	Duration	Email	Role
Diego Jauregui Salvatierra	9/16/22, 8:26:53 AM	9/16/22, 9:35:34 AM	1h 8m 41s	Diego.Jauregui@jala.university	Presenter
Adrian Clavijo Lopez	9/16/22, 8:28:35 AM	9/16/22, 9:35:32 AM	1h 6m 57s	Adrian.Clavijo@jala.university	Presenter
Camilo Villalba Sanz	9/16/22, 8:29:23 AM	9/16/22, 9:35:32 AM	1h 6m 9s	Camilo.Villalba@jala.university	Presenter
Sergio Mallea Morales	9/16/22, 8:30:02 AM	9/16/22, 9:35:34 AM	1h 5m 32s	Sergio.Mallea@jala.university	Presenter
Maria Marquina Guevara	9/16/22, 8:30:13 AM	9/16/22, 9:35:28 AM	1h 5m 15s	Maria.Marquina@jala.university	Organizer
Andres Galvis Bolivar	9/16/22, 8:32:43 AM	9/16/22, 9:35:35 AM	1h 2m 52s	Andres.Galvis@jala.university	Presenter
Jesus Vallecilla Solano	9/16/22, 8:32:43 AM	9/16/22, 9:35:55 AM	1h 3m 12s	Jesus.Vallecilla@jala.university	Presenter
Martin Ferreyra	9/16/22, 8:35:47 AM	9/16/22, 9:35:37 AM	59m 50s	Martin.Ferreyra@jala.university	Presenter
Jason Pineda Serna	9/16/22, 8:36:21 AM	9/16/22, 9:35:32 AM	59m 11s	Jason.Pineda@jala.university	Presenter

