1. Summary
Title	DB
Id	DB
Attended participants	9
Start Time	10/12/22, 8:27:52 AM
End Time	10/12/22, 10:10:55 AM
Duration	1h 43m 3s

2. Participants
Name	First join	Last leave	In-meeting duration	Email	Participant ID (UPN)	Role
Maria Marquina Guevara	10/12/22, 8:27:57 AM	10/12/22, 10:10:35 AM	1h 42m 38s	Maria.Marquina@jala.university	Maria.Marquina@jala.university	Organizer
Diego Jauregui Salvatierra	10/12/22, 8:28:08 AM	10/12/22, 10:10:55 AM	1h 42m 47s	Diego.Jauregui@jala.university	Diego.Jauregui@jala.university	Presenter
Sergio Mallea Morales	10/12/22, 8:29:17 AM	10/12/22, 10:10:39 AM	1h 41m 22s	Sergio.Mallea@jala.university	Sergio.Mallea@jala.university	Presenter
Adrian Clavijo Lopez	10/12/22, 8:30:06 AM	10/12/22, 10:10:38 AM	1h 40m 32s	Adrian.Clavijo@jala.university	Adrian.Clavijo@jala.university	Presenter
Jesus Vallecilla Solano	10/12/22, 8:30:31 AM	10/12/22, 10:10:40 AM	1h 40m 9s	Jesus.Vallecilla@jala.university	Jesus.Vallecilla@jala.university	Presenter
Camilo Villalba Sanz	10/12/22, 8:30:50 AM	10/12/22, 10:10:39 AM	1h 39m 49s	Camilo.Villalba@jala.university	Camilo.Villalba@jala.university	Presenter
Andres Galvis Bolivar	10/12/22, 8:31:12 AM	10/12/22, 10:10:37 AM	1h 39m 25s	Andres.Galvis@jala.university	Andres.Galvis@jala.university	Presenter
Martin Ferreyra	10/12/22, 8:33:49 AM	10/12/22, 10:10:44 AM	1h 36m 55s	Martin.Ferreyra@jala.university	Martin.Ferreyra@jala.university	Presenter
Jason Pineda Serna	10/12/22, 8:38:49 AM	10/12/22, 10:10:38 AM	1h 31m 49s	Jason.Pineda@jala.university	Jason.Pineda@jala.university	Presenter

3. In-Meeting activities
Name	Join_time	Leave_time	Duration	Email	Role
Maria Marquina Guevara	10/12/22, 8:27:57 AM	10/12/22, 10:10:35 AM	1h 42m 38s	Maria.Marquina@jala.university	Organizer
Diego Jauregui Salvatierra	10/12/22, 8:28:08 AM	10/12/22, 10:10:55 AM	1h 42m 47s	Diego.Jauregui@jala.university	Presenter
Sergio Mallea Morales	10/12/22, 8:29:17 AM	10/12/22, 10:10:39 AM	1h 41m 22s	Sergio.Mallea@jala.university	Presenter
Adrian Clavijo Lopez	10/12/22, 8:30:06 AM	10/12/22, 10:10:38 AM	1h 40m 32s	Adrian.Clavijo@jala.university	Presenter
Jesus Vallecilla Solano	10/12/22, 8:30:31 AM	10/12/22, 10:10:40 AM	1h 40m 9s	Jesus.Vallecilla@jala.university	Presenter
Camilo Villalba Sanz	10/12/22, 8:30:50 AM	10/12/22, 10:10:39 AM	1h 39m 49s	Camilo.Villalba@jala.university	Presenter
Andres Galvis Bolivar	10/12/22, 8:31:12 AM	10/12/22, 10:10:37 AM	1h 39m 25s	Andres.Galvis@jala.university	Presenter
Martin Ferreyra	10/12/22, 8:33:49 AM	10/12/22, 10:10:44 AM	1h 36m 55s	Martin.Ferreyra@jala.university	Presenter
Jason Pineda Serna	10/12/22, 8:38:49 AM	10/12/22, 10:10:38 AM	1h 31m 49s	Jason.Pineda@jala.university	Presenter

