1. Summary
Title	Practica: Modulo 1 - Grupo 6 BO 3/22 
Id	Practica: Modulo 1 - Grupo 6 BO 3/22 
Attended participants	20
Start Time	9/14/22, 5:53:35 PM
End Time	9/14/22, 7:44:58 PM
Duration	1h 51m 23s

2. Participants
Name	First join	Last leave	In-meeting duration	Email	Participant ID (UPN)	Role
Maria Marquina Guevara	9/14/22, 5:53:42 PM	9/14/22, 7:44:10 PM	1h 50m 28s	Maria.Marquina@fundacion-jala.org	Maria.Marquina@fundacion-jala.org	Organizer
Alex Delgado Ugarte	9/14/22, 5:54:48 PM	9/14/22, 7:44:14 PM	1h 49m 26s	Alex.Delgado@fundacion-jala.org	Alex.Delgado@fundacion-jala.org	Presenter
David Lujan Renteria	9/14/22, 5:55:58 PM	9/14/22, 7:44:20 PM	1h 48m 22s	David.Lujan@fundacion-jala.org	David.Lujan@fundacion-jala.org	Presenter
Dayla Uribe Siles	9/14/22, 5:56:59 PM	9/14/22, 7:44:16 PM	1h 47m 17s	Dayla.Uribe@fundacion-jala.org	Dayla.Uribe@fundacion-jala.org	Presenter
Antonio Meneses	9/14/22, 5:59:09 PM	9/14/22, 7:44:35 PM	1h 45m 26s	antonio.meneses@enverus.com	antonio.meneses@drillinginfo.com	Presenter
Nick Yana Choque	9/14/22, 5:59:33 PM	9/14/22, 7:28:32 PM	1h 28m 59s	Nick.Yana@fundacion-jala.org	Nick.Yana@fundacion-jala.org	Presenter
Carlos Sejas Torrico	9/14/22, 5:59:46 PM	9/14/22, 7:44:16 PM	1h 44m 30s	Carlos.Sejas@fundacion-jala.org	Carlos.Sejas@fundacion-jala.org	Presenter
Jeisson Alejandro Becerra	9/14/22, 6:00:06 PM	9/14/22, 7:44:16 PM	1h 44m 10s	Jeisson.Alejandro@fundacion-jala.org	Jeisson.Alejandro@fundacion-jala.org	Presenter
Jon Marzo Baltazar	9/14/22, 6:00:28 PM	9/14/22, 7:44:37 PM	1h 44m 9s	Jon.Marzo@fundacion-jala.org	Jon.Marzo@fundacion-jala.org	Presenter
Jeremias Hidalgo Romano	9/14/22, 6:00:32 PM	9/14/22, 7:44:17 PM	1h 43m 45s	Jeremias.Hidalgo@fundacion-jala.org	Jeremias.Hidalgo@fundacion-jala.org	Presenter
Rohan Escobar Guzman	9/14/22, 6:00:33 PM	9/14/22, 7:44:18 PM	1h 43m 45s	Rohan.Escobar@fundacion-jala.org	Rohan.Escobar@fundacion-jala.org	Presenter
Juan Maidana Murillo	9/14/22, 6:00:45 PM	9/14/22, 7:44:14 PM	1h 43m 29s	Juan.Maidana@jalasoft.com	Juan.Maidana@jalasoft.com	Presenter
Johann Villca Villca	9/14/22, 6:00:46 PM	9/14/22, 7:44:29 PM	1h 43m 43s	Johann.Villca@fundacion-jala.org	Johann.Villca@fundacion-jala.org	Presenter
Jorge Arone Delgado	9/14/22, 6:00:49 PM	9/14/22, 7:44:21 PM	1h 43m 32s	Jorge.Arone@fundacion-jala.org	Jorge.Arone@fundacion-jala.org	Presenter
Emily Penaranda Anagua	9/14/22, 6:00:57 PM	9/14/22, 7:44:18 PM	1h 43m 21s	Emily.Penaranda@fundacion-jala.org	Emily.Penaranda@fundacion-jala.org	Presenter
Cesar Vargas Lezano	9/14/22, 6:03:10 PM	9/14/22, 7:44:13 PM	1h 41m 3s	Cesar.Vargas@fundacion-jala.org	Cesar.Vargas@fundacion-jala.org	Presenter
Jose Merida Orellana	9/14/22, 6:04:40 PM	9/14/22, 7:44:26 PM	1h 39m 46s	Jose.Merida@fundacion-jala.org	Jose.Merida@fundacion-jala.org	Presenter
Daleth Vasquez Montano	9/14/22, 6:09:36 PM	9/14/22, 7:44:18 PM	1h 34m 42s	Daleth.Vasquez@fundacion-jala.org	Daleth.Vasquez@fundacion-jala.org	Presenter
David Rocha Escalera	9/14/22, 6:15:29 PM	9/14/22, 7:44:18 PM	1h 28m 49s	David.Rocha@fundacion-jala.org	David.Rocha@fundacion-jala.org	Presenter
Federico Garcia Ramirez	9/14/22, 7:16:58 PM	9/14/22, 7:44:58 PM	28m 	Federico.Garcia@fundacion-jala.org	Federico.Garcia@fundacion-jala.org	Presenter

3. In-Meeting activities
Name	Join_time	Leave_time	Duration	Email	Role
Maria Marquina Guevara	9/14/22, 5:53:42 PM	9/14/22, 7:44:10 PM	1h 50m 28s	Maria.Marquina@fundacion-jala.org	Organizer
Alex Delgado Ugarte	9/14/22, 5:54:48 PM	9/14/22, 7:44:14 PM	1h 49m 26s	Alex.Delgado@fundacion-jala.org	Presenter
David Lujan Renteria	9/14/22, 5:55:58 PM	9/14/22, 7:44:20 PM	1h 48m 22s	David.Lujan@fundacion-jala.org	Presenter
Dayla Uribe Siles	9/14/22, 5:56:59 PM	9/14/22, 7:44:16 PM	1h 47m 17s	Dayla.Uribe@fundacion-jala.org	Presenter
Antonio Meneses	9/14/22, 5:59:09 PM	9/14/22, 7:44:35 PM	1h 45m 26s	antonio.meneses@enverus.com	Presenter
Nick Yana Choque	9/14/22, 5:59:33 PM	9/14/22, 7:28:32 PM	1h 28m 59s	Nick.Yana@fundacion-jala.org	Presenter
Carlos Sejas Torrico	9/14/22, 5:59:46 PM	9/14/22, 7:44:16 PM	1h 44m 30s	Carlos.Sejas@fundacion-jala.org	Presenter
Jeisson Alejandro Becerra	9/14/22, 6:00:06 PM	9/14/22, 7:44:16 PM	1h 44m 10s	Jeisson.Alejandro@fundacion-jala.org	Presenter
Jon Marzo Baltazar	9/14/22, 6:00:28 PM	9/14/22, 7:44:37 PM	1h 44m 9s	Jon.Marzo@fundacion-jala.org	Presenter
Jeremias Hidalgo Romano	9/14/22, 6:00:32 PM	9/14/22, 7:44:17 PM	1h 43m 45s	Jeremias.Hidalgo@fundacion-jala.org	Presenter
Rohan Escobar Guzman	9/14/22, 6:00:33 PM	9/14/22, 7:44:18 PM	1h 43m 45s	Rohan.Escobar@fundacion-jala.org	Presenter
Juan Maidana Murillo	9/14/22, 6:00:45 PM	9/14/22, 7:44:14 PM	1h 43m 29s	Juan.Maidana@jalasoft.com	Presenter
Johann Villca Villca	9/14/22, 6:00:46 PM	9/14/22, 7:44:29 PM	1h 43m 43s	Johann.Villca@fundacion-jala.org	Presenter
Jorge Arone Delgado	9/14/22, 6:00:49 PM	9/14/22, 7:44:21 PM	1h 43m 32s	Jorge.Arone@fundacion-jala.org	Presenter
Emily Penaranda Anagua	9/14/22, 6:00:57 PM	9/14/22, 7:44:18 PM	1h 43m 21s	Emily.Penaranda@fundacion-jala.org	Presenter
Cesar Vargas Lezano	9/14/22, 6:03:10 PM	9/14/22, 7:44:13 PM	1h 41m 3s	Cesar.Vargas@fundacion-jala.org	Presenter
Jose Merida Orellana	9/14/22, 6:04:40 PM	9/14/22, 7:44:26 PM	1h 39m 46s	Jose.Merida@fundacion-jala.org	Presenter
Daleth Vasquez Montano	9/14/22, 6:09:36 PM	9/14/22, 6:18:14 PM	8m 38s	Daleth.Vasquez@fundacion-jala.org	Presenter
Daleth Vasquez Montano	9/14/22, 6:19:16 PM	9/14/22, 7:44:18 PM	1h 25m 2s	Daleth.Vasquez@fundacion-jala.org	Presenter
David Rocha Escalera	9/14/22, 6:15:29 PM	9/14/22, 7:44:18 PM	1h 28m 49s	David.Rocha@fundacion-jala.org	Presenter
Federico Garcia Ramirez	9/14/22, 7:16:58 PM	9/14/22, 7:44:58 PM	28m 	Federico.Garcia@fundacion-jala.org	Presenter

