1. Summary
Meeting title	Python Training [week 6] - [week 13]
Attended participants	20
Start time	11/15/22, 4:56:11 PM
End time	11/15/22, 6:07:06 PM
Meeting duration	1h 10m 55s
Average attendance time	50m 35s

2. Participants
Name	First join	Last leave	In-meeting duration	Email	Participant ID (UPN)	Role
Rodrigo Morales Rivas	11/15/22, 4:56:16 PM	11/15/22, 5:52:18 PM	56m 1s	Rodrigo.Morales@jala.university	Rodrigo.Morales@jala.university	Presenter
Diego Alarcon Inturias	11/15/22, 4:56:27 PM	11/15/22, 5:52:11 PM	55m 43s	Diego.Alarcon@jala.university	Diego.Alarcon@jala.university	Presenter
Renan Boaventura	11/15/22, 4:56:27 PM	11/15/22, 5:52:12 PM	55m 44s	Renan.Boaventura@jala.university	Renan.Boaventura@jala.university	Presenter
Miguel Pozo Morales	11/15/22, 4:56:32 PM	11/15/22, 5:52:13 PM	55m 40s	Miguel.Pozo@jala.university	Miguel.Pozo@jala.university	Presenter
Andre Arroyo Hinojosa	11/15/22, 4:57:05 PM	11/15/22, 5:52:19 PM	55m 13s	Andre.Arroyo@jala.university	Andre.Arroyo@jala.university	Presenter
Jose Mendoza Antonio	11/15/22, 4:57:11 PM	11/15/22, 5:52:16 PM	55m 4s	Jose.Mendoza@jala.university	Jose.Mendoza@jala.university	Presenter
Kevin Butvilofsky	11/15/22, 4:58:25 PM	11/15/22, 5:52:10 PM	53m 44s	Kevin.Butvilofsky@jala.university	Kevin.Butvilofsky@jala.university	Presenter
Nelson Delgado Colque	11/15/22, 4:58:57 PM	11/15/22, 5:52:10 PM	53m 13s	Nelson.Delgado@jala.university	Nelson.Delgado@jala.university	Presenter
Brayan Vasquez Rojas	11/15/22, 4:59:06 PM	11/15/22, 5:52:13 PM	53m 6s	Brayan.Vasquez@jala.university	Brayan.Vasquez@jala.university	Presenter
Maria Marquina Guevara	11/15/22, 4:59:29 PM	11/15/22, 5:52:10 PM	52m 40s	Maria.Marquina@jala.university	Maria.Marquina@jala.university	Organizer
Miguel Gemio Quispe	11/15/22, 5:00:00 PM	11/15/22, 5:52:09 PM	52m 9s	Miguel.Gemio@jala.university	Miguel.Gemio@jala.university	Presenter
Alejandra Maldonado	11/15/22, 5:00:17 PM	11/15/22, 6:07:06 PM	1h 6m 48s	Alejandra.Maldonado@jala.university	Alejandra.Maldonado@jala.university	Presenter
Diego Quisbert Gutierrez	11/15/22, 5:00:28 PM	11/15/22, 5:52:13 PM	51m 44s	Diego.Quisbert@jala.university	Diego.Quisbert@jala.university	Presenter
Sebastian Arbelaez Meneses	11/15/22, 5:00:48 PM	11/15/22, 5:52:09 PM	51m 21s	Sebastian.Arbelaez@jala.university	Sebastian.Arbelaez@jala.university	Presenter
Israel Zurita Sanchez	11/15/22, 5:01:03 PM	11/15/22, 5:52:07 PM	51m 4s	Israel.Zurita@jala.university	Israel.Zurita@jala.university	Presenter
Alex Perez Castillo	11/15/22, 5:01:18 PM	11/15/22, 5:52:15 PM	50m 57s	Alex.Perez@jala.university	Alex.Perez@jala.university	Presenter
Dayana Hernandez Aquize	11/15/22, 5:02:44 PM	11/15/22, 5:52:14 PM	49m 30s	Dayana.Hernandez@jala.university	Dayana.Hernandez@jala.university	Presenter
Miguel Paricahua Lopez	11/15/22, 5:04:20 PM	11/15/22, 5:52:10 PM	47m 50s	Miguel.Paricahua@jala.university	Miguel.Paricahua@jala.university	Presenter
Ivan Gonzalez de la Torre	11/15/22, 5:08:24 PM	11/15/22, 5:52:07 PM	43m 42s	Ivan.Gonzalez@jala.university	Ivan.Gonzalez@jala.university	Presenter
Vanessa Tejerina Flores	11/15/22, 5:54:43 PM	11/15/22, 5:55:20 PM	36s	Vanessa.Tejerina@jala.university	Vanessa.Tejerina@jala.university	Presenter

3. In-Meeting activities
Name	Join time	Leave time	Duration	Email	Role
Rodrigo Morales Rivas	11/15/22, 4:56:16 PM	11/15/22, 5:52:18 PM	56m 1s	Rodrigo.Morales@jala.university	Presenter
Diego Alarcon Inturias	11/15/22, 4:56:27 PM	11/15/22, 5:52:11 PM	55m 43s	Diego.Alarcon@jala.university	Presenter
Renan Boaventura	11/15/22, 4:56:27 PM	11/15/22, 5:52:12 PM	55m 44s	Renan.Boaventura@jala.university	Presenter
Miguel Pozo Morales	11/15/22, 4:56:32 PM	11/15/22, 5:52:13 PM	55m 40s	Miguel.Pozo@jala.university	Presenter
Andre Arroyo Hinojosa	11/15/22, 4:57:05 PM	11/15/22, 5:52:19 PM	55m 13s	Andre.Arroyo@jala.university	Presenter
Jose Mendoza Antonio	11/15/22, 4:57:11 PM	11/15/22, 5:52:16 PM	55m 4s	Jose.Mendoza@jala.university	Presenter
Kevin Butvilofsky	11/15/22, 4:58:25 PM	11/15/22, 5:52:10 PM	53m 44s	Kevin.Butvilofsky@jala.university	Presenter
Nelson Delgado Colque	11/15/22, 4:58:57 PM	11/15/22, 5:52:10 PM	53m 13s	Nelson.Delgado@jala.university	Presenter
Brayan Vasquez Rojas	11/15/22, 4:59:06 PM	11/15/22, 5:52:13 PM	53m 6s	Brayan.Vasquez@jala.university	Presenter
Maria Marquina Guevara	11/15/22, 4:59:29 PM	11/15/22, 5:52:10 PM	52m 40s	Maria.Marquina@jala.university	Organizer
Miguel Gemio Quispe	11/15/22, 5:00:00 PM	11/15/22, 5:52:09 PM	52m 9s	Miguel.Gemio@jala.university	Presenter
Alejandra Maldonado	11/15/22, 5:00:17 PM	11/15/22, 6:07:06 PM	1h 6m 48s	Alejandra.Maldonado@jala.university	Presenter
Diego Quisbert Gutierrez	11/15/22, 5:00:28 PM	11/15/22, 5:52:13 PM	51m 44s	Diego.Quisbert@jala.university	Presenter
Sebastian Arbelaez Meneses	11/15/22, 5:00:48 PM	11/15/22, 5:52:09 PM	51m 21s	Sebastian.Arbelaez@jala.university	Presenter
Israel Zurita Sanchez	11/15/22, 5:01:03 PM	11/15/22, 5:52:07 PM	51m 4s	Israel.Zurita@jala.university	Presenter
Alex Perez Castillo	11/15/22, 5:01:18 PM	11/15/22, 5:52:15 PM	50m 57s	Alex.Perez@jala.university	Presenter
Dayana Hernandez Aquize	11/15/22, 5:02:44 PM	11/15/22, 5:52:14 PM	49m 30s	Dayana.Hernandez@jala.university	Presenter
Miguel Paricahua Lopez	11/15/22, 5:04:20 PM	11/15/22, 5:52:10 PM	47m 50s	Miguel.Paricahua@jala.university	Presenter
Ivan Gonzalez de la Torre	11/15/22, 5:08:24 PM	11/15/22, 5:52:07 PM	43m 42s	Ivan.Gonzalez@jala.university	Presenter
Vanessa Tejerina Flores	11/15/22, 5:54:43 PM	11/15/22, 5:55:20 PM	36s	Vanessa.Tejerina@jala.university	Presenter
