1. Summary
Title	Practice Modulo 1 - Grupo 4
Id	Practice Modulo 1 - Grupo 4
Attended participants	2
Start Time	10/22/22, 5:56:43 PM
End Time	10/22/22, 6:03:15 PM
Duration	6m 32s

2. Participants
Name	First join	Last leave	In-meeting duration	Email	Participant ID (UPN)	Role
Patricio Rodriguez Lazarte	10/22/22, 5:56:49 PM	10/22/22, 6:03:15 PM	6m 26s	Patricio.Rodriguez@fundacion-jala.org	Patricio.Rodriguez@fundacion-jala.org	Presenter
Gabriel Cabero Torrico	10/22/22, 5:57:23 PM	10/22/22, 6:00:49 PM	3m 26s	Gabriel.Cabero@fundacion-jala.org	Gabriel.Cabero@fundacion-jala.org	Presenter

3. In-Meeting activities
Name	Join_time	Leave_time	Duration	Email	Role
Patricio Rodriguez Lazarte	10/22/22, 5:56:49 PM	10/22/22, 6:03:15 PM	6m 26s	Patricio.Rodriguez@fundacion-jala.org	Presenter
Gabriel Cabero Torrico	10/22/22, 5:57:23 PM	10/22/22, 6:00:49 PM	3m 26s	Gabriel.Cabero@fundacion-jala.org	Presenter

