1. Summary
Title	Python Training [week 6] - [week 13]
Id	Python Training [week 6] - [week 13]
Attended participants	19
Start Time	11/17/22, 4:54:50 PM
End Time	11/17/22, 6:12:33 PM
Duration	1h 17m 43s

2. Participants
Name	First join	Last leave	In-meeting duration	Email	Participant ID (UPN)	Role
Kevin Butvilofsky	11/17/22, 4:54:56 PM	11/17/22, 6:10:11 PM	1h 15m 15s	Kevin.Butvilofsky@jala.university	Kevin.Butvilofsky@jala.university	Presenter
Diego Alarcon Inturias	11/17/22, 4:55:05 PM	11/17/22, 6:09:51 PM	1h 14m 46s	Diego.Alarcon@jala.university	Diego.Alarcon@jala.university	Presenter
Miguel Pozo Morales	11/17/22, 4:55:09 PM	11/17/22, 6:09:55 PM	1h 14m 46s	Miguel.Pozo@jala.university	Miguel.Pozo@jala.university	Presenter
Sebastian Arbelaez Meneses	11/17/22, 4:55:13 PM	11/17/22, 6:09:52 PM	1h 14m 39s	Sebastian.Arbelaez@jala.university	Sebastian.Arbelaez@jala.university	Presenter
Andre Arroyo Hinojosa	11/17/22, 4:55:15 PM	11/17/22, 6:09:54 PM	1h 14m 39s	Andre.Arroyo@jala.university	Andre.Arroyo@jala.university	Presenter
Rodrigo Morales Rivas	11/17/22, 4:55:27 PM	11/17/22, 6:09:55 PM	1h 14m 28s	Rodrigo.Morales@jala.university	Rodrigo.Morales@jala.university	Presenter
Brayan Vasquez Rojas	11/17/22, 4:55:44 PM	11/17/22, 6:09:59 PM	1h 14m 15s	Brayan.Vasquez@jala.university	Brayan.Vasquez@jala.university	Presenter
Miguel Paricahua Lopez	11/17/22, 4:57:02 PM	11/17/22, 6:09:57 PM	1h 12m 55s	Miguel.Paricahua@jala.university	Miguel.Paricahua@jala.university	Presenter
Jose Mendoza Antonio	11/17/22, 4:57:31 PM	11/17/22, 6:09:56 PM	1h 12m 25s	Jose.Mendoza@jala.university	Jose.Mendoza@jala.university	Presenter
Diego Quisbert Gutierrez	11/17/22, 4:57:51 PM	11/17/22, 6:09:54 PM	1h 12m 3s	Diego.Quisbert@jala.university	Diego.Quisbert@jala.university	Presenter
Dayana Hernandez Aquize	11/17/22, 4:58:01 PM	11/17/22, 6:09:55 PM	1h 11m 54s	Dayana.Hernandez@jala.university	Dayana.Hernandez@jala.university	Presenter
Renan Boaventura	11/17/22, 4:58:08 PM	11/17/22, 6:09:55 PM	1h 11m 47s	Renan.Boaventura@jala.university	Renan.Boaventura@jala.university	Presenter
Miguel Gemio Quispe	11/17/22, 4:58:35 PM	11/17/22, 6:12:33 PM	1h 13m 58s	Miguel.Gemio@jala.university	Miguel.Gemio@jala.university	Presenter
Maria Marquina Guevara	11/17/22, 4:59:26 PM	11/17/22, 6:09:54 PM	1h 10m 28s	Maria.Marquina@jala.university	Maria.Marquina@jala.university	Organizer
Nelson Delgado Colque	11/17/22, 4:59:43 PM	11/17/22, 6:09:55 PM	1h 10m 12s	Nelson.Delgado@jala.university	Nelson.Delgado@jala.university	Presenter
Alejandra Maldonado	11/17/22, 5:01:38 PM	11/17/22, 6:09:56 PM	1h 8m 18s	Alejandra.Maldonado@jala.university	Alejandra.Maldonado@jala.university	Presenter
Israel Zurita Sanchez	11/17/22, 5:01:42 PM	11/17/22, 6:09:54 PM	1h 8m 12s	Israel.Zurita@jala.university	Israel.Zurita@jala.university	Presenter
Alex Perez Castillo	11/17/22, 5:04:07 PM	11/17/22, 6:09:56 PM	1h 5m 49s	Alex.Perez@jala.university	Alex.Perez@jala.university	Presenter
Ivan Gonzalez de la Torre	11/17/22, 5:04:14 PM	11/17/22, 6:09:51 PM	1h 5m 37s	Ivan.Gonzalez@jala.university	Ivan.Gonzalez@jala.university	Presenter

3. In-Meeting activities
Name	Join_time	Leave_time	Duration	Email	Role
Kevin Butvilofsky	11/17/22, 4:54:56 PM	11/17/22, 6:10:11 PM	1h 15m 15s	Kevin.Butvilofsky@jala.university	Presenter
Diego Alarcon Inturias	11/17/22, 4:55:05 PM	11/17/22, 6:09:51 PM	1h 14m 46s	Diego.Alarcon@jala.university	Presenter
Miguel Pozo Morales	11/17/22, 4:55:09 PM	11/17/22, 6:09:55 PM	1h 14m 46s	Miguel.Pozo@jala.university	Presenter
Sebastian Arbelaez Meneses	11/17/22, 4:55:13 PM	11/17/22, 6:09:52 PM	1h 14m 39s	Sebastian.Arbelaez@jala.university	Presenter
Andre Arroyo Hinojosa	11/17/22, 4:55:15 PM	11/17/22, 6:09:54 PM	1h 14m 39s	Andre.Arroyo@jala.university	Presenter
Rodrigo Morales Rivas	11/17/22, 4:55:27 PM	11/17/22, 6:09:55 PM	1h 14m 28s	Rodrigo.Morales@jala.university	Presenter
Brayan Vasquez Rojas	11/17/22, 4:55:44 PM	11/17/22, 6:09:59 PM	1h 14m 15s	Brayan.Vasquez@jala.university	Presenter
Miguel Paricahua Lopez	11/17/22, 4:57:02 PM	11/17/22, 6:09:57 PM	1h 12m 55s	Miguel.Paricahua@jala.university	Presenter
Jose Mendoza Antonio	11/17/22, 4:57:31 PM	11/17/22, 6:09:56 PM	1h 12m 25s	Jose.Mendoza@jala.university	Presenter
Diego Quisbert Gutierrez	11/17/22, 4:57:51 PM	11/17/22, 6:09:54 PM	1h 12m 3s	Diego.Quisbert@jala.university	Presenter
Dayana Hernandez Aquize	11/17/22, 4:58:01 PM	11/17/22, 6:09:55 PM	1h 11m 54s	Dayana.Hernandez@jala.university	Presenter
Renan Boaventura	11/17/22, 4:58:08 PM	11/17/22, 6:09:55 PM	1h 11m 47s	Renan.Boaventura@jala.university	Presenter
Miguel Gemio Quispe	11/17/22, 4:58:35 PM	11/17/22, 6:12:33 PM	1h 13m 58s	Miguel.Gemio@jala.university	Presenter
Maria Marquina Guevara	11/17/22, 4:59:26 PM	11/17/22, 6:09:54 PM	1h 10m 28s	Maria.Marquina@jala.university	Organizer
Nelson Delgado Colque	11/17/22, 4:59:43 PM	11/17/22, 6:09:55 PM	1h 10m 12s	Nelson.Delgado@jala.university	Presenter
Alejandra Maldonado	11/17/22, 5:01:38 PM	11/17/22, 6:09:56 PM	1h 8m 18s	Alejandra.Maldonado@jala.university	Presenter
Israel Zurita Sanchez	11/17/22, 5:01:42 PM	11/17/22, 6:09:54 PM	1h 8m 12s	Israel.Zurita@jala.university	Presenter
Alex Perez Castillo	11/17/22, 5:04:07 PM	11/17/22, 6:09:56 PM	1h 5m 49s	Alex.Perez@jala.university	Presenter
Ivan Gonzalez de la Torre	11/17/22, 5:04:14 PM	11/17/22, 6:09:51 PM	1h 5m 37s	Ivan.Gonzalez@jala.university	Presenter

