1. Summary
Title	Python training
Id	Python training
Attended participants	9
Start Time	9/14/22, 8:29:23 AM
End Time	9/14/22, 10:03:56 AM
Duration	1h 34m 33s

2. Participants
Name	First join	Last leave	In-meeting duration	Email	Participant ID (UPN)	Role
Diego Jauregui Salvatierra	9/14/22, 8:29:28 AM	9/14/22, 10:03:48 AM	1h 34m 20s	Diego.Jauregui@jala.university	Diego.Jauregui@jala.university	Presenter
Sergio Mallea Morales	9/14/22, 8:30:18 AM	9/14/22, 10:03:51 AM	1h 33m 33s	Sergio.Mallea@jala.university	Sergio.Mallea@jala.university	Presenter
Andres Galvis Bolivar	9/14/22, 8:30:31 AM	9/14/22, 10:03:47 AM	1h 33m 16s	Andres.Galvis@jala.university	Andres.Galvis@jala.university	Presenter
Camilo Villalba Sanz	9/14/22, 8:30:38 AM	9/14/22, 10:03:51 AM	1h 33m 13s	Camilo.Villalba@jala.university	Camilo.Villalba@jala.university	Presenter
Maria Marquina Guevara	9/14/22, 8:30:38 AM	9/14/22, 10:03:56 AM	1h 33m 18s	Maria.Marquina@jala.university	Maria.Marquina@jala.university	Organizer
Adrian Clavijo Lopez	9/14/22, 8:31:20 AM	9/14/22, 10:03:52 AM	1h 32m 32s	Adrian.Clavijo@jala.university	Adrian.Clavijo@jala.university	Presenter
Jason Pineda Serna	9/14/22, 8:32:39 AM	9/14/22, 10:03:49 AM	1h 31m 10s	Jason.Pineda@jala.university	Jason.Pineda@jala.university	Presenter
Jesus Vallecilla Solano	9/14/22, 8:42:33 AM	9/14/22, 10:03:50 AM	1h 21m 17s	Jesus.Vallecilla@jala.university	Jesus.Vallecilla@jala.university	Presenter
Martin Ferreyra	9/14/22, 9:27:02 AM	9/14/22, 10:03:54 AM	36m 52s	Martin.Ferreyra@jala.university	Martin.Ferreyra@jala.university	Presenter

3. In-Meeting activities
Name	Join_time	Leave_time	Duration	Email	Role
Diego Jauregui Salvatierra	9/14/22, 8:29:28 AM	9/14/22, 10:03:48 AM	1h 34m 20s	Diego.Jauregui@jala.university	Presenter
Sergio Mallea Morales	9/14/22, 8:30:18 AM	9/14/22, 10:03:51 AM	1h 33m 33s	Sergio.Mallea@jala.university	Presenter
Andres Galvis Bolivar	9/14/22, 8:30:31 AM	9/14/22, 10:03:47 AM	1h 33m 16s	Andres.Galvis@jala.university	Presenter
Camilo Villalba Sanz	9/14/22, 8:30:38 AM	9/14/22, 10:03:51 AM	1h 33m 13s	Camilo.Villalba@jala.university	Presenter
Maria Marquina Guevara	9/14/22, 8:30:38 AM	9/14/22, 10:03:56 AM	1h 33m 18s	Maria.Marquina@jala.university	Organizer
Adrian Clavijo Lopez	9/14/22, 8:31:20 AM	9/14/22, 10:03:52 AM	1h 32m 32s	Adrian.Clavijo@jala.university	Presenter
Jason Pineda Serna	9/14/22, 8:32:39 AM	9/14/22, 10:03:49 AM	1h 31m 10s	Jason.Pineda@jala.university	Presenter
Jesus Vallecilla Solano	9/14/22, 8:42:33 AM	9/14/22, 10:03:50 AM	1h 21m 17s	Jesus.Vallecilla@jala.university	Presenter
Martin Ferreyra	9/14/22, 9:27:02 AM	9/14/22, 10:03:54 AM	36m 52s	Martin.Ferreyra@jala.university	Presenter

