1. Summary
Title	Python Training [week 6] - [week 13]
Id	Python Training [week 6] - [week 13]
Attended participants	18
Start Time	11/11/22, 4:56:05 PM
End Time	11/11/22, 6:07:09 PM
Duration	1h 11m 4s

2. Participants
Name	First join	Last leave	In-meeting duration	Email	Participant ID (UPN)	Role
Rodrigo Morales Rivas	11/11/22, 4:56:11 PM	11/11/22, 6:07:03 PM	1h 10m 52s	Rodrigo.Morales@jala.university	Rodrigo.Morales@jala.university	Presenter
Diego Alarcon Inturias	11/11/22, 4:56:20 PM	11/11/22, 6:07:01 PM	1h 10m 41s	Diego.Alarcon@jala.university	Diego.Alarcon@jala.university	Presenter
Sebastian Arbelaez Meneses	11/11/22, 4:56:23 PM	11/11/22, 6:06:56 PM	1h 10m 33s	Sebastian.Arbelaez@jala.university	Sebastian.Arbelaez@jala.university	Presenter
Miguel Pozo Morales	11/11/22, 4:56:28 PM	11/11/22, 6:07:03 PM	1h 10m 35s	Miguel.Pozo@jala.university	Miguel.Pozo@jala.university	Presenter
Kevin Butvilofsky	11/11/22, 4:57:34 PM	11/11/22, 6:06:58 PM	1h 9m 24s	Kevin.Butvilofsky@jala.university	Kevin.Butvilofsky@jala.university	Presenter
Miguel Gemio Quispe	11/11/22, 4:57:48 PM	11/11/22, 6:07:01 PM	1h 9m 13s	Miguel.Gemio@jala.university	Miguel.Gemio@jala.university	Presenter
Brayan Vasquez Rojas	11/11/22, 4:57:58 PM	11/11/22, 6:07:09 PM	1h 9m 11s	Brayan.Vasquez@jala.university	Brayan.Vasquez@jala.university	Presenter
Miguel Paricahua Lopez	11/11/22, 4:58:02 PM	11/11/22, 6:07:04 PM	1h 9m 2s	Miguel.Paricahua@jala.university	Miguel.Paricahua@jala.university	Presenter
Jose Mendoza Antonio	11/11/22, 4:58:37 PM	11/11/22, 6:07:01 PM	1h 8m 24s	Jose.Mendoza@jala.university	Jose.Mendoza@jala.university	Presenter
Diego Quisbert Gutierrez	11/11/22, 4:58:54 PM	11/11/22, 6:07:04 PM	1h 8m 10s	Diego.Quisbert@jala.university	Diego.Quisbert@jala.university	Presenter
Israel Zurita Sanchez	11/11/22, 4:59:33 PM	11/11/22, 6:06:57 PM	1h 7m 24s	Israel.Zurita@jala.university	Israel.Zurita@jala.university	Presenter
Renan Boaventura	11/11/22, 4:59:37 PM	11/11/22, 6:07:06 PM	1h 7m 29s	Renan.Boaventura@jala.university	Renan.Boaventura@jala.university	Presenter
Dayana Hernandez Aquize	11/11/22, 4:59:46 PM	11/11/22, 6:07:06 PM	1h 7m 20s	Dayana.Hernandez@jala.university	Dayana.Hernandez@jala.university	Presenter
Nelson Delgado Colque	11/11/22, 5:00:24 PM	11/11/22, 6:06:55 PM	1h 6m 31s	Nelson.Delgado@jala.university	Nelson.Delgado@jala.university	Presenter
Alex Perez Castillo	11/11/22, 5:01:03 PM	11/11/22, 6:07:07 PM	1h 6m 4s	Alex.Perez@jala.university	Alex.Perez@jala.university	Presenter
Alejandra Maldonado	11/11/22, 5:02:30 PM	11/11/22, 6:07:05 PM	1h 4m 35s	Alejandra.Maldonado@jala.university	Alejandra.Maldonado@jala.university	Presenter
Vanessa Tejerina Flores	11/11/22, 5:18:39 PM	11/11/22, 6:07:05 PM	48m 26s	Vanessa.Tejerina@jala.university	Vanessa.Tejerina@jala.university	Presenter
Maria Marquina Guevara	11/11/22, 5:19:49 PM	11/11/22, 6:07:02 PM	47m 13s	Maria.Marquina@jala.university	Maria.Marquina@jala.university	Organizer

3. In-Meeting activities
Name	Join_time	Leave_time	Duration	Email	Role
Rodrigo Morales Rivas	11/11/22, 4:56:11 PM	11/11/22, 6:07:03 PM	1h 10m 52s	Rodrigo.Morales@jala.university	Presenter
Diego Alarcon Inturias	11/11/22, 4:56:20 PM	11/11/22, 6:07:01 PM	1h 10m 41s	Diego.Alarcon@jala.university	Presenter
Sebastian Arbelaez Meneses	11/11/22, 4:56:23 PM	11/11/22, 6:06:56 PM	1h 10m 33s	Sebastian.Arbelaez@jala.university	Presenter
Miguel Pozo Morales	11/11/22, 4:56:28 PM	11/11/22, 6:07:03 PM	1h 10m 35s	Miguel.Pozo@jala.university	Presenter
Kevin Butvilofsky	11/11/22, 4:57:34 PM	11/11/22, 6:06:58 PM	1h 9m 24s	Kevin.Butvilofsky@jala.university	Presenter
Miguel Gemio Quispe	11/11/22, 4:57:48 PM	11/11/22, 6:07:01 PM	1h 9m 13s	Miguel.Gemio@jala.university	Presenter
Brayan Vasquez Rojas	11/11/22, 4:57:58 PM	11/11/22, 6:07:09 PM	1h 9m 11s	Brayan.Vasquez@jala.university	Presenter
Miguel Paricahua Lopez	11/11/22, 4:58:02 PM	11/11/22, 6:07:04 PM	1h 9m 2s	Miguel.Paricahua@jala.university	Presenter
Jose Mendoza Antonio	11/11/22, 4:58:37 PM	11/11/22, 6:07:01 PM	1h 8m 24s	Jose.Mendoza@jala.university	Presenter
Diego Quisbert Gutierrez	11/11/22, 4:58:54 PM	11/11/22, 6:07:04 PM	1h 8m 10s	Diego.Quisbert@jala.university	Presenter
Israel Zurita Sanchez	11/11/22, 4:59:33 PM	11/11/22, 6:06:57 PM	1h 7m 24s	Israel.Zurita@jala.university	Presenter
Renan Boaventura	11/11/22, 4:59:37 PM	11/11/22, 6:07:06 PM	1h 7m 29s	Renan.Boaventura@jala.university	Presenter
Dayana Hernandez Aquize	11/11/22, 4:59:46 PM	11/11/22, 6:07:06 PM	1h 7m 20s	Dayana.Hernandez@jala.university	Presenter
Nelson Delgado Colque	11/11/22, 5:00:24 PM	11/11/22, 6:06:55 PM	1h 6m 31s	Nelson.Delgado@jala.university	Presenter
Alex Perez Castillo	11/11/22, 5:01:03 PM	11/11/22, 6:07:07 PM	1h 6m 4s	Alex.Perez@jala.university	Presenter
Alejandra Maldonado	11/11/22, 5:02:30 PM	11/11/22, 6:07:05 PM	1h 4m 35s	Alejandra.Maldonado@jala.university	Presenter
Vanessa Tejerina Flores	11/11/22, 5:18:39 PM	11/11/22, 6:07:05 PM	48m 26s	Vanessa.Tejerina@jala.university	Presenter
Maria Marquina Guevara	11/11/22, 5:19:49 PM	11/11/22, 6:07:02 PM	47m 13s	Maria.Marquina@jala.university	Organizer

