1. Summary
Title	Practice Modulo 1 - Grupo 4
Id	Practice Modulo 1 - Grupo 4
Attended participants	19
Start Time	10/12/22, 5:51:52 PM
End Time	10/12/22, 7:32:44 PM
Duration	1h 40m 52s

2. Participants
Name	First join	Last leave	In-meeting duration	Email	Participant ID (UPN)	Role
Gabriel Cabero Torrico	10/12/22, 5:52:00 PM	10/12/22, 7:32:34 PM	1h 40m 34s	Gabriel.Cabero@fundacion-jala.org	Gabriel.Cabero@fundacion-jala.org	Presenter
Santiago Martinez Saavedra	10/12/22, 5:52:18 PM	10/12/22, 7:32:23 PM	1h 40m 5s	Santiago.Martinez@fundacion-jala.org	Santiago.Martinez@fundacion-jala.org	Presenter
Isaac Enriquez Ona	10/12/22, 5:53:32 PM	10/12/22, 7:32:31 PM	1h 38m 59s	Isaac.Enriquez@fundacion-jala.org	Isaac.Enriquez@fundacion-jala.org	Presenter
Daniel Moscoso Sanzetenea	10/12/22, 5:57:08 PM	10/12/22, 7:32:30 PM	1h 35m 22s	Daniel.Moscoso@fundacion-jala.org	Daniel.Moscoso@fundacion-jala.org	Presenter
Katerin Apaza Romero	10/12/22, 5:57:25 PM	10/12/22, 7:32:24 PM	1h 34m 59s	Katerin.Apaza@fundacion-jala.org	Katerin.Apaza@fundacion-jala.org	Presenter
Diego Terrazas Sanchez	10/12/22, 5:57:41 PM	10/12/22, 7:32:33 PM	1h 34m 52s	Diego.Terrazas@fundacion-jala.org	Diego.Terrazas@fundacion-jala.org	Presenter
Salome Quispe Guarachi	10/12/22, 5:57:44 PM	10/12/22, 7:32:36 PM	1h 34m 52s	Salome.Quispe@fundacion-jala.org	Salome.Quispe@fundacion-jala.org	Presenter
Maria Marquina Guevara	10/12/22, 5:57:58 PM	10/12/22, 7:32:44 PM	1h 34m 46s	Maria.Marquina@fundacion-jala.org	Maria.Marquina@fundacion-jala.org	Organizer
Emily Cadena Quisbert	10/12/22, 5:58:13 PM	10/12/22, 7:32:30 PM	1h 34m 17s	Emily.Cadena@fundacion-jala.org	Emily.Cadena@fundacion-jala.org	Presenter
Pablo Maiz Hinojosa	10/12/22, 5:58:15 PM	10/12/22, 7:32:18 PM	1h 34m 3s	Pablo.Maiz@fundacion-jala.org	Pablo.Maiz@fundacion-jala.org	Presenter
Patricio Rodriguez Lazarte	10/12/22, 5:58:32 PM	10/12/22, 7:32:15 PM	1h 33m 43s	Patricio.Rodriguez@fundacion-jala.org	Patricio.Rodriguez@fundacion-jala.org	Presenter
Walker Peredo Escobar	10/12/22, 5:58:40 PM	10/12/22, 7:32:20 PM	1h 33m 40s	Walker.Peredo@fundacion-jala.org	Walker.Peredo@fundacion-jala.org	Presenter
Adriano Quiroga Encinas	10/12/22, 5:58:42 PM	10/12/22, 7:32:26 PM	1h 33m 44s	Adriano.Quiroga@fundacion-jala.org	Adriano.Quiroga@fundacion-jala.org	Presenter
Daniel Saucedo Gutierrez	10/12/22, 5:59:15 PM	10/12/22, 7:32:16 PM	1h 33m 1s	Daniel.Saucedo@fundacion-jala.org	Daniel.Saucedo@fundacion-jala.org	Presenter
Fernando Sivila Ramirez	10/12/22, 6:01:48 PM	10/12/22, 7:32:23 PM	1h 30m 35s	Fernando.Sivila@fundacion-jala.org	Fernando.Sivila@fundacion-jala.org	Presenter
Daniel Ticona Caceres	10/12/22, 6:04:34 PM	10/12/22, 7:32:26 PM	1h 27m 52s	Daniel.Ticona@fundacion-jala.org	Daniel.Ticona@fundacion-jala.org	Presenter
Andre Amurrio Vargas	10/12/22, 6:06:21 PM	10/12/22, 7:32:12 PM	1h 25m 51s	Andre.Amurrio@fundacion-jala.org	Andre.Amurrio@fundacion-jala.org	Presenter
Jasiel Yapura Fernandez	10/12/22, 6:13:39 PM	10/12/22, 7:32:25 PM	1h 18m 46s	Jasiel.Yapura@fundacion-jala.org	Jasiel.Yapura@fundacion-jala.org	Presenter
Saul Pereira Condori	10/12/22, 6:33:53 PM	10/12/22, 6:49:55 PM	16m 2s	Saul.Pereira@fundacion-jala.org	Saul.Pereira@fundacion-jala.org	Presenter

3. In-Meeting activities
Name	Join_time	Leave_time	Duration	Email	Role
Gabriel Cabero Torrico	10/12/22, 5:52:00 PM	10/12/22, 7:32:34 PM	1h 40m 34s	Gabriel.Cabero@fundacion-jala.org	Presenter
Santiago Martinez Saavedra	10/12/22, 5:52:18 PM	10/12/22, 7:32:23 PM	1h 40m 5s	Santiago.Martinez@fundacion-jala.org	Presenter
Isaac Enriquez Ona	10/12/22, 5:53:32 PM	10/12/22, 5:55:55 PM	2m 23s	Isaac.Enriquez@fundacion-jala.org	Presenter
Isaac Enriquez Ona	10/12/22, 5:58:35 PM	10/12/22, 7:32:31 PM	1h 33m 56s	Isaac.Enriquez@fundacion-jala.org	Presenter
Daniel Moscoso Sanzetenea	10/12/22, 5:57:08 PM	10/12/22, 7:32:30 PM	1h 35m 22s	Daniel.Moscoso@fundacion-jala.org	Presenter
Katerin Apaza Romero	10/12/22, 5:57:25 PM	10/12/22, 6:28:56 PM	31m 31s	Katerin.Apaza@fundacion-jala.org	Presenter
Katerin Apaza Romero	10/12/22, 6:34:57 PM	10/12/22, 7:32:24 PM	57m 27s	Katerin.Apaza@fundacion-jala.org	Presenter
Diego Terrazas Sanchez	10/12/22, 5:57:41 PM	10/12/22, 7:32:33 PM	1h 34m 52s	Diego.Terrazas@fundacion-jala.org	Presenter
Salome Quispe Guarachi	10/12/22, 5:57:44 PM	10/12/22, 7:32:36 PM	1h 34m 52s	Salome.Quispe@fundacion-jala.org	Presenter
Maria Marquina Guevara	10/12/22, 5:57:58 PM	10/12/22, 7:32:44 PM	1h 34m 46s	Maria.Marquina@fundacion-jala.org	Organizer
Emily Cadena Quisbert	10/12/22, 5:58:13 PM	10/12/22, 6:16:39 PM	18m 26s	Emily.Cadena@fundacion-jala.org	Presenter
Emily Cadena Quisbert	10/12/22, 6:21:31 PM	10/12/22, 7:32:30 PM	1h 10m 59s	Emily.Cadena@fundacion-jala.org	Presenter
Pablo Maiz Hinojosa	10/12/22, 5:58:15 PM	10/12/22, 7:32:18 PM	1h 34m 3s	Pablo.Maiz@fundacion-jala.org	Presenter
Patricio Rodriguez Lazarte	10/12/22, 5:58:32 PM	10/12/22, 7:32:15 PM	1h 33m 43s	Patricio.Rodriguez@fundacion-jala.org	Presenter
Walker Peredo Escobar	10/12/22, 5:58:40 PM	10/12/22, 7:32:20 PM	1h 33m 40s	Walker.Peredo@fundacion-jala.org	Presenter
Adriano Quiroga Encinas	10/12/22, 5:58:42 PM	10/12/22, 7:32:26 PM	1h 33m 44s	Adriano.Quiroga@fundacion-jala.org	Presenter
Daniel Saucedo Gutierrez	10/12/22, 5:59:15 PM	10/12/22, 6:02:07 PM	2m 52s	Daniel.Saucedo@fundacion-jala.org	Presenter
Daniel Saucedo Gutierrez	10/12/22, 6:05:20 PM	10/12/22, 7:32:16 PM	1h 26m 56s	Daniel.Saucedo@fundacion-jala.org	Presenter
Fernando Sivila Ramirez	10/12/22, 6:01:48 PM	10/12/22, 7:32:23 PM	1h 30m 35s	Fernando.Sivila@fundacion-jala.org	Presenter
Daniel Ticona Caceres	10/12/22, 6:04:34 PM	10/12/22, 7:32:26 PM	1h 27m 52s	Daniel.Ticona@fundacion-jala.org	Presenter
Andre Amurrio Vargas	10/12/22, 6:06:21 PM	10/12/22, 7:32:12 PM	1h 25m 51s	Andre.Amurrio@fundacion-jala.org	Presenter
Jasiel Yapura Fernandez	10/12/22, 6:13:39 PM	10/12/22, 7:32:25 PM	1h 18m 46s	Jasiel.Yapura@fundacion-jala.org	Presenter
Saul Pereira Condori	10/12/22, 6:33:53 PM	10/12/22, 6:39:32 PM	5m 39s	Saul.Pereira@fundacion-jala.org	Presenter
Saul Pereira Condori	10/12/22, 6:45:28 PM	10/12/22, 6:49:55 PM	4m 27s	Saul.Pereira@fundacion-jala.org	Presenter

