%YAML 1.1
%TAG !u! tag:unity3d.com,2011:
--- !u!1045 &1
EditorBuildSettings:
  m_ObjectHideFlags: 0
  serializedVersion: 2
  m_Scenes:
  - enabled: 1
    path: Assets/AltUnityTesterExamples/Scenes/Scene 1 AltUnityDriverTestScene.unity
    guid: b52c047743c7b4508908a92db3f971b6
  - enabled: 1
    path: Assets/AltUnityTesterExamples/Scenes/Scene 2 Draggable Panel.unity
    guid: 838436750d0cf48a685923371f66cea6
  - enabled: 1
    path: Assets/AltUnityTesterExamples/Scenes/Scene 3 Drag And Drop.unity
    guid: 40116c4af15e1444f8e21d1de1f4678f
  - enabled: 1
    path: Assets/AltUnityTesterExamples/Scenes/Scene 4 No Cameras.unity
    guid: a6e374a17b25deb48ab203b62ab8d49f
  - enabled: 1
    path: Assets/AltUnityTesterExamples/Scenes/Scene 5 Keyboard Input.unity
    guid: 8626d43c31961cd40afa3331309ea18c
  - enabled: 1
    path: Assets/AltUnityTesterExamples/Scenes/Scene6.unity
    guid: 5197c7b6f3ba7a84fbb6c6d5743d3bc7
  m_configObjects: {}
