<?xml version="1.0" encoding="utf-8"?>
<!-- Generator: Adobe Illustrator 21.0.0, SVG Export Plug-In . SVG Version: 6.00 Build 0)  -->
<svg version="1.1" id="Layer_1" xmlns="http://www.w3.org/2000/svg" xmlns:xlink="http://www.w3.org/1999/xlink" x="0px" y="0px"
	 viewBox="0 0 92.8 73" style="enable-background:new 0 0 92.8 73;" xml:space="preserve">
<style type="text/css">
	.st0{opacity:0.6;}
	.st1{fill:#EDEDED;}
</style>
<title>Asset 4</title>
<g id="Layer_2">
	<g id="Producto">
		<g id="FUITPq.tif" class="st0">
			<path class="st1" d="M73,48.6c-1.7,1.4-2.5,3.7-4.3,4.9c-1.3,0.7-2.7,1.2-4.1,1.3c-1.5,1.4-2.2,2.8-3.8,3.8
				c-1.1,0.7-2.5,0.7-3.6,1.3c-1.9,1.1-2.5,2.6-4.1,3.3c-1.5,0.8-2.9,0.5-5.1,1S44,65.9,41.8,66c-4.5,0.2-8-1.8-10.8-3.8
				c-3.9-2.8-6.1-5.6-9.7-9.2c-1.6-1.6-3.4-4-4.9-4.3c-4.6-1.3-12,1.5-15.9-0.8c-0.9-2.2-0.5-4.8-0.5-7.4V24.5
				c0-2.6-0.4-5.2,0.5-7.4c2.7-1.3,5.8-0.8,9-0.8c3,0,6.8,0.7,9.5,0c0.8-0.2,1.2-0.9,2-1.8c4.5-4.5,9.1-8.8,20.2-7.2
				c1.8,0.3,2.8,1.1,4.9,2c5.1-3.4,18.3-2.7,22.8,0.8c2.9,2.3,4.3,5.3,6.9,7.4H84c2.5,0,5.8-0.7,7.4,0.5c2.2,1.6,1,11.9,1,15.1
				c0,4,1.2,13.2-1,14.8c-1.6,1.2-6.8,0.5-9,0.5L73,48.6z M33.1,12.8c-3.4,0.5-5.1,2.8-7.2,4.9c-1.5,1.5-3.2,3.7-4.6,4.1
				c-1.9,0.5-3.7-0.4-5.6,0v21.5h3.1c7,3.9,11.4,14.2,19.4,16.6c1.3,0.5,2.7,0.6,4.1,0.5c1.8-0.2,2.4-1.5,4.1-1.8
				c1-0.1,2,0.6,3.1,0.3c1.9-0.9,3.4-2.3,4.3-4.1c4.2,0.2,5.7-2.5,6.9-5.4c5,1.1,7.7-2.6,6.9-6.1c-0.3-1.2-1.3-2.3-2.3-3.6
				c-2.6-3.4-5.9-7.6-8.2-10.2c-3.5,2.4-4.8,6.1-8.4,7.9c-7.3,3.5-15.1-1.3-15.9-8.2c-0.9-8.4,7-10.2,9-15.9
				C39,12.7,36,12.5,33.1,12.8z M73.2,23C69,20,68.3,15.5,64,13.5c-2.6-1.2-8.3-1.3-11.8-0.8c-3.1,0.5-4.7,3.2-6.4,5.1
				c-2.1,2.5-7.8,7.3-7.6,10.5c0.2,3.4,4,5.4,7.4,4.4c2-0.6,3.9-3.6,5.9-5.9c1.3-1.5,4.1-5.7,6.7-5.4c1.8,0.2,2.3,1.9,2.3,3.6
				C65,30.7,71,35.6,73.2,43.2h3.3c0.1-6.4,0.1-13.4,0-20.2L73.2,23z M8.2,43.2c2.7-0.5,2.3-5.5-1-4.6S5.6,43.7,8.2,43.2L8.2,43.2z
				 M85,43.2c1.3-0.2,2.1-1.3,1.8-3.6C83.1,34.9,79.9,44,85,43.2L85,43.2z"/>
		</g>
	</g>
</g>
</svg>
