<?xml version="1.0" encoding="utf-8"?>
<!-- Generator: Adobe Illustrator 21.0.0, SVG Export Plug-In . SVG Version: 6.00 Build 0)  -->
<svg version="1.1" id="Layer_1" xmlns="http://www.w3.org/2000/svg" xmlns:xlink="http://www.w3.org/1999/xlink" x="0px" y="0px"
	 viewBox="0 0 2554.2 32.4" style="enable-background:new 0 0 2554.2 32.4;" xml:space="preserve">
<style type="text/css">
	.st0{fill:#FFFFFF;}
</style>
<path class="st0" d="M2596.6-0.1H-50.5v0.4c278.8,19.1,768.1,31.8,1325.2,31.8c554.7,0,1042.3-12.6,1321.7-31.6v-0.6
	C2596.4-0.1,2596.6-0.1,2596.6-0.1z"/>
</svg>
