
=== Start: [2021/04/09 20:02:19] === 
Peak bandwidth measurement started...
Peak bandwidth measurement finished.
Analysis started...
Result file: C:\Users\8160240\Desktop\home-task-1\variant-23\advisor\e000\trc000\trc000.advixe 
Application exit code: 0 
Result file: C:\Users\8160240\Desktop\home-task-1\variant-23\advisor\e000\trc000\trc000.advixe 
Analysis completed
=== End: [2021/04/09 20:02:47] === 
