{
  "coffee": [
    {
      "name": "Brew Haven Blend",
      "description": "A signature blend of Arabica and Robusta beans with a rich and bold flavor.",
      "sizes": ["small", "medium", "large"],
      "img": "/src/assets/img/Menu/img.jpg",
      "isSoldOut": false,
      "price": {
        "small": 7,
        "medium": 9,
        "large": 11
      },
      "id": 0
    },
    {
      "name": "Morning Elixir",
      "description": "A light and refreshing blend perfect for kickstarting the day.",
      "sizes": ["small", "medium", "large"],
      "img": "/src/assets/img/Menu/img.jpg",
      "isSoldOut": false,
      "price": {
        "small": 10,
        "medium": 12,
        "large": 14
      },
      "id": 1
    },
    {
      "name": "Velvet Mocha",
      "description": "A luscious combination of espresso, steamed milk, and chocolate.",
      "sizes": ["small", "medium", "large"],
      "img": "/src/assets/img/Menu/img.jpg",
      "isSoldOut": false,
      "price": {
        "small": 6,
        "medium": 8,
        "large": 9
      },
      "id": 2
    },
    {
      "name": "Caramel Macchiato",
      "description": "Espresso with velvety steamed milk and a swirl of caramel.",
      "sizes": ["small", "medium", "large"],
      "img": "/src/assets/img/Menu/img.jpg",
      "isSoldOut": false,
      "price": {
        "small": 5,
        "medium": 7,
        "large": 9
      },
      "id": 3
    },
    {
      "name": "Hazelnut Delight",
      "description": "Smooth and nutty hazelnut-flavored coffee for a delightful sip.",
      "sizes": ["small", "medium", "large"],
      "img": "/src/assets/img/Menu/img.jpg",
      "isSoldOut": false,
      "price": {
        "small": 3,
        "medium": 5,
        "large": 7
      },
      "id": 4
    },
    {
      "name": "Vanilla Dream",
      "description": "A sweet and creamy coffee with a hint of vanilla.",
      "sizes": ["small", "medium", "large"],
      "img": "/src/assets/img/Menu/img.jpg",
      "isSoldOut": true,
      "price": {
        "small": 5,
        "medium": 8,
        "large": 11
      },
      "id": 5
    },
    {
      "name": "Cinnamon Spice Latte",
      "description": "Espresso with steamed milk, cinnamon, and a touch of spice.",
      "sizes": ["small", "medium", "large"],
      "img": "/src/assets/img/Menu/img.jpg",
      "isSoldOut": false,
      "price": {
        "small": 7,
        "medium": 11,
        "large": 15
      },
      "id": 6
    },
    {
      "name": "Espresso Shot",
      "description": "A strong and intense shot of espresso for the coffee purists.",
      "sizes": ["small", "medium", "large"],
      "img": "/src/assets/img/Menu/img.jpg",
      "isSoldOut": false,
      "price": {
        "small": 3,
        "medium": 6,
        "large": 9
      },
      "id": 7
    },
    {
      "name": "Irish Cream Infusion",
      "description": "A rich blend of coffee with the smooth flavor of Irish cream.",
      "sizes": ["small", "medium", "large"],
      "img": "/src/assets/img/Menu/img.jpg",
      "isSoldOut": false,
      "price": {
        "small": 5,
        "medium": 7,
        "large": 9
      },
      "id": 8
    },
    {
      "name": "Coconut Bliss Brew",
      "description": "A tropical twist with coconut-infused coffee for a refreshing taste.",
      "sizes": ["small", "medium", "large"],
      "img": "/src/assets/img/Menu/img.jpg",
      "isSoldOut": false,
      "price": {
        "small": 8,
        "medium": 12,
        "large": 16
      },
      "id": 9
    }
  ],
  "snacks": [
    {
      "name": "Croissants",
      "description": "Light and flaky, our croissants are freshly baked to golden perfection.",
      "img": "/src/assets/img/Menu/pastries/img.jpg",
      "price": 12.99,
      "isSoldOut": false,
      "id": 0
    },
    {
      "name": "Muffins",
      "description": "Choose from an array of moist and flavorful muffins. Options include blueberry, banana nut, and double chocolate.",
      "img": "/src/assets/img/Menu/pastries/img.jpg",
      "price": 5,
      "isSoldOut": false,
      "id": 1
    },
    {
      "name": "Danish Pastries",
      "description": "Our Danish pastries are a delightful blend of buttery layers and sweet fillings.",
      "img": "/src/assets/img/Menu/pastries/img.jpg",
      "price": 3,
      "isSoldOut": true,
      "id": 2
    },
    {
      "name": "Seasonal Specials",
      "description": "We love to surprise you with seasonal pastry delights.",
      "img": "/src/assets/img/Menu/pastries/img.jpg",
      "price": 2.5,
      "isSoldOut": false,
      "id": 3
    }
  ]
}
