"idProva","idExame","data_limite"
"2","6","2019-12-26 13:00:00"
"3","4","2019-12-26 13:00:00"
"3","10","2019-12-26 13:00:00"
"4","7","2019-12-26 13:00:00"
"6","5","2019-12-26 13:00:00"
"8","8","2019-12-26 13:00:00"
"9","7","2019-12-26 13:00:00"
"9","8","2019-12-26 13:00:00"
