<svg width="192" height="23" viewBox="0 0 192 23" fill="none" xmlns="http://www.w3.org/2000/svg">
<path d="M6.93637 3.52C6.47637 3.52 5.96637 3.54 5.40637 3.58C4.84637 3.62 4.38637 3.67 4.02637 3.73V19.48H6.87637C7.73637 19.48 8.48637 19.39 9.12637 19.21C9.76637 19.01 10.2964 18.62 10.7164 18.04C11.1364 17.46 11.4464 16.64 11.6464 15.58C11.8464 14.5 11.9464 13.08 11.9464 11.32C11.9464 9.76 11.8564 8.48 11.6764 7.48C11.5164 6.46 11.2364 5.66 10.8364 5.08C10.4564 4.48 9.94637 4.07 9.30637 3.85C8.66637 3.63 7.87637 3.52 6.93637 3.52ZM1.59637 22C1.11637 22 0.876367 21.77 0.876367 21.31V1.57C1.33637 1.49 1.82637 1.42 2.34637 1.36C2.88637 1.28 3.42637 1.22 3.96637 1.18C4.52637 1.12 5.06637 1.08 5.58637 1.06C6.10637 1.02 6.59637 0.999999 7.05637 0.999999C8.47637 0.999999 9.69637 1.18 10.7164 1.54C11.7364 1.9 12.5764 2.49 13.2364 3.31C13.8964 4.13 14.3764 5.21 14.6764 6.55C14.9964 7.89 15.1564 9.53 15.1564 11.47C15.1564 13.41 14.9964 15.05 14.6764 16.39C14.3764 17.73 13.9064 18.82 13.2664 19.66C12.6264 20.48 11.7964 21.08 10.7764 21.46C9.77637 21.82 8.57637 22 7.17637 22H1.59637ZM29.9632 1.21C30.4232 1.21 30.6532 1.44 30.6532 1.9V3.79H22.0732V10.18H29.1832C29.6432 10.18 29.8732 10.41 29.8732 10.87V12.79H22.0732V19.42H30.2932C30.5132 19.42 30.6832 19.48 30.8032 19.6C30.9432 19.72 31.0132 19.89 31.0132 20.11V22H19.6432C19.1632 22 18.9232 21.77 18.9232 21.31V1.21H29.9632ZM35.0241 22C34.5441 22 34.3041 21.77 34.3041 21.31V1.21H36.7341C36.9541 1.21 37.1241 1.27 37.2441 1.39C37.3841 1.51 37.4541 1.68 37.4541 1.9V19.36H44.8341C45.3141 19.36 45.5541 19.59 45.5541 20.05V22H35.0241ZM59.4945 1.21C59.9545 1.21 60.1845 1.44 60.1845 1.9V3.79H51.6045V10.18H58.7145C59.1745 10.18 59.4045 10.41 59.4045 10.87V12.79H51.6045V19.42H59.8245C60.0445 19.42 60.2145 19.48 60.3345 19.6C60.4745 19.72 60.5445 19.89 60.5445 20.11V22H49.1745C48.6945 22 48.4545 21.77 48.4545 21.31V1.21H59.4945ZM76.1731 11.02C76.6531 11.02 76.8931 11.25 76.8931 11.71V21.43C76.1531 21.71 75.3231 21.93 74.4031 22.09C73.5031 22.25 72.5231 22.33 71.4631 22.33C69.9031 22.33 68.5831 22.13 67.5031 21.73C66.4431 21.33 65.5831 20.7 64.9231 19.84C64.2831 18.96 63.8131 17.85 63.5131 16.51C63.2331 15.17 63.0931 13.55 63.0931 11.65C63.0931 9.65 63.2431 7.97 63.5431 6.61C63.8631 5.23 64.3531 4.12 65.0131 3.28C65.6731 2.44 66.5131 1.84 67.5331 1.48C68.5531 1.1 69.7831 0.91 71.2231 0.91C72.2431 0.91 73.1331 0.989999 73.8931 1.15C74.6731 1.29 75.2431 1.44 75.6031 1.6C75.8431 1.7 75.9931 1.82 76.0531 1.96C76.1331 2.1 76.1731 2.31 76.1731 2.59V3.94C75.5931 3.86 74.8831 3.79 74.0431 3.73C73.2231 3.65 72.4531 3.61 71.7331 3.61C70.7131 3.61 69.8531 3.72 69.1531 3.94C68.4531 4.14 67.8931 4.53 67.4731 5.11C67.0531 5.69 66.7431 6.49 66.5431 7.51C66.3631 8.53 66.2731 9.85 66.2731 11.47C66.2731 13.23 66.3831 14.65 66.6031 15.73C66.8231 16.79 67.1531 17.62 67.5931 18.22C68.0331 18.8 68.5831 19.19 69.2431 19.39C69.9231 19.59 70.7131 19.69 71.6131 19.69C72.0731 19.69 72.5031 19.68 72.9031 19.66C73.3231 19.62 73.6931 19.57 74.0131 19.51V13.6H71.4331C71.2531 13.6 71.1031 13.54 70.9831 13.42C70.8631 13.3 70.8031 13.13 70.8031 12.91V11.02H76.1731ZM91.0611 21.31C90.9211 20.41 90.7711 19.55 90.6111 18.73C90.4711 17.89 90.3211 17.05 90.1611 16.21H83.4711C83.2711 17.17 83.0911 18.14 82.9311 19.12C82.7711 20.1 82.6211 21.06 82.4811 22H80.1711C79.7311 22 79.5211 21.75 79.5411 21.25C79.6011 20.65 79.6911 20.06 79.8111 19.48C80.1711 17.54 80.5711 15.69 81.0111 13.93C81.4511 12.15 81.9011 10.49 82.3611 8.95C82.8211 7.39 83.2811 5.96 83.7411 4.66C84.2211 3.36 84.6711 2.21 85.0911 1.21H88.0911C88.3311 1.21 88.5111 1.26 88.6311 1.36C88.7511 1.46 88.8511 1.62 88.9311 1.84C89.3511 2.86 89.8111 4.08 90.3111 5.5C90.8111 6.92 91.3011 8.5 91.7811 10.24C92.2811 11.98 92.7511 13.85 93.1911 15.85C93.6311 17.83 94.0111 19.88 94.3311 22H91.7811C91.3611 22 91.1211 21.77 91.0611 21.31ZM86.8011 3.79C86.3211 5.21 85.8211 6.75 85.3011 8.41C84.8011 10.05 84.3211 11.83 83.8611 13.75H89.7711C89.3111 11.83 88.8211 10.05 88.3011 8.41C87.8011 6.75 87.3011 5.21 86.8011 3.79ZM99.3537 3.85H94.5837C94.1037 3.85 93.8637 3.62 93.8637 3.16V1.21H107.304C107.524 1.21 107.694 1.27 107.814 1.39C107.954 1.51 108.024 1.68 108.024 1.9V3.85H102.504V22H100.074C99.5937 22 99.3537 21.77 99.3537 21.31V3.85ZM121.955 1.21C122.415 1.21 122.645 1.44 122.645 1.9V3.79H114.065V10.18H121.175C121.635 10.18 121.865 10.41 121.865 10.87V12.79H114.065V19.42H122.285C122.505 19.42 122.675 19.48 122.795 19.6C122.935 19.72 123.005 19.89 123.005 20.11V22H111.635C111.155 22 110.915 21.77 110.915 21.31V1.21H121.955ZM143.131 2.89C143.351 2.89 143.521 2.96 143.641 3.1C143.781 3.22 143.871 3.39 143.911 3.61L147.031 18.28C147.711 15.52 148.301 12.7 148.801 9.82C149.321 6.94 149.691 4.07 149.911 1.21H152.251C152.711 1.21 152.921 1.46 152.881 1.96C152.861 2.24 152.831 2.52 152.791 2.8C152.771 3.08 152.741 3.41 152.701 3.79C152.541 5.05 152.331 6.44 152.071 7.96C151.831 9.46 151.541 11.01 151.201 12.61C150.861 14.21 150.481 15.81 150.061 17.41C149.641 19.01 149.191 20.54 148.711 22H146.071C145.831 22 145.651 21.94 145.531 21.82C145.411 21.7 145.321 21.51 145.261 21.25L142.171 7.12L138.901 22H136.351C136.071 22 135.871 21.95 135.751 21.85C135.651 21.75 135.551 21.58 135.451 21.34C134.991 19.96 134.541 18.43 134.101 16.75C133.661 15.07 133.261 13.34 132.901 11.56C132.541 9.76 132.221 7.98 131.941 6.22C131.681 4.44 131.481 2.77 131.341 1.21H133.891C134.311 1.21 134.541 1.46 134.581 1.96C134.801 4.6 135.151 7.28 135.631 10C136.131 12.72 136.701 15.47 137.341 18.25L140.701 2.89H143.131ZM156.87 22C156.39 22 156.15 21.77 156.15 21.31V1.21H158.58C159.06 1.21 159.3 1.44 159.3 1.9V22H156.87ZM162.843 6.64C162.843 4.74 163.383 3.31 164.463 2.35C165.543 1.39 167.213 0.91 169.473 0.91C170.313 0.91 171.153 0.97 171.993 1.09C172.833 1.19 173.483 1.32 173.943 1.48C174.263 1.62 174.453 1.78 174.513 1.96C174.593 2.12 174.633 2.31 174.633 2.53V3.91C173.893 3.81 173.133 3.73 172.353 3.67C171.573 3.59 170.773 3.55 169.953 3.55C169.173 3.55 168.523 3.62 168.003 3.76C167.483 3.88 167.063 4.06 166.743 4.3C166.443 4.54 166.223 4.84 166.083 5.2C165.963 5.56 165.903 5.98 165.903 6.46C165.903 7 165.973 7.45 166.113 7.81C166.253 8.15 166.483 8.45 166.803 8.71C167.143 8.97 167.573 9.21 168.093 9.43C168.633 9.63 169.293 9.87 170.073 10.15C170.873 10.45 171.593 10.75 172.233 11.05C172.893 11.35 173.453 11.73 173.913 12.19C174.393 12.63 174.753 13.18 174.993 13.84C175.253 14.48 175.383 15.3 175.383 16.3C175.383 18.46 174.803 20.01 173.643 20.95C172.483 21.87 170.803 22.33 168.603 22.33C167.643 22.33 166.713 22.26 165.813 22.12C164.913 22 164.213 21.85 163.713 21.67C163.453 21.57 163.273 21.44 163.173 21.28C163.073 21.12 163.023 20.92 163.023 20.68V19.18C163.723 19.28 164.493 19.38 165.333 19.48C166.193 19.58 167.103 19.63 168.063 19.63C168.903 19.63 169.593 19.56 170.133 19.42C170.693 19.26 171.123 19.05 171.423 18.79C171.743 18.51 171.963 18.17 172.083 17.77C172.203 17.37 172.263 16.92 172.263 16.42C172.263 15.86 172.193 15.4 172.053 15.04C171.933 14.68 171.713 14.38 171.393 14.14C171.073 13.88 170.643 13.64 170.103 13.42C169.583 13.2 168.923 12.95 168.123 12.67C167.283 12.37 166.533 12.06 165.873 11.74C165.233 11.42 164.683 11.04 164.223 10.6C163.783 10.14 163.443 9.6 163.203 8.98C162.963 8.34 162.843 7.56 162.843 6.64ZM189.983 1.21C190.443 1.21 190.673 1.44 190.673 1.9V3.79H182.093V10.18H189.203C189.663 10.18 189.893 10.41 189.893 10.87V12.79H182.093V19.42H190.313C190.533 19.42 190.703 19.48 190.823 19.6C190.963 19.72 191.033 19.89 191.033 20.11V22H179.663C179.183 22 178.943 21.77 178.943 21.31V1.21H189.983Z" fill="#434343"/>
</svg>
