<?xml version="1.0" encoding="UTF-8"?>
<svg id="Layer_2" data-name="Layer 2" xmlns="http://www.w3.org/2000/svg" viewBox="0 0 57.6 55.34">
  <defs>
    <style>
      .cls-1 {
        stroke-width: 0px;
      }
    </style>
  </defs>
  <g id="Layer_1-2" data-name="Layer 1">
    <path class="cls-1" d="M30.46,0C15.49,0,3.32,12.17,3.32,27.14c0,3.01.49,5.92,1.4,8.63.18.52.74.81,1.27.63s.81-.74.63-1.27c0,0,0,0,0,0-.84-2.51-1.3-5.2-1.3-7.99,0-2.57.39-5.04,1.1-7.38.31.38.67.7,1.07.97,1.09.73,2.42,1.11,3.8,1.21,2.75.21,5.82-.62,7.12-3.01,1.04-1.91,1.3-2.87,1.66-3.52.36-.66.91-1.28,2.81-2.84,4.32-3.55,3.45-9.96,3.41-10.22,1.36-.23,2.75-.35,4.18-.35,3.32,0,6.49.65,9.39,1.82.02.03.04.07.06.1,0,0,.4.62.75,1.51.35.89.59,2.01.41,2.84-.31,1.43-.02,2.98.89,4.21.91,1.23,2.47,2.07,4.42,2.03.96-.02,3.05.84,4.72,1.79,1.5.85,2.59,1.63,2.82,1.79,1.08,2.81,1.69,5.86,1.69,9.05,0,5.76-1.94,11.06-5.2,15.3-.21-.03-.9-.12-1.96-.06-1.23.07-2.81.36-4.16,1.24-.4.26-.56.26-.8.23-.24-.03-.59-.17-1.1-.32s-1.2-.29-1.98-.13-1.6.59-2.53,1.36c-1.96,1.64-2.23,3.83-1.93,5.41.1.54.26.99.43,1.4-1.9.46-3.87.71-5.91.71-3.77,0-7.33-.83-10.54-2.31-.5-.23-1.1-.02-1.33.49s-.02,1.1.49,1.33c0,0,0,0,0,0,3.46,1.6,7.32,2.5,11.38,2.5,2.49,0,4.9-.34,7.2-.98.32.07.66-.03.89-.26,11.03-3.45,19.05-13.76,19.05-25.91C57.6,12.17,45.43,0,30.46,0ZM24.31,2.76c.06.65.4,5.72-2.7,8.26-1.96,1.61-2.77,2.47-3.29,3.42-.53.96-.69,1.75-1.66,3.53-.71,1.3-3.01,2.14-5.21,1.97-1.1-.08-2.13-.4-2.83-.88s-1.08-1.02-1.14-1.81c0-.07-.02-.15-.04-.22,3.08-7.03,9.29-12.38,16.87-14.29ZM42.68,5.17c4.01,2.24,7.34,5.54,9.62,9.52-.08-.04-.14-.08-.22-.13-1.77-1.01-3.84-2.09-5.75-2.05-1.39.03-2.23-.49-2.77-1.22-.54-.73-.73-1.73-.54-2.6.28-1.28,0-2.51-.34-3.53ZM44.08,18.36c-.98,0-1.95.37-2.69,1.11l-2.79,2.79-5.64-1.51c-2.2-.59-4.44.67-5.2,2.78,0,.01-.04.04-.04.04,0,0-.11.22-.11.22,0,0,0,.03,0,.04,0,0,0,0,0,.02h0s0,0,0,.02c-.02.07-.02.13-.03.2l.02-.13s-.02.1-.02.1c0,0,0,.07,0,.07-.11.93.47,1.85,1.4,2.11l4.49,1.2c-.99.99-2.48,2.48-3.81,3.81-.48.48-.75,1.13-.75,1.8s.27,1.32.75,1.8l1.79,1.79c.48.48,1.13.75,1.8.75s1.32-.27,1.8-.75l3.81-3.81,1.2,4.49s0,0,0,0c.27.99,1.28,1.56,2.27,1.35,0,0,0,0,0,0,.03,0,.06.02.09.01h0c.06-.02.11-.06.17-.08,0,0,0,0,0,0,.06-.02.1-.06.16-.08,0,0,0,0,0,0,2.1-.77,3.34-2.99,2.76-5.19l-1.51-5.64,2.79-2.79h0c1.48-1.48,1.48-3.91,0-5.39h0s0,0,0,0c-.74-.74-1.72-1.11-2.7-1.11ZM42.58,38.57s.08-.02.08-.02h0s-.06.02-.08.02ZM42.41,38.65l-.24.03c.08,0,.16-.01.24-.03ZM42.32,38.64c-.07.02-.16.04-.16.04,0,0,0,0,0,0,0,0,.09-.03.16-.04ZM44.08,20.34c.46,0,.92.18,1.28.54h0c.72.72.72,1.85,0,2.56l-3.2,3.2c-.25.25-.35.62-.26.96l1.66,6.2c.34,1.25-.39,2.49-1.62,2.87l-1.63-6.07c-.14-.53-.69-.85-1.22-.71-.17.05-.33.13-.45.26l-5.04,5.04h0c-.1.1-.24.16-.38.16s-.28-.06-.38-.16h0s-1.79-1.79-1.79-1.79c-.1-.1-.16-.24-.16-.38s.06-.28.16-.38c0,0,0,0,0,0,1.76-1.76,5.03-5.04,5.03-5.04.39-.39.39-1.02,0-1.41-.12-.12-.28-.21-.45-.26l-6.07-1.63c.37-1.23,1.61-1.96,2.87-1.62l6.2,1.66c.35.09.71,0,.97-.26l3.2-3.2c.36-.36.82-.54,1.28-.54ZM25.34,33.15c-.26,0-.51.12-.69.3l-2.59,2.59c-.4.38-.41,1.02-.03,1.41s1.02.41,1.41.03c0,0,.02-.02.03-.03l2.59-2.59c.4-.38.41-1.02.02-1.41-.2-.2-.47-.31-.75-.3ZM29.48,35.73c-.29,0-.57.14-.76.37-2.48,2.93-7.19,7.65-11.99,11.4-2.4,1.87-4.83,3.51-6.99,4.56-2.16,1.05-4.02,1.46-5.18,1.19h0c-1.1-.26-1.69-.74-2.07-1.41s-.55-1.6-.45-2.73c.19-2.26,1.44-5.19,3.12-7.68.31-.46.19-1.08-.27-1.39-.46-.31-1.08-.19-1.39.27h0c-1.83,2.7-3.22,5.82-3.46,8.63-.12,1.4.05,2.76.71,3.9.66,1.14,1.82,1.99,3.35,2.35,1.96.46,4.17-.19,6.52-1.34s4.87-2.85,7.34-4.78c4.94-3.86,9.69-8.61,12.29-11.68.36-.42.32-1.05-.1-1.41-.18-.16-.42-.25-.67-.25ZM32.05,39.86c-.26,0-.51.12-.69.3l-5.17,5.17c-.4.38-.41,1.02-.03,1.41s1.02.41,1.41.03c0,0,.02-.02.03-.03l5.17-5.17c.4-.38.41-1.02.02-1.41-.2-.2-.47-.31-.75-.3ZM48.7,44.44c-2.83,2.99-6.39,5.27-10.39,6.59-.15-.33-.31-.75-.4-1.23-.22-1.12-.16-2.32,1.25-3.49.76-.63,1.28-.86,1.65-.94.37-.08.63-.03,1,.08.37.11.82.32,1.45.39.63.07,1.4-.08,2.12-.54.96-.62,2.28-.81,3.33-.87Z"/>
  </g>
</svg>