<svg width="39" height="40" viewBox="0 0 39 40" fill="none" xmlns="http://www.w3.org/2000/svg">
<path d="M37.8387 18.5765C38.8159 18.4817 38.8159 19.9994 37.8387 20.0943C35.9308 20.284 33.9764 20.5686 32.1616 20.7109C31.1844 20.8057 31.1844 19.288 32.1616 19.1931C33.9764 18.956 35.9308 18.7662 37.8387 18.5765Z" fill="currentColor"/>
<path d="M31.4281 6.02181C32.0205 5.28073 33.2964 6.02181 32.704 6.76289C31.6103 8.24504 30.4711 9.64001 29.2863 11.1222C28.6939 11.8632 27.418 11.1222 28.0104 10.3811C29.1952 8.89893 30.3344 7.41678 31.4281 6.02181Z" fill="currentColor"/>
<path d="M28.5714 20.8433C28.5714 23.719 27.5676 26.1309 25.5142 27.8934C25.423 27.8934 24.8754 28.4964 24.8754 28.4964L24.7841 28.5891C23.9628 29.7487 23.3696 33.0418 23.2327 35.6392C23.1415 35.5465 23.0502 35.5465 22.9133 35.5465C21.0881 35.5465 19.3542 35.5465 17.529 35.5465C16.3882 35.5465 16.3882 37.309 17.529 37.309C19.3542 37.309 21.0881 37.309 22.9133 37.309C23.0046 37.309 23.0046 37.309 23.1415 37.309C22.822 38.8396 21.4988 39.9992 19.993 39.9992H18.1678C16.4338 39.9992 15.0193 38.5613 15.0193 36.7988V36.6133C15.0193 35.4537 14.928 34.2478 14.6999 32.9955C16.5251 32.9955 18.259 32.9955 20.4037 32.9955C21.5444 32.9955 21.5444 31.2329 20.4037 31.2329C18.5785 31.2329 16.8445 31.2329 14.9737 31.2329C14.8824 31.2329 14.7455 31.3257 14.6543 31.3257C14.4717 30.1661 14.0154 29.1457 13.7417 28.6355L13.2397 28.0326L13.1485 27.9398C11.0951 26.1773 10 23.7654 10 20.8897C10 15.6949 14.198 11.4277 19.3085 11.4277C24.3735 11.4277 28.5714 15.6485 28.5714 20.8433Z" fill="currentColor"/>
<path d="M19.9999 0.754286C19.9999 2.62857 19.9999 4.54857 19.9999 6.42286C19.9999 7.38286 18.5713 7.38286 18.5713 6.42286C18.5713 4.50286 18.5713 2.62857 18.5713 0.754286C18.5713 -0.251429 19.9999 -0.251429 19.9999 0.754286Z" fill="currentColor"/>
<path d="M9.84563 10.4125C10.4426 11.1586 9.15677 11.8169 8.55976 11.1586C7.45759 9.75424 6.30949 8.2621 5.11546 6.76995C4.6103 6.02388 5.89617 5.2778 6.40133 6.02388C7.59535 7.42825 8.74345 8.9204 9.84563 10.4125Z" fill="currentColor"/>
<path d="M6.40996 19.1899C7.38716 19.2842 7.38716 20.8884 6.40996 20.6997C4.50209 20.511 2.5477 20.2751 0.732899 20.0863C-0.2443 19.992 -0.2443 18.4821 0.732899 18.5765C2.64076 18.7181 4.45556 18.9068 6.40996 19.1899Z" fill="currentColor"/>
</svg>
