<svg width="32" height="32" viewBox="0 0 32 32" fill="none" xmlns="http://www.w3.org/2000/svg">
<path d="M30 2H2C0.8 2 0 2.8 0 4V6.8L16 15.8L32 7V4C32 2.8 31.2 2 30 2Z" fill="currentColor"/>
<path d="M15 19.8004L0 11.4004V28.0004C0 29.2004 0.8 30.0004 2 30.0004H30C31.2 30.0004 32 29.2004 32 28.0004V11.4004L17 19.8004C16.44 20.0804 15.56 20.0804 15 19.8004Z" fill="currentColor"/>
</svg>
