[
  {
    "body": {
      "type": "topic"
    },
    "method": "PUT",
    "path": "api/exchanges/%2F/converter"
  },
  {
    "body": {
      "durable": true
    },
    "method": "PUT",
    "path": "api/queues/%2F/videos"
  },
  {
    "body": {
      "routing_key": "video"
    },
    "method": "POST",
    "path": "api/bindings/%2F/e/converter/q/videos"
  },
    {
    "body": {
      "durable": true
    },
    "method": "PUT",
    "path": "api/queues/%2F/audios"
  },
  {
    "body": {
      "routing_key": "audio"
    },
    "method": "POST",
    "path": "api/bindings/%2F/e/converter/q/audios"
  }
]

