[
  {
    "name": "Iphone 14",
    "price": 2000
  },
  {
    "name": "Iphone 14 Promax",
    "price": 3000
  },
  {
    "name": "Iphone 13 Promax",
    "price": 1500
  },
  {
    "name": "Mac Pro 2022",
    "price": 3500
  }
]