46.23532627089786,63.2407157344008
46.24747903945326,61.39971048626807
46.64263694930395,63.46266704971636
46.32913407815188,63.30682926422292
47.4075539624039,62.3867078534404
46.97609571902514,63.1086032085
46.430991464743485,63.09258572158683
46.430991464743485,63.09258572158683
46.67159359076352,63.420737436829704
46.49597082037116,63.18120957274442
