EESchema Schematic File Version 4
LIBS:converter-cache
EELAYER 29 0
EELAYER END
$Descr A4 11693 8268
encoding utf-8
Sheet 1 1
Title ""
Date ""
Rev ""
Comp ""
Comment1 ""
Comment2 ""
Comment3 ""
Comment4 ""
$EndDescr
$Comp
L connectors:CONN_01X06 J5
U 1 1 5E690F43
P 4700 1300
F 0 "J5" H 4778 1341 50  0000 L CNN
F 1 "CONN_01X06" H 4778 1250 50  0000 L CNN
F 2 "Connectors:RJ12_12x12.9mm" H 4600 1550 50  0001 C CNN
F 3 "" H 4700 1650 50  0001 C CNN
F 4 "1" H 4800 1750 60  0001 C CNN "V1"
F 5 "1" H 4800 1750 60  0001 C CNN "V2"
F 6 "1" H 4800 1750 60  0001 C CNN "V3"
F 7 "1" H 4800 1750 60  0001 C CNN "V4"
F 8 "1" H 4800 1750 60  0001 C CNN "V5"
F 9 "PN" H 4800 1750 60  0001 C CNN "PN"
	1    4700 1300
	1    0    0    -1  
$EndComp
$Comp
L connectors:CONN_01X06 J6
U 1 1 5E691B37
P 4700 2550
F 0 "J6" H 4778 2591 50  0000 L CNN
F 1 "CONN_01X06" H 4778 2500 50  0000 L CNN
F 2 "Connectors:RJ12_12x12.9mm" H 4600 2800 50  0001 C CNN
F 3 "" H 4700 2900 50  0001 C CNN
F 4 "1" H 4800 3000 60  0001 C CNN "V1"
F 5 "1" H 4800 3000 60  0001 C CNN "V2"
F 6 "1" H 4800 3000 60  0001 C CNN "V3"
F 7 "1" H 4800 3000 60  0001 C CNN "V4"
F 8 "1" H 4800 3000 60  0001 C CNN "V5"
F 9 "PN" H 4800 3000 60  0001 C CNN "PN"
	1    4700 2550
	1    0    0    -1  
$EndComp
$Comp
L connectors:CONN_01X04 J2
U 1 1 5E6922B8
P 1850 2900
F 0 "J2" H 1767 3265 50  0000 C CNN
F 1 "CONN_01X04" H 1767 3174 50  0000 C CNN
F 2 "Connector_PinSocket_2.54mm:PinSocket_1x04_P2.54mm_Vertical" H 1850 2800 50  0001 C CNN
F 3 "" H 1850 2800 50  0001 C CNN
F 4 "1" H 1950 3200 60  0001 C CNN "V1"
F 5 "1" H 1950 3200 60  0001 C CNN "V2"
F 6 "1" H 1950 3200 60  0001 C CNN "V3"
F 7 "1" H 1950 3200 60  0001 C CNN "V4"
F 8 "1" H 1950 3200 60  0001 C CNN "V5"
F 9 "PN" H 1950 3200 60  0001 C CNN "PN"
	1    1850 2900
	-1   0    0    -1  
$EndComp
$Comp
L sw:DTSM-61K-V-B SW1
U 1 1 5E693ED9
P 6550 1350
F 0 "SW1" V 6504 1498 50  0000 L CNN
F 1 "DTSM-61K-V-B" V 6595 1498 50  0000 L CNN
F 2 "Button_Switch_SMD:SW_SPST_6x6mm_H4.3mm" H 6550 1550 50  0001 C CNN
F 3 "" H 6550 1550 50  0001 C CNN
F 4 "1" H 6500 1550 60  0001 C CNN "V1"
F 5 "1" H 6500 1550 60  0001 C CNN "V2"
F 6 "1" H 6500 1550 60  0001 C CNN "V3"
F 7 "1" H 6500 1550 60  0001 C CNN "V4"
F 8 "1" H 6500 1550 60  0001 C CNN "V5"
F 9 "DTSM-61K-V-B" H 6500 1650 60  0001 C CNN "PN"
	1    6550 1350
	0    1    1    0   
$EndComp
$Comp
L power:GND #PWR013
U 1 1 5E694DC8
P 6550 1700
F 0 "#PWR013" H 6550 1450 50  0001 C CNN
F 1 "GND" H 6555 1527 50  0000 C CNN
F 2 "" H 6550 1700 50  0001 C CNN
F 3 "" H 6550 1700 50  0001 C CNN
	1    6550 1700
	1    0    0    -1  
$EndComp
Wire Wire Line
	6550 1700 6550 1550
$Comp
L passive:100n_50V C4
U 1 1 5E69531E
P 6250 1400
F 0 "C4" H 6200 1500 50  0000 R CNN
F 1 "100n_50V" V 6400 1600 50  0000 R CNN
F 2 "passive:C_0603" H 6288 1250 50  0001 C CNN
F 3 "" H 6250 1400 50  0001 C CNN
F 4 "1" H 6350 1600 60  0001 C CNN "V1"
F 5 "1" H 6350 1600 60  0001 C CNN "V2"
F 6 "1" H 6350 1600 60  0001 C CNN "V3"
F 7 "1" H 6350 1600 60  0001 C CNN "V4"
F 8 "1" H 6350 1600 60  0001 C CNN "V5"
F 9 "CL10B104KB8NNNC" H 6350 1600 60  0001 C CNN "PN"
	1    6250 1400
	-1   0    0    -1  
$EndComp
$Comp
L power:GND #PWR012
U 1 1 5E695F39
P 6250 1700
F 0 "#PWR012" H 6250 1450 50  0001 C CNN
F 1 "GND" H 6255 1527 50  0000 C CNN
F 2 "" H 6250 1700 50  0001 C CNN
F 3 "" H 6250 1700 50  0001 C CNN
	1    6250 1700
	1    0    0    -1  
$EndComp
Wire Wire Line
	6250 1700 6250 1550
Wire Wire Line
	6550 1150 6550 1050
Wire Wire Line
	6550 1050 6250 1050
Wire Wire Line
	6250 1050 6250 1250
Wire Wire Line
	6250 1050 5700 1050
Connection ~ 6250 1050
Text Label 5700 1050 0    50   ~ 0
~RST
$Comp
L IC:CP2102N-QFN24 U1
U 1 1 5E6972C9
P 3550 6050
F 0 "U1" H 3525 5103 60  0000 C CNN
F 1 "CP2102N-QFN24" H 3525 4997 60  0000 C CNN
F 2 "Housings_DFN_QFN:QFN-24-1EP_4x4mm_Pitch0.5mm" H 3550 5150 60  0001 C CNN
F 3 "" H 3450 6050 60  0001 C CNN
F 4 "1" H 3700 5150 60  0001 C CNN "V1"
F 5 "1" H 3700 5150 60  0001 C CNN "V2"
F 6 "1" H 3700 5150 60  0001 C CNN "V3"
F 7 "1" H 3700 5150 60  0001 C CNN "V4"
F 8 "1" H 3700 5150 60  0001 C CNN "V5"
F 9 "CP2102N-A01-GQFN24" H 3700 5150 60  0001 C CNN "PN"
	1    3550 6050
	1    0    0    -1  
$EndComp
$Comp
L connectors:47642-0001 J1
U 1 1 5E69A69A
P 950 5200
F 0 "J1" H 1007 5667 50  0000 C CNN
F 1 "47642-0001" H 1007 5576 50  0000 C CNN
F 2 "Connectors_USB:47642-0001" H 1100 5150 50  0001 C CNN
F 3 "" H 1100 5150 50  0001 C CNN
F 4 "1" H 800 5750 60  0001 C CNN "V1"
F 5 "1" H 800 5750 60  0001 C CNN "V2"
F 6 "1" H 800 5750 60  0001 C CNN "V3"
F 7 "1" H 800 5750 60  0001 C CNN "V4"
F 8 "1" H 800 5750 60  0001 C CNN "V5"
F 9 "47346-0001" H 800 5850 60  0001 C CNN "PN"
	1    950  5200
	1    0    0    -1  
$EndComp
Wire Wire Line
	1250 5200 2900 5200
Wire Wire Line
	2900 5300 1250 5300
Wire Wire Line
	2050 2750 2850 2750
Wire Wire Line
	2050 2850 2850 2850
Wire Wire Line
	2850 2950 2050 2950
Wire Wire Line
	2050 3050 2850 3050
Text Label 2850 2850 2    50   ~ 0
SWDIO
Text Label 2850 2950 2    50   ~ 0
SWCLK
Wire Wire Line
	4500 2300 4200 2300
Wire Wire Line
	4500 2400 4200 2400
Wire Wire Line
	4500 2500 3750 2500
Wire Wire Line
	4500 2600 3750 2600
Wire Wire Line
	4500 2700 3750 2700
Wire Wire Line
	4500 2800 3750 2800
Wire Wire Line
	4500 1050 3750 1050
Wire Wire Line
	4500 1150 3750 1150
Wire Wire Line
	4500 1250 3750 1250
Wire Wire Line
	4500 1350 3750 1350
Wire Wire Line
	4500 1550 3750 1550
Wire Wire Line
	2900 1100 2150 1100
Wire Wire Line
	2450 1200 2150 1200
Wire Wire Line
	2450 1300 2150 1300
Wire Wire Line
	1650 1100 900  1100
Wire Wire Line
	1650 1200 900  1200
Wire Wire Line
	1650 1300 900  1300
Wire Wire Line
	1650 1400 900  1400
Wire Wire Line
	1650 1500 900  1500
Wire Wire Line
	1650 1600 900  1600
Wire Wire Line
	1650 1700 900  1700
Wire Wire Line
	1650 1800 900  1800
Wire Wire Line
	1650 1900 900  1900
Wire Wire Line
	1650 2000 900  2000
$Comp
L connectors:CONN_02X10 J3
U 1 1 5E68EF2D
P 1900 1550
F 0 "J3" H 1900 2215 50  0000 C CNN
F 1 "CONN_02X10" H 1900 2124 50  0000 C CNN
F 2 "Connector_PinSocket_2.54mm:PinSocket_2x10_P2.54mm_Horizontal" H 1900 350 50  0001 C CNN
F 3 "" H 1900 350 50  0001 C CNN
F 4 "1" H 2000 2150 60  0001 C CNN "V1"
F 5 "1" H 2000 2150 60  0001 C CNN "V2"
F 6 "1" H 2000 2150 60  0001 C CNN "V3"
F 7 "1" H 2000 2150 60  0001 C CNN "V4"
F 8 "1" H 2000 2150 60  0001 C CNN "V5"
F 9 "PN" H 2000 2150 60  0001 C CNN "PN"
	1    1900 1550
	1    0    0    -1  
$EndComp
Wire Wire Line
	2450 1400 2150 1400
Wire Wire Line
	2450 1500 2150 1500
Wire Wire Line
	2450 1600 2150 1600
Wire Wire Line
	2450 1700 2150 1700
Wire Wire Line
	2450 1800 2150 1800
Wire Wire Line
	2450 1900 2150 1900
Wire Wire Line
	2450 2000 2150 2000
$Comp
L power:GND #PWR02
U 1 1 5E6AF48A
P 2450 2150
F 0 "#PWR02" H 2450 1900 50  0001 C CNN
F 1 "GND" H 2455 1977 50  0000 C CNN
F 2 "" H 2450 2150 50  0001 C CNN
F 3 "" H 2450 2150 50  0001 C CNN
	1    2450 2150
	1    0    0    -1  
$EndComp
Wire Wire Line
	2450 2150 2450 2000
Connection ~ 2450 1300
Wire Wire Line
	2450 1300 2450 1200
Connection ~ 2450 1400
Wire Wire Line
	2450 1400 2450 1300
Connection ~ 2450 1500
Wire Wire Line
	2450 1500 2450 1400
Connection ~ 2450 1600
Wire Wire Line
	2450 1600 2450 1500
Connection ~ 2450 1700
Wire Wire Line
	2450 1700 2450 1600
Connection ~ 2450 1800
Wire Wire Line
	2450 1800 2450 1700
Connection ~ 2450 1900
Wire Wire Line
	2450 1900 2450 1800
Connection ~ 2450 2000
Wire Wire Line
	2450 2000 2450 1900
Text Label 2900 1100 2    50   ~ 0
VREF
Text Label 900  1100 0    50   ~ 0
VCC
Text Label 900  1200 0    50   ~ 0
~TRST
Text Label 900  1300 0    50   ~ 0
TDI
Text Label 900  1400 0    50   ~ 0
TMS
Text Label 900  1500 0    50   ~ 0
TCK
Text Label 900  1600 0    50   ~ 0
RTCK
Text Label 900  1700 0    50   ~ 0
TDO
Text Label 900  1800 0    50   ~ 0
~SRST
Text Label 900  1900 0    50   ~ 0
RQ
Text Label 900  2000 0    50   ~ 0
ACK
Wire Wire Line
	4200 2400 4200 2300
Connection ~ 4200 2300
Wire Wire Line
	4200 2300 3750 2300
Text Label 3750 2300 0    50   ~ 0
SWDIO
Text Label 3750 2500 0    50   ~ 0
SWCLK
Text Label 3750 2600 0    50   ~ 0
VCC
Text Label 2850 2750 2    50   ~ 0
VCC
NoConn ~ 3750 2700
$Comp
L power:GND #PWR08
U 1 1 5E6B5AA1
P 3750 2900
F 0 "#PWR08" H 3750 2650 50  0001 C CNN
F 1 "GND" H 3755 2727 50  0000 C CNN
F 2 "" H 3750 2900 50  0001 C CNN
F 3 "" H 3750 2900 50  0001 C CNN
	1    3750 2900
	1    0    0    -1  
$EndComp
Wire Wire Line
	3750 2900 3750 2800
$Comp
L power:GND #PWR03
U 1 1 5E6B72B2
P 2850 3150
F 0 "#PWR03" H 2850 2900 50  0001 C CNN
F 1 "GND" H 2855 2977 50  0000 C CNN
F 2 "" H 2850 3150 50  0001 C CNN
F 3 "" H 2850 3150 50  0001 C CNN
	1    2850 3150
	1    0    0    -1  
$EndComp
Wire Wire Line
	2850 3150 2850 3050
Text Label 3750 1050 0    50   ~ 0
VCC
Text Label 3750 1150 0    50   ~ 0
SWDIO
Text Label 3750 1250 0    50   ~ 0
~RST
Text Label 3750 1350 0    50   ~ 0
SWCLK
$Comp
L power:GND #PWR07
U 1 1 5E6B8D88
P 3650 1600
F 0 "#PWR07" H 3650 1350 50  0001 C CNN
F 1 "GND" H 3655 1427 50  0000 C CNN
F 2 "" H 3650 1600 50  0001 C CNN
F 3 "" H 3650 1600 50  0001 C CNN
	1    3650 1600
	1    0    0    -1  
$EndComp
Wire Wire Line
	3650 1450 3650 1600
Wire Wire Line
	3650 1450 4500 1450
Text Label 3750 1550 0    50   ~ 0
SWO
Wire Wire Line
	4150 5350 4350 5350
Wire Wire Line
	5050 5550 4650 5550
Wire Wire Line
	4150 5650 4350 5650
Text Label 4850 5450 0    50   ~ 0
SWO
$Comp
L passive:R R2
U 1 1 5E6C25C5
P 4500 5450
F 0 "R2" V 4293 5450 50  0000 C CNN
F 1 "R" V 4384 5450 50  0000 C CNN
F 2 "passive:R_0603" V 4430 5450 50  0001 C CNN
F 3 "" H 4500 5450 50  0001 C CNN
F 4 "1" H 4600 5550 60  0001 C CNN "V1"
F 5 "1" H 4600 5550 60  0001 C CNN "V2"
F 6 "1" H 4600 5550 60  0001 C CNN "V3"
F 7 "1" H 4600 5550 60  0001 C CNN "V4"
F 8 "1" H 4600 5550 60  0001 C CNN "V5"
F 9 "R-" V 4600 5550 60  0001 C CNN "PN"
	1    4500 5450
	0    1    1    0   
$EndComp
Wire Wire Line
	4150 5450 4350 5450
Wire Wire Line
	4650 5450 5050 5450
$Comp
L passive:R R3
U 1 1 5E6C5A81
P 4500 5550
F 0 "R3" V 4293 5550 50  0000 C CNN
F 1 "R" V 4384 5550 50  0000 C CNN
F 2 "passive:R_0603" V 4430 5550 50  0001 C CNN
F 3 "" H 4500 5550 50  0001 C CNN
F 4 "1" H 4600 5650 60  0001 C CNN "V1"
F 5 "1" H 4600 5650 60  0001 C CNN "V2"
F 6 "1" H 4600 5650 60  0001 C CNN "V3"
F 7 "1" H 4600 5650 60  0001 C CNN "V4"
F 8 "1" H 4600 5650 60  0001 C CNN "V5"
F 9 "R-" V 4600 5650 60  0001 C CNN "PN"
	1    4500 5550
	0    1    1    0   
$EndComp
Wire Wire Line
	4350 5550 4150 5550
$Comp
L passive:R R4
U 1 1 5E6C5C12
P 4500 5650
F 0 "R4" V 4293 5650 50  0000 C CNN
F 1 "R" V 4384 5650 50  0000 C CNN
F 2 "passive:R_0603" V 4430 5650 50  0001 C CNN
F 3 "" H 4500 5650 50  0001 C CNN
F 4 "1" H 4600 5750 60  0001 C CNN "V1"
F 5 "1" H 4600 5750 60  0001 C CNN "V2"
F 6 "1" H 4600 5750 60  0001 C CNN "V3"
F 7 "1" H 4600 5750 60  0001 C CNN "V4"
F 8 "1" H 4600 5750 60  0001 C CNN "V5"
F 9 "R-" V 4600 5750 60  0001 C CNN "PN"
	1    4500 5650
	0    1    1    0   
$EndComp
Wire Wire Line
	4650 5650 5050 5650
$Comp
L passive:R R1
U 1 1 5E6C5D57
P 4500 5350
F 0 "R1" V 4293 5350 50  0000 C CNN
F 1 "R" V 4384 5350 50  0000 C CNN
F 2 "passive:R_0603" V 4430 5350 50  0001 C CNN
F 3 "" H 4500 5350 50  0001 C CNN
F 4 "1" H 4600 5450 60  0001 C CNN "V1"
F 5 "1" H 4600 5450 60  0001 C CNN "V2"
F 6 "1" H 4600 5450 60  0001 C CNN "V3"
F 7 "1" H 4600 5450 60  0001 C CNN "V4"
F 8 "1" H 4600 5450 60  0001 C CNN "V5"
F 9 "R-" V 4600 5450 60  0001 C CNN "PN"
	1    4500 5350
	0    1    1    0   
$EndComp
Wire Wire Line
	4650 5350 5050 5350
Text Label 1250 1400 0    50   ~ 0
SWDIO
Text Label 1250 1500 0    50   ~ 0
SWCLK
Text Label 1250 1700 0    50   ~ 0
SWO
Text Label 1250 1800 0    50   ~ 0
~RST
Text Notes 4850 850  2    50   ~ 0
RJ12 - Standard connection
Text Notes 4800 2100 2    50   ~ 0
RJ12 - Old 3Dsimo connection
$Comp
L connectors:CONN_01X04 J7
U 1 1 5E6BA5DB
P 5250 5500
F 0 "J7" H 5328 5541 50  0000 L CNN
F 1 "CONN_01X04" H 5328 5450 50  0000 L CNN
F 2 "Connector_PinSocket_2.54mm:PinSocket_1x04_P2.54mm_Vertical" H 5250 5400 50  0001 C CNN
F 3 "" H 5250 5400 50  0001 C CNN
F 4 "1" H 5350 5800 60  0001 C CNN "V1"
F 5 "1" H 5350 5800 60  0001 C CNN "V2"
F 6 "1" H 5350 5800 60  0001 C CNN "V3"
F 7 "1" H 5350 5800 60  0001 C CNN "V4"
F 8 "1" H 5350 5800 60  0001 C CNN "V5"
F 9 "PN" H 5350 5800 60  0001 C CNN "PN"
	1    5250 5500
	1    0    0    -1  
$EndComp
$Comp
L connectors:CONN_01X04 J8
U 1 1 5E6DDEE0
P 5250 5900
F 0 "J8" H 5328 5941 50  0000 L CNN
F 1 "CONN_01X04" H 5328 5850 50  0000 L CNN
F 2 "Connector_PinSocket_2.54mm:PinSocket_1x04_P2.54mm_Vertical" H 5250 5800 50  0001 C CNN
F 3 "" H 5250 5800 50  0001 C CNN
F 4 "1" H 5350 6200 60  0001 C CNN "V1"
F 5 "1" H 5350 6200 60  0001 C CNN "V2"
F 6 "1" H 5350 6200 60  0001 C CNN "V3"
F 7 "1" H 5350 6200 60  0001 C CNN "V4"
F 8 "1" H 5350 6200 60  0001 C CNN "V5"
F 9 "PN" H 5350 6200 60  0001 C CNN "PN"
	1    5250 5900
	1    0    0    -1  
$EndComp
Wire Wire Line
	4150 5750 4350 5750
Wire Wire Line
	5050 5950 4650 5950
Wire Wire Line
	4150 6050 4350 6050
$Comp
L passive:R R6
U 1 1 5E6E01E4
P 4500 5850
F 0 "R6" V 4293 5850 50  0000 C CNN
F 1 "R" V 4384 5850 50  0000 C CNN
F 2 "passive:R_0603" V 4430 5850 50  0001 C CNN
F 3 "" H 4500 5850 50  0001 C CNN
F 4 "1" H 4600 5950 60  0001 C CNN "V1"
F 5 "1" H 4600 5950 60  0001 C CNN "V2"
F 6 "1" H 4600 5950 60  0001 C CNN "V3"
F 7 "1" H 4600 5950 60  0001 C CNN "V4"
F 8 "1" H 4600 5950 60  0001 C CNN "V5"
F 9 "R-" V 4600 5950 60  0001 C CNN "PN"
	1    4500 5850
	0    1    1    0   
$EndComp
Wire Wire Line
	4150 5850 4350 5850
Wire Wire Line
	4650 5850 5050 5850
$Comp
L passive:R R7
U 1 1 5E6E01F2
P 4500 5950
F 0 "R7" V 4293 5950 50  0000 C CNN
F 1 "R" V 4384 5950 50  0000 C CNN
F 2 "passive:R_0603" V 4430 5950 50  0001 C CNN
F 3 "" H 4500 5950 50  0001 C CNN
F 4 "1" H 4600 6050 60  0001 C CNN "V1"
F 5 "1" H 4600 6050 60  0001 C CNN "V2"
F 6 "1" H 4600 6050 60  0001 C CNN "V3"
F 7 "1" H 4600 6050 60  0001 C CNN "V4"
F 8 "1" H 4600 6050 60  0001 C CNN "V5"
F 9 "R-" V 4600 6050 60  0001 C CNN "PN"
	1    4500 5950
	0    1    1    0   
$EndComp
Wire Wire Line
	4350 5950 4150 5950
$Comp
L passive:R R8
U 1 1 5E6E01FF
P 4500 6050
F 0 "R8" V 4293 6050 50  0000 C CNN
F 1 "R" V 4384 6050 50  0000 C CNN
F 2 "passive:R_0603" V 4430 6050 50  0001 C CNN
F 3 "" H 4500 6050 50  0001 C CNN
F 4 "1" H 4600 6150 60  0001 C CNN "V1"
F 5 "1" H 4600 6150 60  0001 C CNN "V2"
F 6 "1" H 4600 6150 60  0001 C CNN "V3"
F 7 "1" H 4600 6150 60  0001 C CNN "V4"
F 8 "1" H 4600 6150 60  0001 C CNN "V5"
F 9 "R-" V 4600 6150 60  0001 C CNN "PN"
	1    4500 6050
	0    1    1    0   
$EndComp
Wire Wire Line
	4650 6050 5050 6050
$Comp
L passive:R R5
U 1 1 5E6E020C
P 4500 5750
F 0 "R5" V 4293 5750 50  0000 C CNN
F 1 "R" V 4384 5750 50  0000 C CNN
F 2 "passive:R_0603" V 4430 5750 50  0001 C CNN
F 3 "" H 4500 5750 50  0001 C CNN
F 4 "1" H 4600 5850 60  0001 C CNN "V1"
F 5 "1" H 4600 5850 60  0001 C CNN "V2"
F 6 "1" H 4600 5850 60  0001 C CNN "V3"
F 7 "1" H 4600 5850 60  0001 C CNN "V4"
F 8 "1" H 4600 5850 60  0001 C CNN "V5"
F 9 "R-" V 4600 5850 60  0001 C CNN "PN"
	1    4500 5750
	0    1    1    0   
$EndComp
Wire Wire Line
	4650 5750 5050 5750
NoConn ~ 4150 6400
$Comp
L passive:R R9
U 1 1 5E6E3E42
P 4500 6500
F 0 "R9" V 4293 6500 50  0000 C CNN
F 1 "R" V 4384 6500 50  0000 C CNN
F 2 "passive:R_0603" V 4430 6500 50  0001 C CNN
F 3 "" H 4500 6500 50  0001 C CNN
F 4 "1" H 4600 6600 60  0001 C CNN "V1"
F 5 "1" H 4600 6600 60  0001 C CNN "V2"
F 6 "1" H 4600 6600 60  0001 C CNN "V3"
F 7 "1" H 4600 6600 60  0001 C CNN "V4"
F 8 "1" H 4600 6600 60  0001 C CNN "V5"
F 9 "R-" V 4600 6600 60  0001 C CNN "PN"
	1    4500 6500
	0    1    1    0   
$EndComp
Wire Wire Line
	2700 5000 2700 4300
Wire Wire Line
	2700 4300 2950 4300
Wire Wire Line
	3500 4300 3500 4700
Wire Wire Line
	3400 4850 3400 4700
Wire Wire Line
	3400 4700 3500 4700
Connection ~ 3500 4700
Wire Wire Line
	3500 4700 3500 4850
$Comp
L passive:22u_10V C2
U 1 1 5E6EAC48
P 3200 4550
F 0 "C2" H 3315 4596 50  0000 L CNN
F 1 "22u_10V" H 3315 4505 50  0000 L CNN
F 2 "passive:C_0805" H 3238 4400 50  0001 C CNN
F 3 "" H 3200 4550 50  0001 C CNN
F 4 "1" H 3300 4750 60  0001 C CNN "V1"
F 5 "1" H 3300 4750 60  0001 C CNN "V2"
F 6 "1" H 3300 4750 60  0001 C CNN "V3"
F 7 "1" H 3300 4750 60  0001 C CNN "V4"
F 8 "1" H 3300 4750 60  0001 C CNN "V5"
F 9 "GRM21BC80J226ME51L" H 3300 4750 60  0001 C CNN "PN"
	1    3200 4550
	1    0    0    -1  
$EndComp
$Comp
L passive:22u_10V C1
U 1 1 5E6EB76F
P 2950 4550
F 0 "C1" H 3065 4596 50  0000 L CNN
F 1 "22u_10V" H 3065 4505 50  0000 L CNN
F 2 "passive:C_0805" H 2988 4400 50  0001 C CNN
F 3 "" H 2950 4550 50  0001 C CNN
F 4 "1" H 3050 4750 60  0001 C CNN "V1"
F 5 "1" H 3050 4750 60  0001 C CNN "V2"
F 6 "1" H 3050 4750 60  0001 C CNN "V3"
F 7 "1" H 3050 4750 60  0001 C CNN "V4"
F 8 "1" H 3050 4750 60  0001 C CNN "V5"
F 9 "GRM21BC80J226ME51L" H 3050 4750 60  0001 C CNN "PN"
	1    2950 4550
	1    0    0    -1  
$EndComp
$Comp
L power:GND #PWR04
U 1 1 5E6EBD2A
P 2950 4800
F 0 "#PWR04" H 2950 4550 50  0001 C CNN
F 1 "GND" H 2955 4627 50  0000 C CNN
F 2 "" H 2950 4800 50  0001 C CNN
F 3 "" H 2950 4800 50  0001 C CNN
	1    2950 4800
	1    0    0    -1  
$EndComp
Wire Wire Line
	2950 4800 2950 4750
Wire Wire Line
	2950 4750 3200 4750
Wire Wire Line
	3200 4750 3200 4700
Connection ~ 2950 4750
Wire Wire Line
	2950 4750 2950 4700
Wire Wire Line
	2950 4400 2950 4300
Connection ~ 2950 4300
Wire Wire Line
	2950 4300 3200 4300
Wire Wire Line
	3200 4400 3200 4300
Connection ~ 3200 4300
Wire Wire Line
	3200 4300 3500 4300
$Comp
L passive:22u_10V C3
U 1 1 5E6F8022
P 4050 4550
F 0 "C3" H 4165 4596 50  0000 L CNN
F 1 "22u_10V" H 4165 4505 50  0000 L CNN
F 2 "passive:C_0805" H 4088 4400 50  0001 C CNN
F 3 "" H 4050 4550 50  0001 C CNN
F 4 "1" H 4150 4750 60  0001 C CNN "V1"
F 5 "1" H 4150 4750 60  0001 C CNN "V2"
F 6 "1" H 4150 4750 60  0001 C CNN "V3"
F 7 "1" H 4150 4750 60  0001 C CNN "V4"
F 8 "1" H 4150 4750 60  0001 C CNN "V5"
F 9 "GRM21BC80J226ME51L" H 4150 4750 60  0001 C CNN "PN"
	1    4050 4550
	1    0    0    -1  
$EndComp
Wire Wire Line
	3600 4850 3600 4700
Wire Wire Line
	3600 4300 4050 4300
Wire Wire Line
	4050 4300 4050 4400
Wire Wire Line
	3700 4850 3700 4700
Wire Wire Line
	3700 4700 3600 4700
Connection ~ 3600 4700
Wire Wire Line
	3600 4700 3600 4300
Wire Wire Line
	4150 6500 4350 6500
$Comp
L power:VDD #PWR06
U 1 1 5E70C898
P 3600 4100
F 0 "#PWR06" H 3600 3950 50  0001 C CNN
F 1 "VDD" H 3617 4273 50  0000 C CNN
F 2 "" H 3600 4100 50  0001 C CNN
F 3 "" H 3600 4100 50  0001 C CNN
	1    3600 4100
	1    0    0    -1  
$EndComp
Wire Wire Line
	3600 4100 3600 4300
Connection ~ 3600 4300
$Comp
L power:VDD #PWR011
U 1 1 5E70FE0D
P 4850 6500
F 0 "#PWR011" H 4850 6350 50  0001 C CNN
F 1 "VDD" V 4867 6628 50  0000 L CNN
F 2 "" H 4850 6500 50  0001 C CNN
F 3 "" H 4850 6500 50  0001 C CNN
	1    4850 6500
	0    1    1    0   
$EndComp
Wire Wire Line
	4850 6500 4650 6500
$Comp
L power:GND #PWR010
U 1 1 5E713741
P 4250 7000
F 0 "#PWR010" H 4250 6750 50  0001 C CNN
F 1 "GND" H 4255 6827 50  0000 C CNN
F 2 "" H 4250 7000 50  0001 C CNN
F 3 "" H 4250 7000 50  0001 C CNN
	1    4250 7000
	1    0    0    -1  
$EndComp
$Comp
L power:GND #PWR05
U 1 1 5E713F35
P 3250 7000
F 0 "#PWR05" H 3250 6750 50  0001 C CNN
F 1 "GND" H 3255 6827 50  0000 C CNN
F 2 "" H 3250 7000 50  0001 C CNN
F 3 "" H 3250 7000 50  0001 C CNN
	1    3250 7000
	1    0    0    -1  
$EndComp
Wire Wire Line
	3250 7000 3250 6950
Wire Wire Line
	3250 6950 3350 6950
Wire Wire Line
	3350 6950 3350 6900
Connection ~ 3250 6950
Wire Wire Line
	3250 6950 3250 6900
Wire Wire Line
	4150 6300 4250 6300
Wire Wire Line
	4250 6300 4250 7000
$Comp
L power:GND #PWR09
U 1 1 5E721205
P 4050 4800
F 0 "#PWR09" H 4050 4550 50  0001 C CNN
F 1 "GND" H 4055 4627 50  0000 C CNN
F 2 "" H 4050 4800 50  0001 C CNN
F 3 "" H 4050 4800 50  0001 C CNN
	1    4050 4800
	1    0    0    -1  
$EndComp
Wire Wire Line
	4050 4800 4050 4700
$Comp
L power:GND #PWR01
U 1 1 5E724C33
P 850 5800
F 0 "#PWR01" H 850 5550 50  0001 C CNN
F 1 "GND" H 855 5627 50  0000 C CNN
F 2 "" H 850 5800 50  0001 C CNN
F 3 "" H 850 5800 50  0001 C CNN
	1    850  5800
	1    0    0    -1  
$EndComp
Wire Wire Line
	850  5800 850  5700
Wire Wire Line
	850  5700 950  5700
Wire Wire Line
	950  5700 950  5600
Connection ~ 850  5700
Wire Wire Line
	850  5700 850  5600
NoConn ~ 1250 5400
Wire Wire Line
	2650 5750 2650 6000
Wire Wire Line
	2650 5750 2900 5750
Wire Wire Line
	2550 5650 2550 6000
Wire Wire Line
	2550 5650 2900 5650
$Comp
L connectors:CONN_01X02 J4
U 1 1 5E6FD957
P 2600 6200
F 0 "J4" H 2517 6565 50  0000 C CNN
F 1 "CONN_01X04" H 2517 6474 50  0000 C CNN
F 2 "Connector_PinSocket_2.54mm:PinSocket_1x02_P2.54mm_Vertical" H 2600 6100 50  0001 C CNN
F 3 "" H 2600 6100 50  0001 C CNN
F 4 "1" H 2700 6500 60  0001 C CNN "V1"
F 5 "1" H 2700 6500 60  0001 C CNN "V2"
F 6 "1" H 2700 6500 60  0001 C CNN "V3"
F 7 "1" H 2700 6500 60  0001 C CNN "V4"
F 8 "1" H 2700 6500 60  0001 C CNN "V5"
F 9 "PN" H 2700 6500 60  0001 C CNN "PN"
	1    2600 6200
	0    -1   1    0   
$EndComp
$Comp
L d:LTST-C155GEKT LED1
U 1 1 5E6C0D49
P 1800 5550
F 0 "LED1" V 2157 5423 50  0000 C CNN
F 1 "LTST-C155GEKT" V 2066 5423 50  0000 C CNN
F 2 "LEDs:LTST-C155" H 1800 5400 60  0001 C CNN
F 3 "" H 1800 5400 60  0000 C CNN
F 4 "1" H 2050 5550 60  0001 C CNN "V1"
F 5 "1" H 2050 5550 60  0001 C CNN "V2"
F 6 "1" H 2050 5550 60  0001 C CNN "V3"
F 7 "1" H 2050 5550 60  0001 C CNN "V4"
F 8 "1" H 2050 5550 60  0001 C CNN "V5"
F 9 "LTST-C155GEKT" H 2050 5550 60  0001 C CNN "PN"
	1    1800 5550
	0    -1   -1   0   
$EndComp
$Comp
L passive:R R10
U 1 1 5E6C31BC
P 2400 5400
F 0 "R10" V 2193 5400 50  0000 C CNN
F 1 "R" V 2284 5400 50  0000 C CNN
F 2 "passive:R_0603" V 2330 5400 50  0001 C CNN
F 3 "" H 2400 5400 50  0001 C CNN
F 4 "1" H 2500 5500 60  0001 C CNN "V1"
F 5 "1" H 2500 5500 60  0001 C CNN "V2"
F 6 "1" H 2500 5500 60  0001 C CNN "V3"
F 7 "1" H 2500 5500 60  0001 C CNN "V4"
F 8 "1" H 2500 5500 60  0001 C CNN "V5"
F 9 "R-" V 2500 5500 60  0001 C CNN "PN"
	1    2400 5400
	0    1    1    0   
$EndComp
$Comp
L passive:R R11
U 1 1 5E6D0E07
P 2400 5550
F 0 "R11" V 2193 5550 50  0000 C CNN
F 1 "R" V 2284 5550 50  0000 C CNN
F 2 "passive:R_0603" V 2330 5550 50  0001 C CNN
F 3 "" H 2400 5550 50  0001 C CNN
F 4 "1" H 2500 5650 60  0001 C CNN "V1"
F 5 "1" H 2500 5650 60  0001 C CNN "V2"
F 6 "1" H 2500 5650 60  0001 C CNN "V3"
F 7 "1" H 2500 5650 60  0001 C CNN "V4"
F 8 "1" H 2500 5650 60  0001 C CNN "V5"
F 9 "R-" V 2500 5650 60  0001 C CNN "PN"
	1    2400 5550
	0    1    1    0   
$EndComp
Wire Wire Line
	2650 5450 2650 5400
Wire Wire Line
	2650 5400 2550 5400
Wire Wire Line
	1250 5000 2700 5000
$Comp
L power:VDD #PWR0101
U 1 1 5E6EBBB6
P 1600 5400
F 0 "#PWR0101" H 1600 5250 50  0001 C CNN
F 1 "VDD" H 1617 5573 50  0000 C CNN
F 2 "" H 1600 5400 50  0001 C CNN
F 3 "" H 1600 5400 50  0001 C CNN
	1    1600 5400
	0    -1   -1   0   
$EndComp
Wire Wire Line
	1800 5400 1700 5400
Wire Wire Line
	1800 5550 1700 5550
Wire Wire Line
	1700 5550 1700 5400
Connection ~ 1700 5400
Wire Wire Line
	1700 5400 1600 5400
Wire Wire Line
	2900 5450 2650 5450
Wire Wire Line
	2550 5550 2900 5550
Wire Wire Line
	2050 5550 2250 5550
Wire Wire Line
	2050 5400 2250 5400
Text Label 1500 5200 0    50   ~ 0
D+
Text Label 1500 5300 0    50   ~ 0
D-
$EndSCHEMATC
