module gitlab.com/microarch-ru/basket

go 1.23

toolchain go1.23.6

require (
	github.com/jackc/pgx/v5 v5.7.1
	github.com/joho/godotenv v1.5.1
	github.com/labstack/echo/v4 v4.12.0
	github.com/labstack/gommon v0.4.2
)

require (
	github.com/jackc/pgpassfile v1.0.0 // indirect
	github.com/jackc/pgservicefile v0.0.0-20240606120523-5a60cdf6a761 // indirect
	github.com/jackc/puddle/v2 v2.2.2 // indirect
	github.com/mattn/go-colorable v0.1.13 // indirect
	github.com/mattn/go-isatty v0.0.20 // indirect
	github.com/stretchr/testify v1.9.0 // indirect
	github.com/valyala/bytebufferpool v1.0.0 // indirect
	github.com/valyala/fasttemplate v1.2.2 // indirect
	golang.org/x/crypto v0.30.0 // indirect
	golang.org/x/net v0.31.0 // indirect
	golang.org/x/sync v0.10.0 // indirect
	golang.org/x/sys v0.28.0 // indirect
	golang.org/x/text v0.21.0 // indirect
)
