[
  {
    "id": "ctrl_relay_stat",
    "name": "ctrl_relay_stat",
    "type": "select",
    "options": [
      {
        "textContent": "On",
        "value": 1
      },
      {
        "textContent": "Off",
        "value": 0
      }
    ],
    "data": [
      {
        "name": "label",
        "value": "On/Off Relay"
      },
      {
        "name": "helpInfo",
        "value": "Switch On/Off the Relay"
      },
      {
        "name": "type",
        "value": "bool"
      }
    ]
  },
  {
    "id": "ctrl_buzzer_stat",
    "name": "ctrl_buzzer_stat",
    "type": "select",
    "options": [
      {
        "textContent": "On",
        "value": 1
      },
      {
        "textContent": "Off",
        "value": 0
      }
    ],
    "data": [
      {
        "name": "label",
        "value": "On/Off Buzzer"
      },
      {
        "name": "helpInfo",
        "value": "Switch On/Off the Buzzer"
      },
      {
        "name": "type",
        "value": "bool"
      }
    ]
  }
]