1 10 20
100 200 125
201 210 89
900 1000 174
1 100 119
100 200 125
200 300 128
300 400 144
400 500 142
500 600 137
600 700 145
700 800 171
800 900 179
900 1000 174
1000 1100 169
1100 1200 182
1200 1300 177
1300 1400 177
1400 1500 172
1500 1600 167
1600 1700 180
1700 1800 180
1800 1900 175
1900 2000 175
2000 2100 157
2100 2200 170
2200 2300 183
2300 2400 183
2400 2500 209
2500 2600 178
2600 2700 191
2700 2800 173
2800 2900 173
2900 3000 217
3000 3100 186
3100 3200 199
3200 3300 168
3300 3400 181
3400 3500 181
3500 3600 194
3600 3700 207
3700 3800 238
3800 3900 176
3900 4000 189
4000 4100 189
4100 4200 189
4200 4300 202
4300 4400 215
4400 4500 184
4500 4600 184
4600 4700 184
4700 4800 197
4800 4900 179
4900 5000 210
5000 5100 179
5100 5200 179
5200 5300 192
5300 5400 192
5400 5500 192
5500 5600 236
5600 5700 205
5700 5800 205
5800 5900 218
5900 6000 187
6000 6100 187
6100 6200 262
6200 6300 187
6300 6400 200
6400 6500 169
6500 6600 244
6600 6700 182
6700 6800 182
6800 6900 182
6900 7000 257
7000 7100 195
7100 7200 195
7200 7300 177
7300 7400 208
7400 7500 239
7500 7600 208
7600 7700 177
7700 7800 221
7800 7900 190
7900 8000 252
8000 8100 190
8100 8200 190
8200 8300 190
8300 8400 234
8400 8500 203
8500 8600 203
8600 8700 203
8700 8800 216
8800 8900 185
8900 9000 247
9000 9100 185
9100 9200 198
9200 9300 260
9300 9400 198
9400 9500 198
9500 9600 198
9600 9700 185
9700 9800 198
9800 9900 242
9900 10000 180
10000 10100 224
10100 10200 180
10200 10300 242
10300 10400 224
10400 10500 255
10500 10600 193
10600 10700 255
10700 10800 193
10800 10900 206
10900 11000 268
11000 11100 206
11100 11200 237
11200 11300 206
11300 11400 206
11400 11500 175
11500 11600 237
11600 11700 219
11700 11800 175
11800 11900 188
11900 12000 250
12000 12100 188
12100 12200 250
12200 12300 188
12300 12400 263
12400 12500 201
12500 12600 263
12600 12700 201
12700 12800 201
12800 12900 170
12900 13000 201
13000 13100 201
13100 13200 245
13200 13300 276
13300 13400 183
13400 13500 245
13500 13600 245
13600 13700 183
13700 13800 214
13800 13900 258
13900 14000 183
14000 14100 196
14100 14200 152
14200 14300 196
14300 14400 196
14400 14500 209
14500 14600 183
14600 14700 271
14700 14800 209
14800 14900 240
14900 15000 209
15000 15100 271
15100 15200 222
15200 15300 178
15300 15400 240
15400 15500 209
15500 15600 222
15600 15700 253
15700 15800 191
15800 15900 222
15900 16000 253
16000 16100 235
16100 16200 191
16200 16300 204
16300 16400 191
16400 16500 266
16500 16600 191
16600 16700 235
16700 16800 266
16800 16900 204
16900 17000 204
17000 17100 217
17100 17200 235
17200 17300 235
17300 17400 204
17400 17500 204
17500 17600 248
17600 17700 279
17700 17800 186
17800 17900 217
17900 18000 248
18000 18100 186
18100 18200 186
18200 18300 248
18300 18400 199
18400 18500 230
18500 18600 261
18600 18700 186
18700 18800 230
18800 18900 261
18900 19000 230
19000 19100 199
19100 19200 199
19200 19300 212
19300 19400 186
19400 19500 199
19500 19600 274
19600 19700 199
19700 19800 243
19800 19900 274
19900 20000 212
999899 999999 259
