1 10 20
100 200 125
201 210 89
900 1000 174
100000 9000 351
302 402 144
402 502 142
502 602 137
602 702 145
702 802 171
802 902 179
902 1002 174
1002 1102 169
1102 1202 182
111 111 70
999901 998901 396
999801 998801 396
999701 998701 396
1 2 2
1 1 1
10 20 21
11 21 21
12 22 21
13 23 21
14 24 21
15 25 24
16 26 24
17 27 112
18 28 112
19 29 112
20 30 112
21 31 112
22 32 112
23 33 112
24 34 112
25 35 112
26 36 112
27 37 112
28 38 107
29 39 107
30 40 107
31 41 110
32 42 110
33 43 110
34 44 110
35 45 110
36 46 110
37 47 110
38 48 110
39 49 110
40 50 110
41 51 110
42 52 105
43 53 105
44 54 113
45 55 113
46 56 113
47 57 113
48 58 113
49 59 113
50 60 113
51 61 113
52 62 113
53 63 113
54 64 113
55 65 113
56 66 108
57 67 108
58 68 108
59 69 108
60 70 108
61 71 108
62 72 108
63 73 116
64 74 116
65 75 116
66 76 116
67 77 116
68 78 116
69 79 116
70 80 116
71 81 116
72 82 116
73 83 116
74 84 111
75 85 111
76 86 111
77 87 111
78 88 111
79 89 111
80 70 116
90 80 111
100 91 119
101 100 26
105 205 125
2000 900 182
100 98 26
1 100 119
2 200 125
3 5 8
