1 10 20
100 200 125
201 210 89
900 1000 174
10 10 7
100 5 119
200 210 89
210 220 115
220 230 115
230 240 128
240 250 110
250 260 123
260 270 123
270 280 92
280 290 118
290 300 118
300 290 118
290 280 118
280 270 92
270 260 123
260 250 123
250 240 110
240 230 128
230 220 115
220 210 115
210 200 89
1001 1001 143
1000 1000 112
1000 1010 143
1010 1020 156
1020 1030 125
1030 1040 156
1040 1050 125
1050 1060 169
1060 1070 125
1070 1080 169
1080 1090 138
1090 1100 138
1100 1090 138
1090 1080 138
1080 1070 169
1070 1060 125
1060 1050 169
1050 1040 125
1040 1030 156
1030 1020 125
1020 1010 156
1010 1000 143
1 2 2
2 3 8
3 4 8
4 5 6
5 6 9
6 7 17
7 8 17
8 9 20
9 10 20
10 9 20
9 8 20
8 7 17
7 6 17
6 5 9
5 4 6
4 3 8
3 2 8
2 1 2
1001 1100 169
1101 1200 182
1201 1300 177
1301 1400 177
1401 1500 172
1501 1600 167
1601 1700 180
1701 1800 180
1801 1900 175
1901 2000 175
2000 1900 175
1900 1800 175
1800 1700 180
1700 1600 180
1600 1500 167
1500 1400 172
1400 1300 177
1200 1100 182
1100 1000 169
1010 500 179
1005 500 179
1 1000 179
1 2000 182
1 3000 217
1 4000 238
1 5000 238
1 6000 238
1 7000 262
1 8000 262
1 9000 262
1 10000 262
1 2010 182
1 2000 182
1000 2000 182
1001 2000 182
1001 2001 182
1 4000 238
1 4001 238
100001 101000 341
100001 110000 354
101001 102000 310
102001 103000 310
103001 104000 248
104001 105000 310
100001 101002 341
100001 110002 354
101001 102002 310
102001 103002 310
103001 104002 248
104001 105002 310
1000001 1001000 427
1000000 1000000 153
827905 753943 468
698670 852879 525
342695 385270 441
199098 356976 443
628349 631884 341
1 1000001 525
2 3002 217
5 1000001 525
