1 999999 525
765432 765432 163
1 10 20
100 200 125
201 210 89
900 1000 174
2000 600 182
400 500 142
1 50 112
4 96 116
300 50000 324
45890 89453 351
34589 9085 311
43598 45 324
45925 8945 324
28945 945 308
4598 4509 184
24598 985 282
2908 2093 209
98376 873 351
20185 4575 279
34598 35 311
900 60 179
458 32485 308
39485 24859 324
34 9045 262
597604 490067 470
471516 507087 426
563976 376318 470
561294 735260 509
221194 145985 386
956093 552165 525
547709 459402 470
267894 345863 407
573418 602097 434
30852 950886 525
508755 828259 509
586706 431495 470
221214 427232 449
859380 12458 525
57617 324342 443
516766 168193 470
168502 430933 449
903560 537996 525
107035 169051 383
395318 613128 470
988604 513436 525
839125 713301 525
192563 264987 443
428866 953448 525
841667 395563 525
26169 339335 443
478919 676829 509
654657 572653 509
514376 747881 509
317886 923182 525
776839 503075 509
27148 756333 509
961993 828761 525
568315 755996 509
645734 516034 509
472160 243178 449
818106 561437 509
191660 269476 443
793661 538640 509
502446 756318 509
478410 537113 470
392384 309022 441
597534 648665 509
461450 977587 525
547931 777553 509
25466 251770 443
825657 127569 509
82407 767507 509
33713 404521 443
186066 712605 509
864818 610556 525
939172 697108 525
449016 802673 509
73065 320954 443
660056 577471 509
83769 890954 525
339735 922507 525
158795 788420 509
933435 629879 525
700781 344729 509
446443 835026 509
333305 296089 384
855148 942172 507
746946 161827 509
114093 616439 470
850074 752404 525
915071 807016 525
253394 930117 525
725352 139350 509
253647 468158 449
877258 431588 525
748883 577522 509
68412 588240 470
100579 684242 509
599784 481885 470
318100 243994 407
264951 764526 509
721267 918519 525
420665 937938 525
446886 968262 525
832986 518198 509
708461 994067 525
14473 606629 470
738990 554637 509
257439 249061 363
779295 405643 509
336667 28328 443
878687 188570 525
740695 251729 509
585959 154078 470
685282 210416 509
855118 773575 525
305792 191734 443
192577 736394 509
519243 302370 470
274589 897480 525
210861 265746 443
822529 377810 509
471324 330800 449
572277 624965 447
607085 687904 509
456543 456985 356
477466 572279 470
790380 86485 509
377776 82837 443
180885 270743 443
834149 375003 509
744794 121768 509
396430 10414 443
901456 194797 525
335267 627329 509
320184 971374 525
353263 637876 509
759356 67485 509
104735 771588 509
107944 822577 509
913720 192992 525
965415 242061 525
632683 756241 504
49657 968040 525
