...............
----------------------------------------------------------------------
Ran 15 tests in 9.336s

OK
Name             Stmts   Miss Branch BrPart  Cover   Missing
------------------------------------------------------------
Collatz.py          52      0     16      0   100%
TestCollatz.py      66      0      0      0   100%
------------------------------------------------------------
TOTAL              118      0     16      0   100%
